[Date Prev][Date Next][Thread Prev][Thread Next][Date Index][Thread Index] [List Home]
[pdt-dev] [Hudson] Build failed in Hudson: pdt-master #109

See <https://hudson.eclipse.org/hudson/job/pdt-master/109/>

------------------------------------------
[...truncated 352 lines...]
Downloaded: http://repo1.maven.org/maven2/org/eclipse/tycho/org.eclipse.tycho.p2.tools.shared/0.14.0/org.eclipse.tycho.p2.tools.shared-0.14.0.jar (14 KB at 77.1 KB/sec)
[WARNING] 
[WARNING] Some problems were encountered while building the effective model for org.eclipse.php:org.eclipse.php.repository:eclipse-repository:3.2.0-SNAPSHOT
[WARNING] 'build.plugins.plugin.version' for org.eclipse.tycho:tycho-packaging-plugin is missing. @ line 19, column 12
[WARNING] 
[WARNING] Some problems were encountered while building the effective model for org.eclipse.php:org.eclipse.php.formatter.core.tests:eclipse-test-plugin:3.2.0-SNAPSHOT
[WARNING] 'build.plugins.plugin.version' for org.eclipse.tycho:tycho-surefire-plugin is missing. @ line 18, column 12
[WARNING] 
[WARNING] It is highly recommended to fix these problems because they threaten the stability of your build.
[WARNING] 
[WARNING] For this reason, future Maven versions might no longer support building such malformed projects.
[WARNING] 
[WARNING] No explicit target runtime environment configuration. Build is platform dependent.
Downloading: http://maven.eclipse.org/nexus/content/groups/public/org/eclipse/tycho/tycho-bundles-external/0.14.0/tycho-bundles-external-0.14.0.zip
Downloading: http://repository.jboss.org/nexus/content/groups/public/org/eclipse/tycho/tycho-bundles-external/0.14.0/tycho-bundles-external-0.14.0.zip
Downloading: https://repository.jboss.org/nexus/content/repositories/snapshots/org/eclipse/tycho/tycho-bundles-external/0.14.0/tycho-bundles-external-0.14.0.zip
Downloading: http://repo1.maven.org/maven2/org/eclipse/tycho/tycho-bundles-external/0.14.0/tycho-bundles-external-0.14.0.zip
Downloaded: http://repo1.maven.org/maven2/org/eclipse/tycho/tycho-bundles-external/0.14.0/tycho-bundles-external-0.14.0.zip (5452 KB at 3303.8 KB/sec)
Downloading: http://maven.eclipse.org/nexus/content/groups/public/org/eclipse/tycho/org.eclipse.tycho.p2.resolver.impl/0.14.0/org.eclipse.tycho.p2.resolver.impl-0.14.0.jar
Downloading: http://repository.jboss.org/nexus/content/groups/public/org/eclipse/tycho/org.eclipse.tycho.p2.resolver.impl/0.14.0/org.eclipse.tycho.p2.resolver.impl-0.14.0.jar
Downloading: https://repository.jboss.org/nexus/content/repositories/snapshots/org/eclipse/tycho/org.eclipse.tycho.p2.resolver.impl/0.14.0/org.eclipse.tycho.p2.resolver.impl-0.14.0.jar
Downloading: http://repo1.maven.org/maven2/org/eclipse/tycho/org.eclipse.tycho.p2.resolver.impl/0.14.0/org.eclipse.tycho.p2.resolver.impl-0.14.0.jar
Downloaded: http://repo1.maven.org/maven2/org/eclipse/tycho/org.eclipse.tycho.p2.resolver.impl/0.14.0/org.eclipse.tycho.p2.resolver.impl-0.14.0.jar (150 KB at 494.7 KB/sec)
Downloading: http://maven.eclipse.org/nexus/content/groups/public/org/eclipse/tycho/org.eclipse.tycho.p2.maven.repository/0.14.0/org.eclipse.tycho.p2.maven.repository-0.14.0.jar
Downloading: http://repository.jboss.org/nexus/content/groups/public/org/eclipse/tycho/org.eclipse.tycho.p2.maven.repository/0.14.0/org.eclipse.tycho.p2.maven.repository-0.14.0.jar
Downloading: https://repository.jboss.org/nexus/content/repositories/snapshots/org/eclipse/tycho/org.eclipse.tycho.p2.maven.repository/0.14.0/org.eclipse.tycho.p2.maven.repository-0.14.0.jar
Downloading: http://repo1.maven.org/maven2/org/eclipse/tycho/org.eclipse.tycho.p2.maven.repository/0.14.0/org.eclipse.tycho.p2.maven.repository-0.14.0.jar
Downloaded: http://repo1.maven.org/maven2/org/eclipse/tycho/org.eclipse.tycho.p2.maven.repository/0.14.0/org.eclipse.tycho.p2.maven.repository-0.14.0.jar (68 KB at 318.0 KB/sec)
Downloading: http://maven.eclipse.org/nexus/content/groups/public/org/eclipse/tycho/org.eclipse.tycho.p2.tools.impl/0.14.0/org.eclipse.tycho.p2.tools.impl-0.14.0.jar
Downloading: http://repository.jboss.org/nexus/content/groups/public/org/eclipse/tycho/org.eclipse.tycho.p2.tools.impl/0.14.0/org.eclipse.tycho.p2.tools.impl-0.14.0.jar
Downloading: https://repository.jboss.org/nexus/content/repositories/snapshots/org/eclipse/tycho/org.eclipse.tycho.p2.tools.impl/0.14.0/org.eclipse.tycho.p2.tools.impl-0.14.0.jar
Downloading: http://repo1.maven.org/maven2/org/eclipse/tycho/org.eclipse.tycho.p2.tools.impl/0.14.0/org.eclipse.tycho.p2.tools.impl-0.14.0.jar
Downloaded: http://repo1.maven.org/maven2/org/eclipse/tycho/org.eclipse.tycho.p2.tools.impl/0.14.0/org.eclipse.tycho.p2.tools.impl-0.14.0.jar (26 KB at 140.8 KB/sec)
Downloading: http://maven.eclipse.org/nexus/content/groups/public/org/eclipse/tycho/tycho-source-plugin/0.14.0/tycho-source-plugin-0.14.0.pom
Downloading: http://repository.jboss.org/nexus/content/groups/public/org/eclipse/tycho/tycho-source-plugin/0.14.0/tycho-source-plugin-0.14.0.pom
Downloading: https://repository.jboss.org/nexus/content/repositories/snapshots/org/eclipse/tycho/tycho-source-plugin/0.14.0/tycho-source-plugin-0.14.0.pom
Downloading: http://repo1.maven.org/maven2/org/eclipse/tycho/tycho-source-plugin/0.14.0/tycho-source-plugin-0.14.0.pom
Downloaded: http://repo1.maven.org/maven2/org/eclipse/tycho/tycho-source-plugin/0.14.0/tycho-source-plugin-0.14.0.pom (3 KB at 16.3 KB/sec)
Downloading: http://maven.eclipse.org/nexus/content/groups/public/org/eclipse/tycho/tycho-source-plugin/0.14.0/tycho-source-plugin-0.14.0.jar
Downloading: http://repository.jboss.org/nexus/content/groups/public/org/eclipse/tycho/tycho-source-plugin/0.14.0/tycho-source-plugin-0.14.0.jar
Downloading: https://repository.jboss.org/nexus/content/repositories/snapshots/org/eclipse/tycho/tycho-source-plugin/0.14.0/tycho-source-plugin-0.14.0.jar
Downloading: http://repo1.maven.org/maven2/org/eclipse/tycho/tycho-source-plugin/0.14.0/tycho-source-plugin-0.14.0.jar
Downloaded: http://repo1.maven.org/maven2/org/eclipse/tycho/tycho-source-plugin/0.14.0/tycho-source-plugin-0.14.0.jar (16 KB at 8.5 KB/sec)
Downloading: http://maven.eclipse.org/nexus/content/groups/public/org/apache/maven/plugins/maven-source-plugin/2.1/maven-source-plugin-2.1.pom
Downloading: http://repository.jboss.org/nexus/content/groups/public/org/apache/maven/plugins/maven-source-plugin/2.1/maven-source-plugin-2.1.pom
Downloading: https://repository.jboss.org/nexus/content/repositories/snapshots/org/apache/maven/plugins/maven-source-plugin/2.1/maven-source-plugin-2.1.pom
Downloading: http://repo1.maven.org/maven2/org/apache/maven/plugins/maven-source-plugin/2.1/maven-source-plugin-2.1.pom
Downloaded: http://repo1.maven.org/maven2/org/apache/maven/plugins/maven-source-plugin/2.1/maven-source-plugin-2.1.pom (5 KB at 46.2 KB/sec)
Downloading: http://maven.eclipse.org/nexus/content/groups/public/org/apache/maven/plugins/maven-plugins/13/maven-plugins-13.pom
Downloading: http://repository.jboss.org/nexus/content/groups/public/org/apache/maven/plugins/maven-plugins/13/maven-plugins-13.pom
Downloading: https://repository.jboss.org/nexus/content/repositories/snapshots/org/apache/maven/plugins/maven-plugins/13/maven-plugins-13.pom
Downloading: http://repo1.maven.org/maven2/org/apache/maven/plugins/maven-plugins/13/maven-plugins-13.pom
Downloaded: http://repo1.maven.org/maven2/org/apache/maven/plugins/maven-plugins/13/maven-plugins-13.pom (12 KB at 80.5 KB/sec)
Downloading: http://maven.eclipse.org/nexus/content/groups/public/org/apache/maven/maven-parent/11/maven-parent-11.pom
Downloading: http://repository.jboss.org/nexus/content/groups/public/org/apache/maven/maven-parent/11/maven-parent-11.pom
[WARNING] Checksum validation failed, no checksums available from the repository for http://repository.jboss.org/nexus/content/groups/public/org/apache/maven/maven-parent/11/maven-parent-11.pom
Downloaded: http://repository.jboss.org/nexus/content/groups/public/org/apache/maven/maven-parent/11/maven-parent-11.pom (32 KB at 27.1 KB/sec)
Downloading: http://maven.eclipse.org/nexus/content/groups/public/org/apache/apache/5/apache-5.pom
Downloading: http://repository.jboss.org/nexus/content/groups/public/org/apache/apache/5/apache-5.pom
[WARNING] Checksum validation failed, no checksums available from the repository for http://repository.jboss.org/nexus/content/groups/public/org/apache/apache/5/apache-5.pom
Downloaded: http://repository.jboss.org/nexus/content/groups/public/org/apache/apache/5/apache-5.pom (5 KB at 4.1 KB/sec)
Downloading: http://maven.eclipse.org/nexus/content/groups/public/org/apache/maven/maven-archiver/2.4/maven-archiver-2.4.pom
Downloading: http://repository.jboss.org/nexus/content/groups/public/org/apache/maven/maven-archiver/2.4/maven-archiver-2.4.pom
[WARNING] Checksum validation failed, no checksums available from the repository for http://repository.jboss.org/nexus/content/groups/public/org/apache/maven/maven-archiver/2.4/maven-archiver-2.4.pom
Downloaded: http://repository.jboss.org/nexus/content/groups/public/org/apache/maven/maven-archiver/2.4/maven-archiver-2.4.pom (4 KB at 3.5 KB/sec)
Downloading: http://maven.eclipse.org/nexus/content/groups/public/org/apache/maven/shared/maven-shared-components/10/maven-shared-components-10.pom
Downloading: http://repository.jboss.org/nexus/content/groups/public/org/apache/maven/shared/maven-shared-components/10/maven-shared-components-10.pom
[WARNING] Checksum validation failed, no checksums available from the repository for http://repository.jboss.org/nexus/content/groups/public/org/apache/maven/shared/maven-shared-components/10/maven-shared-components-10.pom
Downloaded: http://repository.jboss.org/nexus/content/groups/public/org/apache/maven/shared/maven-shared-components/10/maven-shared-components-10.pom (9 KB at 8.1 KB/sec)
Downloading: http://maven.eclipse.org/nexus/content/groups/public/org/apache/maven/maven-parent/9/maven-parent-9.pom
Downloading: http://repository.jboss.org/nexus/content/groups/public/org/apache/maven/maven-parent/9/maven-parent-9.pom
[WARNING] Checksum validation failed, no checksums available from the repository for http://repository.jboss.org/nexus/content/groups/public/org/apache/maven/maven-parent/9/maven-parent-9.pom
Downloaded: http://repository.jboss.org/nexus/content/groups/public/org/apache/maven/maven-parent/9/maven-parent-9.pom (33 KB at 30.9 KB/sec)
Downloading: http://maven.eclipse.org/nexus/content/groups/public/org/apache/apache/4/apache-4.pom
Downloading: http://repository.jboss.org/nexus/content/groups/public/org/apache/apache/4/apache-4.pom
[WARNING] Checksum validation failed, no checksums available from the repository for http://repository.jboss.org/nexus/content/groups/public/org/apache/apache/4/apache-4.pom
Downloaded: http://repository.jboss.org/nexus/content/groups/public/org/apache/apache/4/apache-4.pom (5 KB at 2.1 KB/sec)
Downloading: http://maven.eclipse.org/nexus/content/groups/public/org/codehaus/plexus/plexus-interpolation/1.6/plexus-interpolation-1.6.pom
Downloading: http://repository.jboss.org/nexus/content/groups/public/org/codehaus/plexus/plexus-interpolation/1.6/plexus-interpolation-1.6.pom
Downloaded: http://repository.jboss.org/nexus/content/groups/public/org/codehaus/plexus/plexus-interpolation/1.6/plexus-interpolation-1.6.pom (3 KB at 4.2 KB/sec)
Downloading: http://maven.eclipse.org/nexus/content/groups/public/org/codehaus/plexus/plexus/1.0.11/plexus-1.0.11.pom
Downloading: http://repository.jboss.org/nexus/content/groups/public/org/codehaus/plexus/plexus/1.0.11/plexus-1.0.11.pom
Downloaded: http://repository.jboss.org/nexus/content/groups/public/org/codehaus/plexus/plexus/1.0.11/plexus-1.0.11.pom (9 KB at 12.7 KB/sec)
Downloading: http://maven.eclipse.org/nexus/content/groups/public/org/eclipse/tycho/tycho-packaging-plugin/0.14.0/tycho-packaging-plugin-0.14.0.pom
Downloading: http://repository.jboss.org/nexus/content/groups/public/org/eclipse/tycho/tycho-packaging-plugin/0.14.0/tycho-packaging-plugin-0.14.0.pom
Downloading: https://repository.jboss.org/nexus/content/repositories/snapshots/org/eclipse/tycho/tycho-packaging-plugin/0.14.0/tycho-packaging-plugin-0.14.0.pom
Downloading: http://repo1.maven.org/maven2/org/eclipse/tycho/tycho-packaging-plugin/0.14.0/tycho-packaging-plugin-0.14.0.pom
Downloaded: http://repo1.maven.org/maven2/org/eclipse/tycho/tycho-packaging-plugin/0.14.0/tycho-packaging-plugin-0.14.0.pom (3 KB at 9.5 KB/sec)
Downloading: http://maven.eclipse.org/nexus/content/groups/public/org/apache/maven/plugins/maven-source-plugin/2.1/maven-source-plugin-2.1.jar
Downloading: http://maven.eclipse.org/nexus/content/groups/public/org/apache/maven/maven-archiver/2.4/maven-archiver-2.4.jar
Downloading: http://maven.eclipse.org/nexus/content/groups/public/org/eclipse/tycho/tycho-packaging-plugin/0.14.0/tycho-packaging-plugin-0.14.0.jar
Downloading: http://repository.jboss.org/nexus/content/groups/public/org/apache/maven/plugins/maven-source-plugin/2.1/maven-source-plugin-2.1.jar
Downloading: http://repository.jboss.org/nexus/content/groups/public/org/apache/maven/maven-archiver/2.4/maven-archiver-2.4.jar
Downloading: http://repository.jboss.org/nexus/content/groups/public/org/eclipse/tycho/tycho-packaging-plugin/0.14.0/tycho-packaging-plugin-0.14.0.jar
[WARNING] Checksum validation failed, no checksums available from the repository for http://repository.jboss.org/nexus/content/groups/public/org/apache/maven/maven-archiver/2.4/maven-archiver-2.4.jar
Downloaded: http://repository.jboss.org/nexus/content/groups/public/org/apache/maven/maven-archiver/2.4/maven-archiver-2.4.jar (20 KB at 16.9 KB/sec)
Downloading: https://repository.jboss.org/nexus/content/repositories/snapshots/org/apache/maven/plugins/maven-source-plugin/2.1/maven-source-plugin-2.1.jar
Downloading: https://repository.jboss.org/nexus/content/repositories/snapshots/org/eclipse/tycho/tycho-packaging-plugin/0.14.0/tycho-packaging-plugin-0.14.0.jar
Downloading: http://repo1.maven.org/maven2/org/apache/maven/plugins/maven-source-plugin/2.1/maven-source-plugin-2.1.jar
Downloading: http://repo1.maven.org/maven2/org/eclipse/tycho/tycho-packaging-plugin/0.14.0/tycho-packaging-plugin-0.14.0.jar
Downloaded: http://repo1.maven.org/maven2/org/apache/maven/plugins/maven-source-plugin/2.1/maven-source-plugin-2.1.jar (24 KB at 176.3 KB/sec)
Downloaded: http://repo1.maven.org/maven2/org/eclipse/tycho/tycho-packaging-plugin/0.14.0/tycho-packaging-plugin-0.14.0.jar (95 KB at 346.7 KB/sec)
Downloading: http://maven.eclipse.org/nexus/content/groups/public/org/apache/maven/plugins/maven-clean-plugin/2.4.1/maven-clean-plugin-2.4.1.pom
Downloading: http://repository.jboss.org/nexus/content/groups/public/org/apache/maven/plugins/maven-clean-plugin/2.4.1/maven-clean-plugin-2.4.1.pom
[WARNING] Checksum validation failed, no checksums available from the repository for http://repository.jboss.org/nexus/content/groups/public/org/apache/maven/plugins/maven-clean-plugin/2.4.1/maven-clean-plugin-2.4.1.pom
Downloaded: http://repository.jboss.org/nexus/content/groups/public/org/apache/maven/plugins/maven-clean-plugin/2.4.1/maven-clean-plugin-2.4.1.pom (5 KB at 3.9 KB/sec)
Downloading: http://maven.eclipse.org/nexus/content/groups/public/org/apache/maven/plugins/maven-plugins/18/maven-plugins-18.pom
Downloading: http://repository.jboss.org/nexus/content/groups/public/org/apache/maven/plugins/maven-plugins/18/maven-plugins-18.pom
[WARNING] Checksum validation failed, no checksums available from the repository for http://repository.jboss.org/nexus/content/groups/public/org/apache/maven/plugins/maven-plugins/18/maven-plugins-18.pom
Downloaded: http://repository.jboss.org/nexus/content/groups/public/org/apache/maven/plugins/maven-plugins/18/maven-plugins-18.pom (13 KB at 11.9 KB/sec)
Downloading: http://maven.eclipse.org/nexus/content/groups/public/org/apache/maven/maven-parent/16/maven-parent-16.pom
Downloading: http://repository.jboss.org/nexus/content/groups/public/org/apache/maven/maven-parent/16/maven-parent-16.pom
[WARNING] Checksum validation failed, no checksums available from the repository for http://repository.jboss.org/nexus/content/groups/public/org/apache/maven/maven-parent/16/maven-parent-16.pom
Downloaded: http://repository.jboss.org/nexus/content/groups/public/org/apache/maven/maven-parent/16/maven-parent-16.pom (23 KB at 19.9 KB/sec)
Downloading: http://maven.eclipse.org/nexus/content/groups/public/org/apache/apache/7/apache-7.pom
Downloading: http://repository.jboss.org/nexus/content/groups/public/org/apache/apache/7/apache-7.pom
[WARNING] Checksum validation failed, no checksums available from the repository for http://repository.jboss.org/nexus/content/groups/public/org/apache/apache/7/apache-7.pom
Downloaded: http://repository.jboss.org/nexus/content/groups/public/org/apache/apache/7/apache-7.pom (15 KB at 12.7 KB/sec)
Downloading: http://maven.eclipse.org/nexus/content/groups/public/org/apache/maven/plugins/maven-clean-plugin/2.4.1/maven-clean-plugin-2.4.1.jar
Downloading: http://repository.jboss.org/nexus/content/groups/public/org/apache/maven/plugins/maven-clean-plugin/2.4.1/maven-clean-plugin-2.4.1.jar
[WARNING] Checksum validation failed, no checksums available from the repository for http://repository.jboss.org/nexus/content/groups/public/org/apache/maven/plugins/maven-clean-plugin/2.4.1/maven-clean-plugin-2.4.1.jar
Downloaded: http://repository.jboss.org/nexus/content/groups/public/org/apache/maven/plugins/maven-clean-plugin/2.4.1/maven-clean-plugin-2.4.1.jar (23 KB at 19.3 KB/sec)
Downloading: http://maven.eclipse.org/nexus/content/groups/public/org/apache/maven/plugins/maven-install-plugin/2.3.1/maven-install-plugin-2.3.1.pom
Downloading: http://repository.jboss.org/nexus/content/groups/public/org/apache/maven/plugins/maven-install-plugin/2.3.1/maven-install-plugin-2.3.1.pom
[WARNING] Checksum validation failed, no checksums available from the repository for http://repository.jboss.org/nexus/content/groups/public/org/apache/maven/plugins/maven-install-plugin/2.3.1/maven-install-plugin-2.3.1.pom
Downloaded: http://repository.jboss.org/nexus/content/groups/public/org/apache/maven/plugins/maven-install-plugin/2.3.1/maven-install-plugin-2.3.1.pom (5 KB at 4.6 KB/sec)
Downloading: http://maven.eclipse.org/nexus/content/groups/public/org/apache/maven/plugins/maven-install-plugin/2.3.1/maven-install-plugin-2.3.1.jar
Downloading: http://repository.jboss.org/nexus/content/groups/public/org/apache/maven/plugins/maven-install-plugin/2.3.1/maven-install-plugin-2.3.1.jar
[WARNING] Checksum validation failed, no checksums available from the repository for http://repository.jboss.org/nexus/content/groups/public/org/apache/maven/plugins/maven-install-plugin/2.3.1/maven-install-plugin-2.3.1.jar
Downloaded: http://repository.jboss.org/nexus/content/groups/public/org/apache/maven/plugins/maven-install-plugin/2.3.1/maven-install-plugin-2.3.1.jar (23 KB at 19.8 KB/sec)
Downloading: http://maven.eclipse.org/nexus/content/groups/public/org/eclipse/tycho/tycho-p2-plugin/0.14.0/tycho-p2-plugin-0.14.0.pom
Downloading: http://repository.jboss.org/nexus/content/groups/public/org/eclipse/tycho/tycho-p2-plugin/0.14.0/tycho-p2-plugin-0.14.0.pom
Downloading: https://repository.jboss.org/nexus/content/repositories/snapshots/org/eclipse/tycho/tycho-p2-plugin/0.14.0/tycho-p2-plugin-0.14.0.pom
Downloading: http://repo1.maven.org/maven2/org/eclipse/tycho/tycho-p2-plugin/0.14.0/tycho-p2-plugin-0.14.0.pom
Downloaded: http://repo1.maven.org/maven2/org/eclipse/tycho/tycho-p2-plugin/0.14.0/tycho-p2-plugin-0.14.0.pom (2 KB at 7.3 KB/sec)
Downloading: http://maven.eclipse.org/nexus/content/groups/public/org/eclipse/tycho/tycho-p2-plugin/0.14.0/tycho-p2-plugin-0.14.0.jar
Downloading: http://repository.jboss.org/nexus/content/groups/public/org/eclipse/tycho/tycho-p2-plugin/0.14.0/tycho-p2-plugin-0.14.0.jar
Downloading: https://repository.jboss.org/nexus/content/repositories/snapshots/org/eclipse/tycho/tycho-p2-plugin/0.14.0/tycho-p2-plugin-0.14.0.jar
Downloading: http://repo1.maven.org/maven2/org/eclipse/tycho/tycho-p2-plugin/0.14.0/tycho-p2-plugin-0.14.0.jar
Downloaded: http://repo1.maven.org/maven2/org/eclipse/tycho/tycho-p2-plugin/0.14.0/tycho-p2-plugin-0.14.0.jar (13 KB at 70.6 KB/sec)
Downloading: http://maven.eclipse.org/nexus/content/groups/public/org/eclipse/tycho/sisu-equinox-launching/0.14.0/sisu-equinox-launching-0.14.0.pom
Downloading: http://repository.jboss.org/nexus/content/groups/public/org/eclipse/tycho/sisu-equinox-launching/0.14.0/sisu-equinox-launching-0.14.0.pom
Downloading: https://repository.jboss.org/nexus/content/repositories/snapshots/org/eclipse/tycho/sisu-equinox-launching/0.14.0/sisu-equinox-launching-0.14.0.pom
Downloading: http://repo1.maven.org/maven2/org/eclipse/tycho/sisu-equinox-launching/0.14.0/sisu-equinox-launching-0.14.0.pom
Downloaded: http://repo1.maven.org/maven2/org/eclipse/tycho/sisu-equinox-launching/0.14.0/sisu-equinox-launching-0.14.0.pom (3 KB at 16.4 KB/sec)
Downloading: http://maven.eclipse.org/nexus/content/groups/public/org/eclipse/tycho/sisu-equinox-launching/0.14.0/sisu-equinox-launching-0.14.0.jar
Downloading: http://repository.jboss.org/nexus/content/groups/public/org/eclipse/tycho/sisu-equinox-launching/0.14.0/sisu-equinox-launching-0.14.0.jar
Downloading: https://repository.jboss.org/nexus/content/repositories/snapshots/org/eclipse/tycho/sisu-equinox-launching/0.14.0/sisu-equinox-launching-0.14.0.jar
Downloading: http://repo1.maven.org/maven2/org/eclipse/tycho/sisu-equinox-launching/0.14.0/sisu-equinox-launching-0.14.0.jar
Downloaded: http://repo1.maven.org/maven2/org/eclipse/tycho/sisu-equinox-launching/0.14.0/sisu-equinox-launching-0.14.0.jar (24 KB at 140.1 KB/sec)
Downloading: http://maven.eclipse.org/nexus/content/groups/public/org/apache/maven/plugins/maven-deploy-plugin/2.5/maven-deploy-plugin-2.5.pom
Downloading: http://repository.jboss.org/nexus/content/groups/public/org/apache/maven/plugins/maven-deploy-plugin/2.5/maven-deploy-plugin-2.5.pom
Downloading: https://repository.jboss.org/nexus/content/repositories/snapshots/org/apache/maven/plugins/maven-deploy-plugin/2.5/maven-deploy-plugin-2.5.pom
Downloading: http://repo1.maven.org/maven2/org/apache/maven/plugins/maven-deploy-plugin/2.5/maven-deploy-plugin-2.5.pom
Downloaded: http://repo1.maven.org/maven2/org/apache/maven/plugins/maven-deploy-plugin/2.5/maven-deploy-plugin-2.5.pom (6 KB at 54.6 KB/sec)
Downloading: http://maven.eclipse.org/nexus/content/groups/public/org/apache/maven/plugins/maven-plugins/16/maven-plugins-16.pom
Downloading: http://repository.jboss.org/nexus/content/groups/public/org/apache/maven/plugins/maven-plugins/16/maven-plugins-16.pom
Downloading: https://repository.jboss.org/nexus/content/repositories/snapshots/org/apache/maven/plugins/maven-plugins/16/maven-plugins-16.pom
Downloading: http://repo1.maven.org/maven2/org/apache/maven/plugins/maven-plugins/16/maven-plugins-16.pom
Downloaded: http://repo1.maven.org/maven2/org/apache/maven/plugins/maven-plugins/16/maven-plugins-16.pom (13 KB at 122.8 KB/sec)
Downloading: http://maven.eclipse.org/nexus/content/groups/public/org/apache/maven/plugins/maven-deploy-plugin/2.5/maven-deploy-plugin-2.5.jar
Downloading: http://repository.jboss.org/nexus/content/groups/public/org/apache/maven/plugins/maven-deploy-plugin/2.5/maven-deploy-plugin-2.5.jar
Downloading: https://repository.jboss.org/nexus/content/repositories/snapshots/org/apache/maven/plugins/maven-deploy-plugin/2.5/maven-deploy-plugin-2.5.jar
Downloading: http://repo1.maven.org/maven2/org/apache/maven/plugins/maven-deploy-plugin/2.5/maven-deploy-plugin-2.5.jar
Downloaded: http://repo1.maven.org/maven2/org/apache/maven/plugins/maven-deploy-plugin/2.5/maven-deploy-plugin-2.5.jar (23 KB at 138.3 KB/sec)
Downloading: http://maven.eclipse.org/nexus/content/groups/public/org/apache/maven/plugins/maven-site-plugin/2.0.1/maven-site-plugin-2.0.1.pom
Downloading: http://repository.jboss.org/nexus/content/groups/public/org/apache/maven/plugins/maven-site-plugin/2.0.1/maven-site-plugin-2.0.1.pom
Downloading: https://repository.jboss.org/nexus/content/repositories/snapshots/org/apache/maven/plugins/maven-site-plugin/2.0.1/maven-site-plugin-2.0.1.pom
Downloading: http://repo1.maven.org/maven2/org/apache/maven/plugins/maven-site-plugin/2.0.1/maven-site-plugin-2.0.1.pom
Downloaded: http://repo1.maven.org/maven2/org/apache/maven/plugins/maven-site-plugin/2.0.1/maven-site-plugin-2.0.1.pom (14 KB at 127.3 KB/sec)
Downloading: http://maven.eclipse.org/nexus/content/groups/public/org/apache/maven/plugins/maven-site-plugin/2.0.1/maven-site-plugin-2.0.1.jar
Downloading: http://repository.jboss.org/nexus/content/groups/public/org/apache/maven/plugins/maven-site-plugin/2.0.1/maven-site-plugin-2.0.1.jar
Downloading: https://repository.jboss.org/nexus/content/repositories/snapshots/org/apache/maven/plugins/maven-site-plugin/2.0.1/maven-site-plugin-2.0.1.jar
Downloading: http://repo1.maven.org/maven2/org/apache/maven/plugins/maven-site-plugin/2.0.1/maven-site-plugin-2.0.1.jar
Downloaded: http://repo1.maven.org/maven2/org/apache/maven/plugins/maven-site-plugin/2.0.1/maven-site-plugin-2.0.1.jar (79 KB at 444.3 KB/sec)
[WARNING] No explicit target runtime environment configuration. Build is platform dependent.
Downloading: http://maven.eclipse.org/nexus/content/groups/public/org/jboss/tools/tycho-plugins/repository-utils/0.16.0-SNAPSHOT/maven-metadata.xml
Downloading: https://repository.jboss.org/nexus/content/repositories/snapshots/org/jboss/tools/tycho-plugins/repository-utils/0.16.0-SNAPSHOT/maven-metadata.xml
Downloading: http://repository.jboss.org/nexus/content/groups/public/org/jboss/tools/tycho-plugins/repository-utils/0.16.0-SNAPSHOT/maven-metadata.xml
Downloading: http://maven.eclipse.org/nexus/content/groups/public/org/jboss/tools/tycho-plugins/repository-utils/0.16.0-SNAPSHOT/repository-utils-0.16.0-SNAPSHOT.pom
Downloading: http://repository.jboss.org/nexus/content/groups/public/org/jboss/tools/tycho-plugins/repository-utils/0.16.0-SNAPSHOT/repository-utils-0.16.0-SNAPSHOT.pom
Downloading: https://repository.jboss.org/nexus/content/repositories/snapshots/org/jboss/tools/tycho-plugins/repository-utils/0.16.0-SNAPSHOT/repository-utils-0.16.0-SNAPSHOT.pom
[WARNING] The POM for org.jboss.tools.tycho-plugins:repository-utils:jar:0.16.0-SNAPSHOT is missing, no dependency information available
[INFO] o.h.m.e.h.MavenExecutionResultHandler - Build failed with exception(s)
[INFO] o.h.m.e.h.MavenExecutionResultHandler - [1] org.apache.maven.InternalErrorException: Internal error: java.lang.RuntimeException: org.apache.maven.MavenExecutionException: Could not setup plugin ClassRealm
[DEBUG] Closing connection to remote
[ERROR] Internal error: java.lang.RuntimeException: org.apache.maven.MavenExecutionException: Could not setup plugin ClassRealm: Plugin org.jboss.tools.tycho-plugins:repository-utils:0.16.0-SNAPSHOT or one of its dependencies could not be resolved: Failed to read artifact descriptor for org.jboss.tools.tycho-plugins:repository-utils:jar:0.16.0-SNAPSHOT: Could not find artifact org.jboss.tools.tycho-plugins:repository-utils:pom:0.16.0-SNAPSHOT in maven.eclipse.org (http://maven.eclipse.org/nexus/content/groups/public/) -> [Help 1]
org.apache.maven.InternalErrorException: Internal error: java.lang.RuntimeException: org.apache.maven.MavenExecutionException: Could not setup plugin ClassRealm
	at org.apache.maven.DefaultMaven.execute(DefaultMaven.java:168)
	at org.apache.maven.cli.MavenCli.execute(MavenCli.java:537)
	at org.apache.maven.cli.MavenCli.doMain(MavenCli.java:196)
	at org.apache.maven.cli.MavenCli.main(MavenCli.java:141)
	at sun.reflect.NativeMethodAccessorImpl.invoke0(Native Method)
	at sun.reflect.NativeMethodAccessorImpl.invoke(NativeMethodAccessorImpl.java:39)
	at sun.reflect.DelegatingMethodAccessorImpl.invoke(DelegatingMethodAccessorImpl.java:25)
	at java.lang.reflect.Method.invoke(Method.java:597)
	at org.codehaus.plexus.classworlds.launcher.Launcher.launchEnhanced(Launcher.java:290)
	at org.codehaus.plexus.classworlds.launcher.Launcher.launch(Launcher.java:230)
	at org.codehaus.plexus.classworlds.launcher.Launcher.mainWithExitCode(Launcher.java:409)
	at org.codehaus.plexus.classworlds.launcher.Launcher.main(Launcher.java:352)
Caused by: java.lang.RuntimeException: org.apache.maven.MavenExecutionException: Could not setup plugin ClassRealm
	at org.eclipse.tycho.p2.resolver.P2TargetPlatformResolver.getDependencyMetadata(P2TargetPlatformResolver.java:178)
	at org.eclipse.tycho.p2.resolver.P2TargetPlatformResolver.setupProjects(P2TargetPlatformResolver.java:140)
	at org.eclipse.tycho.core.resolver.DefaultTychoDependencyResolver.setupProject(DefaultTychoDependencyResolver.java:76)
	at org.eclipse.tycho.core.maven.TychoMavenLifecycleParticipant.afterProjectsRead(TychoMavenLifecycleParticipant.java:56)
	at org.apache.maven.DefaultMaven.doExecute(DefaultMaven.java:273)
	at org.apache.maven.DefaultMaven.execute(DefaultMaven.java:156)
	... 11 more
Caused by: org.apache.maven.MavenExecutionException: Could not setup plugin ClassRealm
	at org.eclipse.tycho.core.maven.utils.PluginRealmHelper.newMavenExecutionException(PluginRealmHelper.java:134)
	at org.eclipse.tycho.core.maven.utils.PluginRealmHelper.execute(PluginRealmHelper.java:123)
	at org.eclipse.tycho.p2.resolver.P2TargetPlatformResolver.getDependencyMetadata(P2TargetPlatformResolver.java:158)
	... 16 more
Caused by: org.apache.maven.plugin.PluginResolutionException: Plugin org.jboss.tools.tycho-plugins:repository-utils:0.16.0-SNAPSHOT or one of its dependencies could not be resolved: Failed to read artifact descriptor for org.jboss.tools.tycho-plugins:repository-utils:jar:0.16.0-SNAPSHOT
	at org.apache.maven.plugin.internal.DefaultPluginDependenciesResolver.resolve(DefaultPluginDependenciesResolver.java:129)
	at org.apache.maven.plugin.internal.DefaultMavenPluginManager.getPluginDescriptor(DefaultMavenPluginManager.java:142)
	at org.eclipse.tycho.core.maven.utils.PluginRealmHelper.execute(PluginRealmHelper.java:86)
	... 17 more
Caused by: org.sonatype.aether.resolution.ArtifactDescriptorException: Failed to read artifact descriptor for org.jboss.tools.tycho-plugins:repository-utils:jar:0.16.0-SNAPSHOT
	at org.apache.maven.repository.internal.DefaultArtifactDescriptorReader.loadPom(DefaultArtifactDescriptorReader.java:282)
	at org.apache.maven.repository.internal.DefaultArtifactDescriptorReader.readArtifactDescriptor(DefaultArtifactDescriptorReader.java:172)
	at org.sonatype.aether.impl.internal.DefaultRepositorySystem.readArtifactDescriptor(DefaultRepositorySystem.java:316)
	at org.apache.maven.plugin.internal.DefaultPluginDependenciesResolver.resolve(DefaultPluginDependenciesResolver.java:115)
	... 19 more
Caused by: org.sonatype.aether.resolution.ArtifactResolutionException: Could not find artifact org.jboss.tools.tycho-plugins:repository-utils:pom:0.16.0-SNAPSHOT in maven.eclipse.org (http://maven.eclipse.org/nexus/content/groups/public/)
	at org.sonatype.aether.impl.internal.DefaultArtifactResolver.resolve(DefaultArtifactResolver.java:541)
	at org.sonatype.aether.impl.internal.DefaultArtifactResolver.resolveArtifacts(DefaultArtifactResolver.java:220)
	at org.sonatype.aether.impl.internal.DefaultArtifactResolver.resolveArtifact(DefaultArtifactResolver.java:197)
	at org.apache.maven.repository.internal.DefaultArtifactDescriptorReader.loadPom(DefaultArtifactDescriptorReader.java:267)
	... 22 more
Caused by: org.sonatype.aether.transfer.ArtifactNotFoundException: Could not find artifact org.jboss.tools.tycho-plugins:repository-utils:pom:0.16.0-SNAPSHOT in maven.eclipse.org (http://maven.eclipse.org/nexus/content/groups/public/)
	at org.sonatype.aether.connector.wagon.WagonRepositoryConnector$4.wrap(WagonRepositoryConnector.java:945)
	at org.sonatype.aether.connector.wagon.WagonRepositoryConnector$4.wrap(WagonRepositoryConnector.java:940)
	at org.sonatype.aether.connector.wagon.WagonRepositoryConnector$GetTask.flush(WagonRepositoryConnector.java:695)
	at org.sonatype.aether.connector.wagon.WagonRepositoryConnector$GetTask.flush(WagonRepositoryConnector.java:689)
	at org.sonatype.aether.connector.wagon.WagonRepositoryConnector.get(WagonRepositoryConnector.java:445)
	at org.sonatype.aether.impl.internal.DefaultArtifactResolver.resolve(DefaultArtifactResolver.java:460)
	... 25 more
[ERROR] 
[ERROR] To see the full stack trace of the errors, re-run Maven with the -e switch.
[ERROR] Re-run Maven using the -X switch to enable full debug logging.
[ERROR] 
[ERROR] For more information about the errors and possible solutions, please read the following articles:
[ERROR] [Help 1] http://cwiki.apache.org/confluence/display/MAVEN/InternalErrorException
[DEBUG] Waiting for process to finish
[DEBUG] Result: 1
Terminating xvnc.
Archiving artifacts
Recording test results

--
This message is automatically generated by Hudson. 
For more information on Hudson, see: http://hudson-ci.org/