Skip to main content

[Date Prev][Date Next][Thread Prev][Thread Next][Date Index][Thread Index] [List Home]
[rdf4j-dev] Build failed in Jenkins: rdf4j-deploy-release-ossrh #255

See <https://ci.eclipse.org/rdf4j/job/rdf4j-deploy-release-ossrh/255/display/redirect>

Changes:


------------------------------------------
[...truncated 2.54 MiB...]
[INFO] Building jar: <https://ci.eclipse.org/rdf4j/job/rdf4j-deploy-release-ossrh/ws/examples/target/rdf4j-examples-6.1.0-javadoc.jar>
[INFO] 
[INFO] --- failsafe:3.5.4:integration-test (integration-tests) @ rdf4j-examples ---
[INFO] Tests are skipped.
[INFO] 
[INFO] --- failsafe:3.5.4:verify (verify) @ rdf4j-examples ---
[INFO] Tests are skipped.
[INFO] 
[INFO] --- japicmp:0.18.3:cmp (default) @ rdf4j-examples ---
[INFO] Skipping execution because parameter 'skip' was set to true.
[INFO] 
[INFO] --- gpg:1.6:sign (sign-artifacts) @ rdf4j-examples ---
[INFO] 
[INFO] --- spotless:2.34.0:check (spotless-check) @ rdf4j-examples ---
[INFO] Spotless check skipped
[INFO] 
[INFO] --- install:3.1.4:install (default-install) @ rdf4j-examples ---
[INFO] Installing <https://ci.eclipse.org/rdf4j/job/rdf4j-deploy-release-ossrh/ws/examples/pom.xml> to /home/jenkins/.m2/repository/org/eclipse/rdf4j/rdf4j-examples/6.1.0/rdf4j-examples-6.1.0.pom
[INFO] Installing <https://ci.eclipse.org/rdf4j/job/rdf4j-deploy-release-ossrh/ws/examples/target/rdf4j-examples-6.1.0.jar> to /home/jenkins/.m2/repository/org/eclipse/rdf4j/rdf4j-examples/6.1.0/rdf4j-examples-6.1.0.jar
[INFO] Installing <https://ci.eclipse.org/rdf4j/job/rdf4j-deploy-release-ossrh/ws/examples/target/rdf4j-examples-6.1.0-sources.jar> to /home/jenkins/.m2/repository/org/eclipse/rdf4j/rdf4j-examples/6.1.0/rdf4j-examples-6.1.0-sources.jar
[INFO] Installing <https://ci.eclipse.org/rdf4j/job/rdf4j-deploy-release-ossrh/ws/examples/target/rdf4j-examples-6.1.0-javadoc.jar> to /home/jenkins/.m2/repository/org/eclipse/rdf4j/rdf4j-examples/6.1.0/rdf4j-examples-6.1.0-javadoc.jar
[INFO] Installing <https://ci.eclipse.org/rdf4j/job/rdf4j-deploy-release-ossrh/ws/examples/target/rdf4j-examples-6.1.0.jar.asc> to /home/jenkins/.m2/repository/org/eclipse/rdf4j/rdf4j-examples/6.1.0/rdf4j-examples-6.1.0.jar.asc
[INFO] Installing <https://ci.eclipse.org/rdf4j/job/rdf4j-deploy-release-ossrh/ws/examples/target/rdf4j-examples-6.1.0.pom.asc> to /home/jenkins/.m2/repository/org/eclipse/rdf4j/rdf4j-examples/6.1.0/rdf4j-examples-6.1.0.pom.asc
[INFO] Installing <https://ci.eclipse.org/rdf4j/job/rdf4j-deploy-release-ossrh/ws/examples/target/rdf4j-examples-6.1.0-sources.jar.asc> to /home/jenkins/.m2/repository/org/eclipse/rdf4j/rdf4j-examples/6.1.0/rdf4j-examples-6.1.0-sources.jar.asc
[INFO] Installing <https://ci.eclipse.org/rdf4j/job/rdf4j-deploy-release-ossrh/ws/examples/target/rdf4j-examples-6.1.0-javadoc.jar.asc> to /home/jenkins/.m2/repository/org/eclipse/rdf4j/rdf4j-examples/6.1.0/rdf4j-examples-6.1.0-javadoc.jar.asc
[INFO] 
[INFO] --- central-publishing:0.11.0:publish (injected-central-publishing) @ rdf4j-examples ---
[INFO] Using Central baseUrl: https://central.sonatype.com
[INFO] Using credentials from server id central in settings.xml
[INFO] Staging 7 files
[INFO] Staging <https://ci.eclipse.org/rdf4j/job/rdf4j-deploy-release-ossrh/ws/examples/target/rdf4j-examples-6.1.0.jar>
[INFO] Installing <https://ci.eclipse.org/rdf4j/job/rdf4j-deploy-release-ossrh/ws/examples/target/rdf4j-examples-6.1.0.jar> to <https://ci.eclipse.org/rdf4j/job/rdf4j-deploy-release-ossrh/ws/target/central-staging/org/eclipse/rdf4j/rdf4j-examples/6.1.0/rdf4j-examples-6.1.0.jar>
[INFO] Installing <https://ci.eclipse.org/rdf4j/job/rdf4j-deploy-release-ossrh/ws/examples/pom.xml> to <https://ci.eclipse.org/rdf4j/job/rdf4j-deploy-release-ossrh/ws/target/central-staging/org/eclipse/rdf4j/rdf4j-examples/6.1.0/rdf4j-examples-6.1.0.pom>
[INFO] Staging <https://ci.eclipse.org/rdf4j/job/rdf4j-deploy-release-ossrh/ws/examples/target/rdf4j-examples-6.1.0-sources.jar>
[INFO] Installing <https://ci.eclipse.org/rdf4j/job/rdf4j-deploy-release-ossrh/ws/examples/target/rdf4j-examples-6.1.0-sources.jar> to <https://ci.eclipse.org/rdf4j/job/rdf4j-deploy-release-ossrh/ws/target/central-staging/org/eclipse/rdf4j/rdf4j-examples/6.1.0/rdf4j-examples-6.1.0-sources.jar>
[INFO] Staging <https://ci.eclipse.org/rdf4j/job/rdf4j-deploy-release-ossrh/ws/examples/target/rdf4j-examples-6.1.0-javadoc.jar>
[INFO] Installing <https://ci.eclipse.org/rdf4j/job/rdf4j-deploy-release-ossrh/ws/examples/target/rdf4j-examples-6.1.0-javadoc.jar> to <https://ci.eclipse.org/rdf4j/job/rdf4j-deploy-release-ossrh/ws/target/central-staging/org/eclipse/rdf4j/rdf4j-examples/6.1.0/rdf4j-examples-6.1.0-javadoc.jar>
[INFO] Staging <https://ci.eclipse.org/rdf4j/job/rdf4j-deploy-release-ossrh/ws/examples/target/rdf4j-examples-6.1.0.jar.asc>
[INFO] Installing <https://ci.eclipse.org/rdf4j/job/rdf4j-deploy-release-ossrh/ws/examples/target/rdf4j-examples-6.1.0.jar.asc> to <https://ci.eclipse.org/rdf4j/job/rdf4j-deploy-release-ossrh/ws/target/central-staging/org/eclipse/rdf4j/rdf4j-examples/6.1.0/rdf4j-examples-6.1.0.jar.asc>
[INFO] Staging <https://ci.eclipse.org/rdf4j/job/rdf4j-deploy-release-ossrh/ws/examples/target/rdf4j-examples-6.1.0.pom.asc>
[INFO] Installing <https://ci.eclipse.org/rdf4j/job/rdf4j-deploy-release-ossrh/ws/examples/target/rdf4j-examples-6.1.0.pom.asc> to <https://ci.eclipse.org/rdf4j/job/rdf4j-deploy-release-ossrh/ws/target/central-staging/org/eclipse/rdf4j/rdf4j-examples/6.1.0/rdf4j-examples-6.1.0.pom.asc>
[INFO] Staging <https://ci.eclipse.org/rdf4j/job/rdf4j-deploy-release-ossrh/ws/examples/target/rdf4j-examples-6.1.0-sources.jar.asc>
[INFO] Installing <https://ci.eclipse.org/rdf4j/job/rdf4j-deploy-release-ossrh/ws/examples/target/rdf4j-examples-6.1.0-sources.jar.asc> to <https://ci.eclipse.org/rdf4j/job/rdf4j-deploy-release-ossrh/ws/target/central-staging/org/eclipse/rdf4j/rdf4j-examples/6.1.0/rdf4j-examples-6.1.0-sources.jar.asc>
[INFO] Staging <https://ci.eclipse.org/rdf4j/job/rdf4j-deploy-release-ossrh/ws/examples/target/rdf4j-examples-6.1.0-javadoc.jar.asc>
[INFO] Installing <https://ci.eclipse.org/rdf4j/job/rdf4j-deploy-release-ossrh/ws/examples/target/rdf4j-examples-6.1.0-javadoc.jar.asc> to <https://ci.eclipse.org/rdf4j/job/rdf4j-deploy-release-ossrh/ws/target/central-staging/org/eclipse/rdf4j/rdf4j-examples/6.1.0/rdf4j-examples-6.1.0-javadoc.jar.asc>
[INFO] Pre Bundling - deleted <https://ci.eclipse.org/rdf4j/job/rdf4j-deploy-release-ossrh/ws/target/central-staging/org/eclipse/rdf4j/rdf4j-examples/maven-metadata-central-staging.xml>
[INFO] Generate checksums for dir: org/eclipse/rdf4j/rdf4j-examples/6.1.0
[INFO] 
[INFO] --------------------< org.eclipse.rdf4j:rdf4j-bom >---------------------
[INFO] Building RDF4J: BOM 6.1.0                                      [123/123]
[INFO]   from bom/pom.xml
[INFO] --------------------------------[ pom ]---------------------------------
[INFO] 
[INFO] --- enforcer:3.4.1:enforce (enforce-maven-3) @ rdf4j-bom ---
[INFO] Skipping Rule Enforcement.
[INFO] 
[INFO] --- enforcer:3.4.1:enforce (enforce-logging-dependencies) @ rdf4j-bom ---
[INFO] Skipping Rule Enforcement.
[INFO] 
[INFO] --- enforcer:3.4.1:enforce (enforce-javaee-provided) @ rdf4j-bom ---
[INFO] Skipping Rule Enforcement.
[INFO] 
[INFO] --- enforcer:3.4.1:enforce (enforce-ban-duplicate-classes) @ rdf4j-bom ---
[INFO] Skipping Rule Enforcement.
[INFO] 
[INFO] --- spotless:2.34.0:apply (spotless-apply) @ rdf4j-bom ---
[INFO] Spotless apply skipped
[INFO] 
[INFO] --- source:3.3.1:jar-no-fork (attach-sources) @ rdf4j-bom ---
[INFO] 
[INFO] --- javadoc:3.11.3:jar (attach-javadocs) @ rdf4j-bom ---
[INFO] Not executing Javadoc as the project is not a Java classpath-capable package
[INFO] 
[INFO] --- failsafe:3.5.4:integration-test (integration-tests) @ rdf4j-bom ---
[INFO] Tests are skipped.
[INFO] 
[INFO] --- failsafe:3.5.4:verify (verify) @ rdf4j-bom ---
[INFO] Tests are skipped.
[INFO] 
[INFO] --- japicmp:0.18.3:cmp (default) @ rdf4j-bom ---
[INFO] Skipping execution because parameter 'skip' was set to true.
[INFO] 
[INFO] --- gpg:1.6:sign (sign-artifacts) @ rdf4j-bom ---
[INFO] 
[INFO] --- spotless:2.34.0:check (spotless-check) @ rdf4j-bom ---
[INFO] Spotless check skipped
[INFO] 
[INFO] --- install:3.1.4:install (default-install) @ rdf4j-bom ---
[INFO] Installing <https://ci.eclipse.org/rdf4j/job/rdf4j-deploy-release-ossrh/ws/bom/pom.xml> to /home/jenkins/.m2/repository/org/eclipse/rdf4j/rdf4j-bom/6.1.0/rdf4j-bom-6.1.0.pom
[INFO] Installing <https://ci.eclipse.org/rdf4j/job/rdf4j-deploy-release-ossrh/ws/bom/target/rdf4j-bom-6.1.0.pom.asc> to /home/jenkins/.m2/repository/org/eclipse/rdf4j/rdf4j-bom/6.1.0/rdf4j-bom-6.1.0.pom.asc
[INFO] 
[INFO] --- central-publishing:0.11.0:publish (injected-central-publishing) @ rdf4j-bom ---
[INFO] Using Central baseUrl: https://central.sonatype.com
[INFO] Using credentials from server id central in settings.xml
[INFO] Staging 2 files
[INFO] Staging <https://ci.eclipse.org/rdf4j/job/rdf4j-deploy-release-ossrh/ws/bom/pom.xml>
[INFO] Installing <https://ci.eclipse.org/rdf4j/job/rdf4j-deploy-release-ossrh/ws/bom/pom.xml> to <https://ci.eclipse.org/rdf4j/job/rdf4j-deploy-release-ossrh/ws/target/central-staging/org/eclipse/rdf4j/rdf4j-bom/6.1.0/rdf4j-bom-6.1.0.pom>
[INFO] Staging <https://ci.eclipse.org/rdf4j/job/rdf4j-deploy-release-ossrh/ws/bom/target/rdf4j-bom-6.1.0.pom.asc>
[INFO] Installing <https://ci.eclipse.org/rdf4j/job/rdf4j-deploy-release-ossrh/ws/bom/target/rdf4j-bom-6.1.0.pom.asc> to <https://ci.eclipse.org/rdf4j/job/rdf4j-deploy-release-ossrh/ws/target/central-staging/org/eclipse/rdf4j/rdf4j-bom/6.1.0/rdf4j-bom-6.1.0.pom.asc>
[INFO] Pre Bundling - deleted <https://ci.eclipse.org/rdf4j/job/rdf4j-deploy-release-ossrh/ws/target/central-staging/org/eclipse/rdf4j/rdf4j-bom/maven-metadata-central-staging.xml>
[INFO] Generate checksums for dir: org/eclipse/rdf4j/rdf4j-bom/6.1.0
[INFO] Going to create <https://ci.eclipse.org/rdf4j/job/rdf4j-deploy-release-ossrh/ws/target/central-publishing/central-bundle.zip> by bundling content at <https://ci.eclipse.org/rdf4j/job/rdf4j-deploy-release-ossrh/ws/target/central-staging>
[INFO] Created bundle successfully <https://ci.eclipse.org/rdf4j/job/rdf4j-deploy-release-ossrh/ws/target/central-staging/central-bundle.zip>
[INFO] Going to upload <https://ci.eclipse.org/rdf4j/job/rdf4j-deploy-release-ossrh/ws/target/central-publishing/central-bundle.zip>
[INFO] Uploaded bundle successfully, deployment name: Deployment, deploymentId: 729c1000-0e04-4645-a85a-dc1670196b7d. Deployment will publish automatically
[INFO] Waiting until Deployment 729c1000-0e04-4645-a85a-dc1670196b7d is published
[INFO] ------------------------------------------------------------------------
[INFO] Reactor Summary for Eclipse RDF4J 6.1.0:
[INFO] 
[INFO] Eclipse RDF4J ...................................... SUCCESS [ 13.317 s]
[INFO] RDF4J: Assembly Descriptors ........................ SUCCESS [  1.252 s]
[INFO] RDF4J: Core ........................................ SUCCESS [  0.358 s]
[INFO] RDF4J: common ...................................... SUCCESS [  0.302 s]
[INFO] RDF4J: common annotation ........................... SUCCESS [  3.336 s]
[INFO] RDF4J: Model API ................................... SUCCESS [  3.837 s]
[INFO] RDF4J: common exception ............................ SUCCESS [  2.264 s]
[INFO] RDF4J: common IO ................................... SUCCESS [  3.214 s]
[INFO] RDF4J: common order ................................ SUCCESS [  2.190 s]
[INFO] RDF4J: common iterators ............................ SUCCESS [  3.277 s]
[INFO] RDF4J: common text ................................. SUCCESS [  2.304 s]
[INFO] RDF4J: RDF Vocabularies ............................ SUCCESS [  3.860 s]
[INFO] RDF4J: Model ....................................... SUCCESS [  4.501 s]
[INFO] RDF4J: common transaction .......................... SUCCESS [  2.624 s]
[INFO] RDF4J: common XML .................................. SUCCESS [  2.729 s]
[INFO] RDF4J: RDF Vocabularies Annotation ................. SUCCESS [  2.599 s]
[INFO] RDF4J: RDF Vocabularies Biblio ..................... SUCCESS [  2.868 s]
[INFO] RDF4J: RDF Vocabularies EU ......................... SUCCESS [  2.754 s]
[INFO] RDF4J: SparqlBuilder ............................... SUCCESS [  4.308 s]
[INFO] RDF4J: Rio ......................................... SUCCESS [  0.276 s]
[INFO] RDF4J: Rio - API ................................... SUCCESS [  4.883 s]
[INFO] RDF4J: Rio - Languages ............................. SUCCESS [  2.394 s]
[INFO] RDF4J: Rio - Datatypes ............................. SUCCESS [  2.491 s]
[INFO] RDF4J: Query ....................................... SUCCESS [  3.733 s]
[INFO] RDF4J: Rio - Binary ................................ SUCCESS [  2.516 s]
[INFO] RDF4J: Rio - N-Triples ............................. SUCCESS [  2.765 s]
[INFO] RDF4J: Rio - HDT ................................... SUCCESS [  2.612 s]
[INFO] RDF4J: Rio - JSON-LD 1.0 (legacy) .................. SUCCESS [  2.860 s]
[INFO] RDF4J: Query algebra ............................... SUCCESS [  0.304 s]
[INFO] RDF4J: Query algebra - model ....................... SUCCESS [  5.919 s]
[INFO] RDF4J: Rio - N-Quads ............................... SUCCESS [  2.466 s]
[INFO] RDF4J: Query parser ................................ SUCCESS [  0.295 s]
[INFO] RDF4J: Query parser - API .......................... SUCCESS [  3.007 s]
[INFO] RDF4J: Rio - Turtle ................................ SUCCESS [  2.955 s]
[INFO] RDF4J: Rio - TriG .................................. SUCCESS [  2.540 s]
[INFO] RDF4J: Query parser - SPARQL ....................... SUCCESS [  7.299 s]
[INFO] RDF4J: Test Suites ................................. SUCCESS [  0.322 s]
[INFO] RDF4J: benchmarks .................................. SUCCESS [ 16.333 s]
[INFO] RDF4J: Rio - JSON-LD ............................... SUCCESS [  2.874 s]
[INFO] RDF4J: Rio - N3 (writer-only) ...................... SUCCESS [  2.533 s]
[INFO] RDF4J: Rio - RDF/JSON .............................. SUCCESS [  2.696 s]
[INFO] RDF4J: Rio - RDF/XML ............................... SUCCESS [  2.911 s]
[INFO] RDF4J: Rio - TriX .................................. SUCCESS [  2.717 s]
[INFO] RDF4J: Collection Factory that may be shared ....... SUCCESS [  0.284 s]
[INFO] RDF4J: Collection Factory - API .................... SUCCESS [  2.477 s]
[INFO] RDF4J: Sail ........................................ SUCCESS [  0.288 s]
[INFO] RDF4J: Sail API .................................... SUCCESS [  4.144 s]
[INFO] RDF4J: Query result IO ............................. SUCCESS [  0.281 s]
[INFO] RDF4J: Query result IO - API ....................... SUCCESS [  3.250 s]
[INFO] RDF4J: QueryResultIO testsuite ..................... SUCCESS [  2.721 s]
[INFO] RDF4J: Query result IO - binary .................... SUCCESS [  2.757 s]
[INFO] RDF4J: Query result IO - SPARQL/JSON ............... SUCCESS [  2.809 s]
[INFO] RDF4J: Query result IO - SPARQL/XML ................ SUCCESS [  2.894 s]
[INFO] RDF4J: Query result IO - XSLX ...................... SUCCESS [  2.586 s]
[INFO] RDF4J: Query result IO - ODS ....................... SUCCESS [  2.528 s]
[INFO] RDF4J: Query result IO - plain text booleans ....... SUCCESS [  3.068 s]
[INFO] RDF4J: Repository .................................. SUCCESS [  0.304 s]
[INFO] RDF4J: Repository - API ............................ SUCCESS [  4.173 s]
[INFO] RDF4J: HTTP ........................................ SUCCESS [  0.282 s]
[INFO] RDF4J: HTTP protocol ............................... SUCCESS [  2.987 s]
[INFO] RDF4J: HTTP client API ............................. SUCCESS [  2.781 s]
[INFO] RDF4J: HTTP client JDK implementation .............. SUCCESS [  2.307 s]
[INFO] RDF4J: HTTP client Apache HttpComponents 5 implementation SUCCESS [  2.526 s]
[INFO] RDF4J: HTTP client ................................. SUCCESS [  3.394 s]
[INFO] RDF4J: SPARQL Repository ........................... SUCCESS [  3.534 s]
[INFO] RDF4J: Query algebra - evaluation .................. SUCCESS [  6.989 s]
[INFO] RDF4J: Repository API testsuite .................... SUCCESS [  3.568 s]
[INFO] RDF4J: SailRepository .............................. SUCCESS [  3.271 s]
[INFO] RDF4J: Query Rendering ............................. SUCCESS [  4.636 s]
[INFO] RDF4J: Repository - event (wrapper) ................ SUCCESS [  2.939 s]
[INFO] RDF4J: HTTPRepository .............................. SUCCESS [  3.118 s]
[INFO] RDF4J: Repository manager .......................... SUCCESS [  2.911 s]
[INFO] RDF4J: Sail base implementations ................... SUCCESS [  3.445 s]
[INFO] RDF4J: Sail API testsuite .......................... SUCCESS [  3.078 s]
[INFO] RDF4J: MemoryStore ................................. SUCCESS [  3.686 s]
[INFO] RDF4J: Query algebra - GeoSPARQL ................... SUCCESS [  3.211 s]
[INFO] RDF4J: DatasetRepository (wrapper) ................. SUCCESS [  2.738 s]
[INFO] RDF4J: Repository - context aware (wrapper) ........ SUCCESS [  2.770 s]
[INFO] RDF4J: Model API testsuite ......................... SUCCESS [  2.730 s]
[INFO] RDF4J: Sail Model .................................. SUCCESS [  2.468 s]
[INFO] RDF4J: Collection Factory - Map DB v3 backed ....... SUCCESS [  3.151 s]
[INFO] RDF4J: NativeStore ................................. SUCCESS [  4.007 s]
[INFO] RDF4J: Inferencer Sails ............................ SUCCESS [  3.238 s]
[INFO] RDF4J: LmdbStore ................................... SUCCESS [ 16.129 s]
[INFO] RDF4J: SHACL ....................................... SUCCESS [ 11.065 s]
[INFO] RDF4J: Lucene Sail API ............................. SUCCESS [  3.621 s]
[INFO] RDF4J: Lucene Sail Index ........................... SUCCESS [  3.046 s]
[INFO] RDF4J: Elastic Search Sail Index ................... SUCCESS [  3.150 s]
[INFO] RDF4J: Extensible Store ............................ SUCCESS [  3.373 s]
[INFO] RDF4J: Elasticsearch Store ......................... SUCCESS [  2.991 s]
[INFO] RDF4J: SPIN ........................................ SUCCESS [  4.085 s]
[INFO] RDF4J: Client Libraries ............................ SUCCESS [  0.443 s]
[INFO] RDF4J: Storage Libraries ........................... SUCCESS [  0.287 s]
[INFO] RDF4J: Collection Factory - Map DB backed .......... SUCCESS [  2.749 s]
[INFO] RDF4J: Tools ....................................... SUCCESS [  0.270 s]
[INFO] RDF4J: application configuration ................... SUCCESS [  4.324 s]
[INFO] RDF4J: HTTP server - core .......................... SUCCESS [ 18.358 s]
[INFO] RDF4J: SPARQL compliance test suite ................ SUCCESS [  6.168 s]
[INFO] RDF4J: Federation .................................. SUCCESS [  7.833 s]
[INFO] RDF4J: Console ..................................... SUCCESS [  4.660 s]
[INFO] RDF4J: HTTP server ................................. SUCCESS [  6.300 s]
[INFO] RDF4J: Workbench ................................... SUCCESS [  8.766 s]
[INFO] RDF4J: Server + Workbench Spring Boot runner ....... SUCCESS [ 11.280 s]
[INFO] RDF4J: Runtime ..................................... SUCCESS [  0.322 s]
[INFO] RDF4J: Runtime - OSGi .............................. SUCCESS [ 28.973 s]
[INFO] RDF4J: Spring components ........................... SUCCESS [  0.313 s]
[INFO] RDF4J: Spring boot component for a HTTP sparql server SUCCESS [  4.001 s]
[INFO] RDF4J: Spring ...................................... SUCCESS [ 11.988 s]
[INFO] RDF4J: Spring Demo ................................. SUCCESS [  3.632 s]
[INFO] RDF4J: Rio compliance test suite ................... SUCCESS [  4.742 s]
[INFO] RDF4J: Lucene Sail Tests ........................... SUCCESS [  2.807 s]
[INFO] RDF4J: GeoSPARQL compliance test suite ............. SUCCESS [  2.382 s]
[INFO] RDF4J: benchmarks .................................. SUCCESS [ 15.453 s]
[INFO] RDF4J: Compliance tests ............................ SUCCESS [  1.546 s]
[INFO] RDF4J: Repository compliance tests ................. SUCCESS [  4.478 s]
[INFO] RDF4J: Rio compliance tests ........................ SUCCESS [  0.609 s]
[INFO] RDF4J: Model compliance tests ...................... SUCCESS [  0.604 s]
[INFO] RDF4J: SPARQL query parser compliance tests ........ SUCCESS [  4.805 s]
[INFO] RDF4J: Lucene Sail Tests ........................... SUCCESS [  0.673 s]
[INFO] RDF4J: Elasticsearch Sail Tests .................... SUCCESS [  0.859 s]
[INFO] RDF4J: GeoSPARQL compliance tests .................. SUCCESS [  0.560 s]
[INFO] RDF4J: Code examples ............................... SUCCESS [  3.181 s]
[INFO] RDF4J: BOM ......................................... FAILURE [34:09 min]
[INFO] ------------------------------------------------------------------------
[INFO] BUILD FAILURE
[INFO] ------------------------------------------------------------------------
[INFO] Total time:  42:02 min
[INFO] Finished at: 2026-09-12T15:10:09Z
[INFO] ------------------------------------------------------------------------
[ERROR] Failed to execute goal org.sonatype.central:central-publishing-maven-plugin:0.11.0:publish (injected-central-publishing) on project rdf4j-bom: Execution injected-central-publishing of goal org.sonatype.central:central-publishing-maven-plugin:0.11.0:publish failed: Polling for 729c1000-0e04-4645-a85a-dc1670196b7d timed out before the deployment completed. -> [Help 1]
[ERROR] 
[ERROR] To see the full stack trace of the errors, re-run Maven with the -e switch.
[ERROR] Re-run Maven using the -X switch to enable full debug logging.
[ERROR] 
[ERROR] For more information about the errors and possible solutions, please read the following articles:
[ERROR] [Help 1] http://cwiki.apache.org/confluence/display/MAVEN/PluginExecutionException
[ERROR] 
[ERROR] After correcting the problems, you can resume the build with the command
[ERROR]   mvn <args> -rf :rdf4j-bom
Build step 'Invoke top-level Maven targets' marked build as failure


Back to the top