Skip to main content
jdt-dev Archive (Thread View - Most Recent First)
[First Page]    [Prev Page][Next Page]    [Last Page]
  • [jdt-dev] 4.42 Y-Build: Y20261022-1500 - BUILD FAILED, genie . releng
  • [jdt-dev] Smoke test for Y20261021-1500 - FAILURE, genie . releng
  • [jdt-dev] 4.42 Y-Build: Y20261021-1500, genie . releng
  • [jdt-dev] 4.42 Y-Build: Y20261020-1500, genie . releng
  • [jdt-dev] Smoke test for Y20261020-0704 - FAILURE, genie . releng
  • [jdt-dev] 4.42 Y-Build: Y20261018-1500 - BUILD FAILED, genie . releng
  • [jdt-dev] 4.42 Y-Build: Y20261017-1500 - Comparator Errors Found, genie . releng
  • [jdt-dev] Smoke test for Y20261017-0632 - FAILURE, genie . releng
  • [jdt-dev] 4.42 Y-Build: Y20261017-0632 - Comparator Errors Found, genie . releng
  • [jdt-dev] Smoke test for Y20261016-0423 - FAILURE, genie . releng
  • [jdt-dev] 4.42 Y-Build: Y20261016-0423 - Comparator Errors Found, genie . releng
  • [jdt-dev] Smoke test for Y20261015-1500 - FAILURE, genie . releng
  • [jdt-dev] 4.42 Y-Build: Y20261015-1500 - Comparator Errors Found, genie . releng
  • [jdt-dev] Smoke test for Y20261013-1500 - FAILURE, genie . releng
  • [jdt-dev] 4.42 Y-Build: Y20261013-1500 - Comparator Errors Found, genie . releng
  • [jdt-dev] Smoke test for Y20261010-1500 - FAILURE, genie . releng
  • [jdt-dev] 4.42 Y-Build: Y20261010-1500 - Comparator Errors Found, genie . releng
  • [jdt-dev] Smoke test for Y20261008-1500 - FAILURE, genie . releng
  • [jdt-dev] 4.42 Y-Build: Y20261008-1500 - Comparator Errors Found, genie . releng
  • [jdt-dev] Smoke test for Y20261007-0621 - FAILURE, genie . releng
  • [jdt-dev] 4.42 Y-Build: Y20261006-1500 - BUILD FAILED, genie . releng
  • [jdt-dev] Smoke test for Y20261003-1500 - FAILURE, genie . releng
  • [jdt-dev] 4.42 Y-Build: Y20261003-1500 - Comparator Errors Found, genie . releng
  • [jdt-dev] Eclipse and Equinox 4.42 (2026-12) M1 is available, genie . releng
  • [jdt-dev] Smoke test for Y20261001-1500 - FAILURE, genie . releng
  • [jdt-dev] 4.42 Y-Build: Y20261001-1500, genie . releng
  • [jdt-dev] Smoke test for Y20260929-1500 - FAILURE, genie . releng
  • [jdt-dev] 4.42 Y-Build: Y20260929-1500 - Comparator Errors Found, genie . releng
  • [jdt-dev] Smoke test for Y20260926-1500 - FAILURE, genie . releng
  • [jdt-dev] 4.42 Y-Build: Y20260926-1500, genie . releng
  • [jdt-dev] Smoke test for Y20260924-1500 - FAILURE, genie . releng
  • [jdt-dev] 4.42 Y-Build: Y20260924-1500, genie . releng
  • [jdt-dev] Smoke test for Y20260922-1500 - FAILURE, genie . releng
  • [jdt-dev] 4.42 Y-Build: Y20260922-1500, genie . releng
  • [jdt-dev] Smoke test for Y20260921-1109 - UNSTABLE, genie . releng
  • [jdt-dev] 4.42 Y-Build: Y20260919-1500 - BUILD FAILED, genie . releng
  • [jdt-dev] Smoke test for Y20260916-1500 - UNSTABLE, genie . releng
  • [jdt-dev] 4.41 Y-Build: Y20260916-1500 - Comparator Errors Found, genie . releng
  • [jdt-dev] Java 27 Feature Status for Eclipse 2026-09 (4.41), Manoj Nalledathu Palat
  • [jdt-dev] Smoke test for Y20260915-1618 - UNSTABLE, genie . releng
  • [jdt-dev] Contributor news: Java-25, new Releng & build calendar and retirement of inactive commiters, Hannes Wellmann
  • [jdt-dev] 4.41 Y-Build: Y20260910-1500 - Build skipped, genie . releng
  • [jdt-dev] Smoke test for Y20260910-0345 - UNSTABLE, genie . releng
  • [jdt-dev] 4.41 Y-Build: Y20260910-0345 - Comparator Errors Found, genie . releng
  • [jdt-dev] Smoke test for Y20260909-1500 - UNSTABLE, genie . releng
  • [jdt-dev] 4.41 Y-Build: Y20260909-1500 - Comparator Errors Found, genie . releng
  • [jdt-dev] Eclipse and Equinox 4.41 (2026-09) GA is available, genie . releng
  • [jdt-dev] Smoke test for Y20260908-1500 - UNSTABLE, genie . releng
  • [jdt-dev] 4.41 Y-Build: Y20260908-1500 - Comparator Errors Found, genie . releng
  • [jdt-dev] Smoke test for Y20260907-1500 - UNSTABLE, genie . releng
  • [jdt-dev] 25 years of the Eclipse IDE: we need your stories and ideas, Thomas Froment
  • [jdt-dev] 4.41 Y-Build: Y20260905-1500 - Build skipped, genie . releng
  • [jdt-dev] Smoke test for Y20260901-1500 - FAILURE, genie . releng
  • [jdt-dev] Master branch is open for 4.42 development, genie . releng
  • [jdt-dev] 4.41 Y-Build: Y20260829-1500 - BUILD FAILED, genie . releng
  • [jdt-dev] Eclipse and Equinox 4.41 (2026-09) RC2 is available, genie . releng
  • [jdt-dev] Smoke test for Y20260827-1500 - FAILURE, genie . releng
  • [jdt-dev] 4.41 Y-Build: Y20260827-1500 - Comparator Errors Found, genie . releng
  • [jdt-dev] Declare 4.41 RC2, genie . releng
  • [jdt-dev] Smoke test for Y20260825-1500 - UNSTABLE, genie . releng
  • [jdt-dev] 4.41 Y-Build: Y20260825-1500 - Comparator Errors Found, genie . releng
  • [jdt-dev] Smoke test for Y20260822-1500 - UNSTABLE, genie . releng
  • [jdt-dev] Eclipse and Equinox 4.41 (2026-09) RC2 Reminder, genie . releng
  • [jdt-dev] Eclipse and Equinox 4.41 (2026-09) RC1 is available, genie . releng
  • [jdt-dev] Declare 4.41 RC1, genie . releng
  • [jdt-dev] 4.41 Y-Build: Y20260818-1500 - BUILD FAILED, genie . releng
  • [jdt-dev] Eclipse and Equinox 4.41 (2026-09) RC1 Reminder, genie . releng
  • [jdt-dev] Smoke test for Y20260815-1500 - ABORTED, genie . releng
  • [jdt-dev] 4.41 Y-Build: Y20260815-1500 - Comparator Errors Found, genie . releng
  • [jdt-dev] Eclipse and Equinox 4.41 (2026-09) M3 is available, genie . releng
  • [jdt-dev] Smoke test for Y20260813-1500 - ABORTED, genie . releng
  • [jdt-dev] 4.41 Y-Build: Y20260813-1500 - Comparator Errors Found, genie . releng
  • [jdt-dev] Eclipse IDE & Platform Open Community Meetup in Germany: 15 September, Thomas Froment
  • [jdt-dev] Smoke test for Y20260811-1500 - UNSTABLE, genie . releng

  • Mail converted by MHonArc

    Back to the top