[Date Prev][Date Next][Thread Prev][Thread Next][Date Index][Thread Index] [List Home]
[wtp-releng] Build failed in Jenkins: webtools-javaee_master #302

See <https://ci.eclipse.org/webtools/job/webtools-javaee_master/302/display/redirect>

------------------------------------------
[...truncated 17.32 MB...]
	                       ^^^^^^^^^^^^^^^^^^^^^^^^^^^^^^^^^^^^^^^^^^^^^^^^^^^^^^^^^^^^^^^^^^^^^^^^^^^^^^^^^^^^^^^^^^^^^^^^
Discouraged access: The method 'ValidationFactory.getValidator(String)' is not API (restriction on classpath entry '<https://ci.eclipse.org/webtools/job/webtools-javaee_master/ws/.repository/p2/osgi/bundle/org.eclipse.wst.validation/1.2.701.v201810290944/org.eclipse.wst.validation-1.2.701.v201810290944.jar')>
[WARNING] /jobs/genie.webtools/webtools-javaee_master/workspace/tests/org.eclipse.jst.validation.test/test/org/eclipse/jst/validation/test/internal/registry/BVTValidationRegistryReader.java:[33] 
	import org.eclipse.wst.validation.internal.ValidationRegistryReader;
	       ^^^^^^^^^^^^^^^^^^^^^^^^^^^^^^^^^^^^^^^^^^^^^^^^^^^^^^^^^^^^
Discouraged access: The type 'ValidationRegistryReader' is not API (restriction on classpath entry '<https://ci.eclipse.org/webtools/job/webtools-javaee_master/ws/.repository/p2/osgi/bundle/org.eclipse.wst.validation/1.2.701.v201810290944/org.eclipse.wst.validation-1.2.701.v201810290944.jar')>
[WARNING] /jobs/genie.webtools/webtools-javaee_master/workspace/tests/org.eclipse.jst.validation.test/test/org/eclipse/jst/validation/test/internal/registry/BVTValidationRegistryReader.java:[34] 
	import org.eclipse.wst.validation.internal.ValidatorMetaData;
	       ^^^^^^^^^^^^^^^^^^^^^^^^^^^^^^^^^^^^^^^^^^^^^^^^^^^^^
Discouraged access: The type 'ValidatorMetaData' is not API (restriction on classpath entry '<https://ci.eclipse.org/webtools/job/webtools-javaee_master/ws/.repository/p2/osgi/bundle/org.eclipse.wst.validation/1.2.701.v201810290944/org.eclipse.wst.validation-1.2.701.v201810290944.jar')>
[WARNING] /jobs/genie.webtools/webtools-javaee_master/workspace/tests/org.eclipse.jst.validation.test/test/org/eclipse/jst/validation/test/internal/registry/BVTValidationRegistryReader.java:[340] 
	ValidatorMetaData vmd = getValidatorMetaData(test);
	^^^^^^^^^^^^^^^^^
Discouraged access: The type 'ValidatorMetaData' is not API (restriction on classpath entry '<https://ci.eclipse.org/webtools/job/webtools-javaee_master/ws/.repository/p2/osgi/bundle/org.eclipse.wst.validation/1.2.701.v201810290944/org.eclipse.wst.validation-1.2.701.v201810290944.jar')>
[WARNING] /jobs/genie.webtools/webtools-javaee_master/workspace/tests/org.eclipse.jst.validation.test/test/org/eclipse/jst/validation/test/internal/registry/BVTValidationRegistryReader.java:[375] 
	private ValidatorMetaData getValidatorMetaData(IConfigurationElement element) {
	        ^^^^^^^^^^^^^^^^^
Discouraged access: The type 'ValidatorMetaData' is not API (restriction on classpath entry '<https://ci.eclipse.org/webtools/job/webtools-javaee_master/ws/.repository/p2/osgi/bundle/org.eclipse.wst.validation/1.2.701.v201810290944/org.eclipse.wst.validation-1.2.701.v201810290944.jar')>
[WARNING] /jobs/genie.webtools/webtools-javaee_master/workspace/tests/org.eclipse.jst.validation.test/test/org/eclipse/jst/validation/test/internal/registry/BVTValidationRegistryReader.java:[392] 
	ValidatorMetaData vmd = ValidationRegistryReader.getReader().getValidatorMetaData(validatorClass);
	^^^^^^^^^^^^^^^^^
Discouraged access: The type 'ValidatorMetaData' is not API (restriction on classpath entry '<https://ci.eclipse.org/webtools/job/webtools-javaee_master/ws/.repository/p2/osgi/bundle/org.eclipse.wst.validation/1.2.701.v201810290944/org.eclipse.wst.validation-1.2.701.v201810290944.jar')>
[WARNING] /jobs/genie.webtools/webtools-javaee_master/workspace/tests/org.eclipse.jst.validation.test/test/org/eclipse/jst/validation/test/internal/registry/BVTValidationRegistryReader.java:[392] 
	ValidatorMetaData vmd = ValidationRegistryReader.getReader().getValidatorMetaData(validatorClass);
	                        ^^^^^^^^^^^^^^^^^^^^^^^^
Discouraged access: The type 'ValidationRegistryReader' is not API (restriction on classpath entry '<https://ci.eclipse.org/webtools/job/webtools-javaee_master/ws/.repository/p2/osgi/bundle/org.eclipse.wst.validation/1.2.701.v201810290944/org.eclipse.wst.validation-1.2.701.v201810290944.jar')>
[WARNING] /jobs/genie.webtools/webtools-javaee_master/workspace/tests/org.eclipse.jst.validation.test/test/org/eclipse/jst/validation/test/internal/registry/BVTValidationRegistryReader.java:[392] 
	ValidatorMetaData vmd = ValidationRegistryReader.getReader().getValidatorMetaData(validatorClass);
	                        ^^^^^^^^^^^^^^^^^^^^^^^^^^^^^^^^^^^^
Discouraged access: The method 'ValidationRegistryReader.getReader()' is not API (restriction on classpath entry '<https://ci.eclipse.org/webtools/job/webtools-javaee_master/ws/.repository/p2/osgi/bundle/org.eclipse.wst.validation/1.2.701.v201810290944/org.eclipse.wst.validation-1.2.701.v201810290944.jar')>
[WARNING] /jobs/genie.webtools/webtools-javaee_master/workspace/tests/org.eclipse.jst.validation.test/test/org/eclipse/jst/validation/test/internal/registry/BVTValidationRegistryReader.java:[392] 
	ValidatorMetaData vmd = ValidationRegistryReader.getReader().getValidatorMetaData(validatorClass);
	                        ^^^^^^^^^^^^^^^^^^^^^^^^^^^^^^^^^^^^^^^^^^^^^^^^^^^^^^^^^^^^^^^^^^^^^^^^^
Discouraged access: The method 'ValidationRegistryReader.getValidatorMetaData(String)' is not API (restriction on classpath entry '<https://ci.eclipse.org/webtools/job/webtools-javaee_master/ws/.repository/p2/osgi/bundle/org.eclipse.wst.validation/1.2.701.v201810290944/org.eclipse.wst.validation-1.2.701.v201810290944.jar')>
[WARNING] /jobs/genie.webtools/webtools-javaee_master/workspace/tests/org.eclipse.jst.validation.test/test/org/eclipse/jst/validation/test/setup/CheckForUntestedPropertiesOperation.java:[22] 
	import org.eclipse.wst.validation.internal.ValidatorMetaData;
	       ^^^^^^^^^^^^^^^^^^^^^^^^^^^^^^^^^^^^^^^^^^^^^^^^^^^^^
Discouraged access: The type 'ValidatorMetaData' is not API (restriction on classpath entry '<https://ci.eclipse.org/webtools/job/webtools-javaee_master/ws/.repository/p2/osgi/bundle/org.eclipse.wst.validation/1.2.701.v201810290944/org.eclipse.wst.validation-1.2.701.v201810290944.jar')>
[WARNING] /jobs/genie.webtools/webtools-javaee_master/workspace/tests/org.eclipse.jst.validation.test/test/org/eclipse/jst/validation/test/setup/CheckForUntestedPropertiesOperation.java:[28] 
	private ValidatorMetaData _vmd = null;
	        ^^^^^^^^^^^^^^^^^
Discouraged access: The type 'ValidatorMetaData' is not API (restriction on classpath entry '<https://ci.eclipse.org/webtools/job/webtools-javaee_master/ws/.repository/p2/osgi/bundle/org.eclipse.wst.validation/1.2.701.v201810290944/org.eclipse.wst.validation-1.2.701.v201810290944.jar')>
[WARNING] /jobs/genie.webtools/webtools-javaee_master/workspace/tests/org.eclipse.jst.validation.test/test/org/eclipse/jst/validation/test/setup/CheckForUntestedPropertiesOperation.java:[31] 
	public CheckForUntestedPropertiesOperation(IBuffer buffer, ValidatorMetaData vmd, String resourceBundleName) {
	                                                           ^^^^^^^^^^^^^^^^^
Discouraged access: The type 'ValidatorMetaData' is not API (restriction on classpath entry '<https://ci.eclipse.org/webtools/job/webtools-javaee_master/ws/.repository/p2/osgi/bundle/org.eclipse.wst.validation/1.2.701.v201810290944/org.eclipse.wst.validation-1.2.701.v201810290944.jar')>
[WARNING] /jobs/genie.webtools/webtools-javaee_master/workspace/tests/org.eclipse.jst.validation.test/test/org/eclipse/jst/validation/test/setup/CheckForUntestedPropertiesOperation.java:[42] 
	public ValidatorMetaData getValidatorMetaData() {
	       ^^^^^^^^^^^^^^^^^
Discouraged access: The type 'ValidatorMetaData' is not API (restriction on classpath entry '<https://ci.eclipse.org/webtools/job/webtools-javaee_master/ws/.repository/p2/osgi/bundle/org.eclipse.wst.validation/1.2.701.v201810290944/org.eclipse.wst.validation-1.2.701.v201810290944.jar')>
[WARNING] /jobs/genie.webtools/webtools-javaee_master/workspace/tests/org.eclipse.jst.validation.test/test/org/eclipse/jst/validation/test/setup/CheckForUntestedPropertiesOperation.java:[45] 
	private String getPluginId(ValidatorMetaData vmd) {
	                           ^^^^^^^^^^^^^^^^^
Discouraged access: The type 'ValidatorMetaData' is not API (restriction on classpath entry '<https://ci.eclipse.org/webtools/job/webtools-javaee_master/ws/.repository/p2/osgi/bundle/org.eclipse.wst.validation/1.2.701.v201810290944/org.eclipse.wst.validation-1.2.701.v201810290944.jar')>
[WARNING] /jobs/genie.webtools/webtools-javaee_master/workspace/tests/org.eclipse.jst.validation.test/test/org/eclipse/jst/validation/test/setup/CheckForUntestedPropertiesOperation.java:[49] 
	ClassLoader cl = vmd.getValidator().getClass().getClassLoader();
	                 ^^^^^^^^^^^^^^^^^^
Discouraged access: The method 'ValidatorMetaData.getValidator()' is not API (restriction on classpath entry '<https://ci.eclipse.org/webtools/job/webtools-javaee_master/ws/.repository/p2/osgi/bundle/org.eclipse.wst.validation/1.2.701.v201810290944/org.eclipse.wst.validation-1.2.701.v201810290944.jar')>
[WARNING] /jobs/genie.webtools/webtools-javaee_master/workspace/tests/org.eclipse.jst.validation.test/test/org/eclipse/jst/validation/test/setup/CheckForUntestedPropertiesOperation.java:[64] 
	void setValidatorMetaData(ValidatorMetaData vmd) {
	                          ^^^^^^^^^^^^^^^^^
Discouraged access: The type 'ValidatorMetaData' is not API (restriction on classpath entry '<https://ci.eclipse.org/webtools/job/webtools-javaee_master/ws/.repository/p2/osgi/bundle/org.eclipse.wst.validation/1.2.701.v201810290944/org.eclipse.wst.validation-1.2.701.v201810290944.jar')>
[WARNING] /jobs/genie.webtools/webtools-javaee_master/workspace/tests/org.eclipse.jst.validation.test/test/org/eclipse/jst/validation/test/setup/CheckForUntestedPropertiesOperation.java:[86] 
	ValidatorMetaData vmd = getValidatorMetaData();
	^^^^^^^^^^^^^^^^^
Discouraged access: The type 'ValidatorMetaData' is not API (restriction on classpath entry '<https://ci.eclipse.org/webtools/job/webtools-javaee_master/ws/.repository/p2/osgi/bundle/org.eclipse.wst.validation/1.2.701.v201810290944/org.eclipse.wst.validation-1.2.701.v201810290944.jar')>
[WARNING] /jobs/genie.webtools/webtools-javaee_master/workspace/tests/org.eclipse.jst.validation.test/test/org/eclipse/jst/validation/test/setup/CheckForUntestedPropertiesOperation.java:[90] 
	String msg = "Cannot load plugin id for validator " + vmd.getValidatorDisplayName();//$NON-NLS-1$	
	                                                      ^^^^^^^^^^^^^^^^^^^^^^^^^^^^^
Discouraged access: The method 'ValidatorMetaData.getValidatorDisplayName()' is not API (restriction on classpath entry '<https://ci.eclipse.org/webtools/job/webtools-javaee_master/ws/.repository/p2/osgi/bundle/org.eclipse.wst.validation/1.2.701.v201810290944/org.eclipse.wst.validation-1.2.701.v201810290944.jar')>
[WARNING] /jobs/genie.webtools/webtools-javaee_master/workspace/tests/org.eclipse.jst.validation.test/testFwk/org/eclipse/jst/validation/test/fwk/validator/JDTUtility.java:[21] 
	import org.eclipse.jem.internal.plugin.JavaEMFNature;
	       ^^^^^^^^^^^^^^^^^^^^^^^^^^^^^^^^^^^^^^^^^^^^^
Discouraged access: The type 'JavaEMFNature' is not API (restriction on classpath entry '/jobs/genie.webtools/webtools-javaee_master/workspace/plugins/org.eclipse.jem.workbench/target/classes')
[WARNING] /jobs/genie.webtools/webtools-javaee_master/workspace/tests/org.eclipse.jst.validation.test/testFwk/org/eclipse/jst/validation/test/fwk/validator/JDTUtility.java:[219] 
	JavaEMFNature nature = getNature(type);
	^^^^^^^^^^^^^
Discouraged access: The type 'JavaEMFNature' is not API (restriction on classpath entry '/jobs/genie.webtools/webtools-javaee_master/workspace/plugins/org.eclipse.jem.workbench/target/classes')
[WARNING] /jobs/genie.webtools/webtools-javaee_master/workspace/tests/org.eclipse.jst.validation.test/testFwk/org/eclipse/jst/validation/test/fwk/validator/JDTUtility.java:[226] 
	public static JavaEMFNature getNature(IType type) {
	              ^^^^^^^^^^^^^
Discouraged access: The type 'JavaEMFNature' is not API (restriction on classpath entry '/jobs/genie.webtools/webtools-javaee_master/workspace/plugins/org.eclipse.jem.workbench/target/classes')
[WARNING] /jobs/genie.webtools/webtools-javaee_master/workspace/tests/org.eclipse.jst.validation.test/testFwk/org/eclipse/jst/validation/test/fwk/validator/JDTUtility.java:[231] 
	JavaEMFNature nature = JavaEMFNature.createRuntime(project);
	^^^^^^^^^^^^^
Discouraged access: The type 'JavaEMFNature' is not API (restriction on classpath entry '/jobs/genie.webtools/webtools-javaee_master/workspace/plugins/org.eclipse.jem.workbench/target/classes')
[WARNING] /jobs/genie.webtools/webtools-javaee_master/workspace/tests/org.eclipse.jst.validation.test/testFwk/org/eclipse/jst/validation/test/fwk/validator/JDTUtility.java:[231] 
	JavaEMFNature nature = JavaEMFNature.createRuntime(project);
	                       ^^^^^^^^^^^^^
Discouraged access: The type 'JavaEMFNature' is not API (restriction on classpath entry '/jobs/genie.webtools/webtools-javaee_master/workspace/plugins/org.eclipse.jem.workbench/target/classes')
[WARNING] /jobs/genie.webtools/webtools-javaee_master/workspace/tests/org.eclipse.jst.validation.test/testFwk/org/eclipse/jst/validation/test/fwk/validator/JDTUtility.java:[231] 
	JavaEMFNature nature = JavaEMFNature.createRuntime(project);
	                       ^^^^^^^^^^^^^^^^^^^^^^^^^^^^^^^^^^^^
Discouraged access: The method 'JavaEMFNature.createRuntime(IProject)' is not API (restriction on classpath entry '/jobs/genie.webtools/webtools-javaee_master/workspace/plugins/org.eclipse.jem.workbench/target/classes')
539 problems (539 warnings)
[INFO] 
[INFO] --- maven-resources-plugin:2.4.3:testResources (default-testResources) @ org.eclipse.jst.validation.test ---
[WARNING] Using platform encoding (UTF-8 actually) to copy filtered resources, i.e. build is platform dependent!
[INFO] skip non existing resourceDirectory /jobs/genie.webtools/webtools-javaee_master/workspace/tests/org.eclipse.jst.validation.test/src/test/resources
[INFO] 
[INFO] --- tycho-source-plugin:1.2.0:plugin-source (plugin-source) @ org.eclipse.jst.validation.test ---
[INFO] Building jar: /jobs/genie.webtools/webtools-javaee_master/workspace/tests/org.eclipse.jst.validation.test/target/org.eclipse.jst.validation.test-1.1.100-SNAPSHOT-sources.jar
[INFO] 
[INFO] --- target-platform-configuration:1.2.0:target-platform (default-target-platform) @ org.eclipse.jst.validation.test ---
[INFO] 
[INFO] --- tycho-packaging-plugin:1.2.0:package-plugin (default-package-plugin) @ org.eclipse.jst.validation.test ---
[INFO] Building jar: /jobs/genie.webtools/webtools-javaee_master/workspace/tests/org.eclipse.jst.validation.test/validationtest.jar
[INFO] Building jar: /jobs/genie.webtools/webtools-javaee_master/workspace/tests/org.eclipse.jst.validation.test/target/org.eclipse.jst.validation.test-1.1.100-SNAPSHOT.jar
[INFO] 
[INFO] --- tycho-p2-plugin:1.2.0:p2-metadata-default (default-p2-metadata-default) @ org.eclipse.jst.validation.test ---
[INFO] 
[INFO] --- tycho-surefire-plugin:1.2.0:test (default-test) @ org.eclipse.jst.validation.test ---
[INFO] Expected eclipse log file: /jobs/genie.webtools/webtools-javaee_master/workspace/tests/org.eclipse.jst.validation.test/target/work/data/.metadata/.log
[INFO] Command line:
	[/opt/public/common/java/oracle/jdk1.8.0_162_x64/jre/bin/java, -Dosgi.noShutdown=false, -Dosgi.os=linux, -Dosgi.ws=gtk, -Dosgi.arch=x86_64, -Dosgi.clean=true, -jar, /jobs/genie.webtools/webtools-javaee_master/workspace/.repository/p2/osgi/bundle/org.eclipse.equinox.launcher/1.5.200.v20180922-1751/org.eclipse.equinox.launcher-1.5.200.v20180922-1751.jar, -data, /jobs/genie.webtools/webtools-javaee_master/workspace/tests/org.eclipse.jst.validation.test/target/work/data, -install, /jobs/genie.webtools/webtools-javaee_master/workspace/tests/org.eclipse.jst.validation.test/target/work, -configuration, /jobs/genie.webtools/webtools-javaee_master/workspace/tests/org.eclipse.jst.validation.test/target/work/configuration, -application, org.eclipse.tycho.surefire.osgibooter.headlesstest, -testproperties, /jobs/genie.webtools/webtools-javaee_master/workspace/tests/org.eclipse.jst.validation.test/target/surefire.properties]
Picked up JAVA_TOOL_OPTIONS: -Xmx2G -Djava.io.tmpdir=/tmp/genie.webtools
Running org.eclipse.jst.validation.api.test.ValidationRegistryApiTest
Tests run: 1, Failures: 0, Errors: 0, Skipped: 0, Time elapsed: 0.785 sec - in org.eclipse.jst.validation.api.test.ValidationRegistryApiTest
test_getValidator(org.eclipse.jst.validation.api.test.ValidationRegistryApiTest)  Time elapsed: 0.773 sec
Running org.eclipse.jst.validation.test.junit.ValidatorTest
Tests run: 1, Failures: 0, Errors: 0, Skipped: 1, Time elapsed: 0.003 sec - in org.eclipse.jst.validation.test.junit.ValidatorTest
org.eclipse.jst.validation.test.junit.ValidatorTest skipped
Running org.eclipse.jst.validation.test.junit.OperationTest
Tests run: 1, Failures: 0, Errors: 0, Skipped: 1, Time elapsed: 0 sec - in org.eclipse.jst.validation.test.junit.OperationTest
org.eclipse.jst.validation.test.junit.OperationTest skipped

Results :

Tests run: 3, Failures: 0, Errors: 0, Skipped: 2

[INFO] All tests passed!
[INFO] 
[INFO] --- tycho-pack200a-plugin:1.2.0:normalize (pack200-normalize) @ org.eclipse.jst.validation.test ---
[INFO] Pack200 normalizing jar /jobs/genie.webtools/webtools-javaee_master/workspace/tests/org.eclipse.jst.validation.test/target/org.eclipse.jst.validation.test-1.1.100-SNAPSHOT.jar
[INFO] 
[INFO] --- eclipse-jarsigner-plugin:1.1.4:sign (sign) @ org.eclipse.jst.validation.test ---
[INFO] Signing of nested jars of '/jobs/genie.webtools/webtools-javaee_master/workspace/tests/org.eclipse.jst.validation.test/target/org.eclipse.jst.validation.test-1.1.100-SNAPSHOT.jar_unpacked_7113533343655959323/testInput/FWK/BVT/opConstr.jar' is disabled.
[INFO] Signing jar: /jobs/genie.webtools/webtools-javaee_master/workspace/tests/org.eclipse.jst.validation.test/target/org.eclipse.jst.validation.test-1.1.100-SNAPSHOT.jar_unpacked_7113533343655959323/testInput/FWK/BVT/opConstr.jar
[INFO] Signing of nested jars of '/jobs/genie.webtools/webtools-javaee_master/workspace/tests/org.eclipse.jst.validation.test/target/org.eclipse.jst.validation.test-1.1.100-SNAPSHOT.jar_unpacked_7113533343655959323/testInput/Properties/aProperties.jar' is disabled.
[INFO] Signing jar: /jobs/genie.webtools/webtools-javaee_master/workspace/tests/org.eclipse.jst.validation.test/target/org.eclipse.jst.validation.test-1.1.100-SNAPSHOT.jar_unpacked_7113533343655959323/testInput/Properties/aProperties.jar
[INFO] Signing of nested jars of '/jobs/genie.webtools/webtools-javaee_master/workspace/tests/org.eclipse.jst.validation.test/target/org.eclipse.jst.validation.test-1.1.100-SNAPSHOT.jar_unpacked_7113533343655959323/validationtest.jar' is disabled.
[INFO] Signing jar: /jobs/genie.webtools/webtools-javaee_master/workspace/tests/org.eclipse.jst.validation.test/target/org.eclipse.jst.validation.test-1.1.100-SNAPSHOT.jar_unpacked_7113533343655959323/validationtest.jar
[INFO] Signing jar: /jobs/genie.webtools/webtools-javaee_master/workspace/tests/org.eclipse.jst.validation.test/target/org.eclipse.jst.validation.test-1.1.100-SNAPSHOT.jar
[INFO] Signing jar: /jobs/genie.webtools/webtools-javaee_master/workspace/tests/org.eclipse.jst.validation.test/target/org.eclipse.jst.validation.test-1.1.100-SNAPSHOT-sources.jar
[INFO] 
[INFO] --- tycho-pack200b-plugin:1.2.0:pack (pack200-pack) @ org.eclipse.jst.validation.test ---
[INFO] Pack200 packing jar /jobs/genie.webtools/webtools-javaee_master/workspace/tests/org.eclipse.jst.validation.test/target/org.eclipse.jst.validation.test-1.1.100-SNAPSHOT.jar
[INFO] 
[INFO] --- tycho-p2-plugin:1.2.0:p2-metadata (p2-metadata) @ org.eclipse.jst.validation.test ---
[INFO] No baseline version MavenProject: org.eclipse.webtools.javaee:org.eclipse.jst.validation.test:1.1.100-SNAPSHOT @ /jobs/genie.webtools/webtools-javaee_master/workspace/tests/org.eclipse.jst.validation.test/pom.xml
[INFO] 
[INFO] --- maven-install-plugin:2.3.1:install (default-install) @ org.eclipse.jst.validation.test ---
[INFO] Installing /jobs/genie.webtools/webtools-javaee_master/workspace/tests/org.eclipse.jst.validation.test/target/org.eclipse.jst.validation.test-1.1.100-SNAPSHOT.jar to <https://ci.eclipse.org/webtools/job/webtools-javaee_master/ws/.repository/org/eclipse/webtools/javaee/org.eclipse.jst.validation.test/1.1.100-SNAPSHOT/org.eclipse.jst.validation.test-1.1.100-SNAPSHOT.jar>
[INFO] Installing /jobs/genie.webtools/webtools-javaee_master/workspace/tests/org.eclipse.jst.validation.test/pom.xml to <https://ci.eclipse.org/webtools/job/webtools-javaee_master/ws/.repository/org/eclipse/webtools/javaee/org.eclipse.jst.validation.test/1.1.100-SNAPSHOT/org.eclipse.jst.validation.test-1.1.100-SNAPSHOT.pom>
[INFO] Installing /jobs/genie.webtools/webtools-javaee_master/workspace/tests/org.eclipse.jst.validation.test/target/org.eclipse.jst.validation.test-1.1.100-SNAPSHOT-sources.jar to <https://ci.eclipse.org/webtools/job/webtools-javaee_master/ws/.repository/org/eclipse/webtools/javaee/org.eclipse.jst.validation.test/1.1.100-SNAPSHOT/org.eclipse.jst.validation.test-1.1.100-SNAPSHOT-sources.jar>
[INFO] Installing /jobs/genie.webtools/webtools-javaee_master/workspace/tests/org.eclipse.jst.validation.test/target/org.eclipse.jst.validation.test-1.1.100-SNAPSHOT.jar.pack.gz to <https://ci.eclipse.org/webtools/job/webtools-javaee_master/ws/.repository/org/eclipse/webtools/javaee/org.eclipse.jst.validation.test/1.1.100-SNAPSHOT/org.eclipse.jst.validation.test-1.1.100-SNAPSHOT-pack200.jar.pack.gz>
[INFO] Installing /jobs/genie.webtools/webtools-javaee_master/workspace/tests/org.eclipse.jst.validation.test/target/p2content.xml to <https://ci.eclipse.org/webtools/job/webtools-javaee_master/ws/.repository/org/eclipse/webtools/javaee/org.eclipse.jst.validation.test/1.1.100-SNAPSHOT/org.eclipse.jst.validation.test-1.1.100-SNAPSHOT-p2metadata.xml>
[INFO] Installing /jobs/genie.webtools/webtools-javaee_master/workspace/tests/org.eclipse.jst.validation.test/target/p2artifacts.xml to <https://ci.eclipse.org/webtools/job/webtools-javaee_master/ws/.repository/org/eclipse/webtools/javaee/org.eclipse.jst.validation.test/1.1.100-SNAPSHOT/org.eclipse.jst.validation.test-1.1.100-SNAPSHOT-p2artifacts.xml>
[INFO] 
[INFO] --- tycho-p2-plugin:1.2.0:update-local-index (default-update-local-index) @ org.eclipse.jst.validation.test ---
[INFO] 
[INFO] ------------------------------------------------------------------------
[INFO] Skipping org.eclipse.webtools.javaee.site
[INFO] This project has been banned from the build due to previous failures.
[INFO] ------------------------------------------------------------------------
[INFO] ------------------------------------------------------------------------
[INFO] Reactor Summary:
[INFO] 
[INFO] org.eclipse.webtools.javaee 3.6.0-SNAPSHOT ......... SUCCESS [02:53 min]
[INFO] javaee.docs ........................................ SUCCESS [  0.054 s]
[INFO] org.eclipse.jst.ejb.doc.user 1.1.301-SNAPSHOT ...... SUCCESS [03:29 min]
[INFO] org.eclipse.jst.ejb.ui.infopop 1.0.300-SNAPSHOT .... SUCCESS [  5.201 s]
[INFO] org.eclipse.jst.j2ee.doc.user 1.1.400-SNAPSHOT ..... SUCCESS [ 10.098 s]
[INFO] org.eclipse.jst.j2ee.infopop 1.0.300-SNAPSHOT ...... SUCCESS [  7.550 s]
[INFO] org.eclipse.jst.servlet.ui.infopop 1.0.500-SNAPSHOT  SUCCESS [  4.696 s]
[INFO] javaee.plugins ..................................... SUCCESS [  0.277 s]
[INFO] org.eclipse.jem.proxy 2.0.500-SNAPSHOT ............. SUCCESS [ 42.802 s]
[INFO] org.eclipse.jem 2.0.600-SNAPSHOT ................... SUCCESS [ 19.781 s]
[INFO] org.eclipse.jem.workbench 2.0.400-SNAPSHOT ......... SUCCESS [ 11.552 s]
[INFO] org.eclipse.jem.beaninfo.vm.common 2.0.300-SNAPSHOT  SUCCESS [  5.531 s]
[INFO] org.eclipse.jem.beaninfo.vm 2.0.300-SNAPSHOT ....... SUCCESS [  7.048 s]
[INFO] org.eclipse.jem.beaninfo 2.0.300-SNAPSHOT .......... SUCCESS [ 15.003 s]
[INFO] org.eclipse.jst.common.annotations.core 1.1.300-SNAPSHOT SUCCESS [  9.232 s]
[INFO] org.eclipse.jst.common.annotations.controller 1.1.300-SNAPSHOT SUCCESS [  5.533 s]
[INFO] org.eclipse.jst.common.annotations.ui 1.1.300-SNAPSHOT SUCCESS [  5.923 s]
[INFO] org.eclipse.jst.common.frameworks 1.1.701-SNAPSHOT . SUCCESS [  7.709 s]
[INFO] org.eclipse.jst.common.ui 1.0.301-SNAPSHOT ......... SUCCESS [  4.336 s]
[INFO] org.eclipse.jst.j2ee.core 1.4.1-SNAPSHOT ........... SUCCESS [04:04 min]
[INFO] org.eclipse.jst.j2ee 1.2.301-SNAPSHOT .............. SUCCESS [02:06 min]
[INFO] org.eclipse.jst.j2ee.jca 1.1.901-SNAPSHOT .......... SUCCESS [01:14 min]
[INFO] org.eclipse.jst.jee 1.0.902-SNAPSHOT ............... SUCCESS [ 57.019 s]
[INFO] org.eclipse.jst.j2ee.ejb 1.1.901-SNAPSHOT .......... SUCCESS [  7.109 s]
[INFO] org.eclipse.jst.j2ee.ejb.annotation.model 1.1.400-SNAPSHOT SUCCESS [  3.269 s]
[INFO] org.eclipse.jst.j2ee.web 1.1.911-SNAPSHOT .......... SUCCESS [ 13.603 s]
[INFO] org.eclipse.jst.j2ee.ui 1.1.931-SNAPSHOT ........... SUCCESS [ 12.664 s]
[INFO] org.eclipse.jst.j2ee.jca.ui 1.1.601-SNAPSHOT ....... SUCCESS [  6.680 s]
[INFO] org.eclipse.jst.j2ee.navigator.ui 1.1.700-SNAPSHOT . SUCCESS [  3.386 s]
[INFO] org.eclipse.jst.jee.ui 1.0.901-SNAPSHOT ............ SUCCESS [  9.431 s]
[INFO] org.eclipse.jst.ejb.ui 1.1.911-SNAPSHOT ............ SUCCESS [  8.394 s]
[INFO] org.eclipse.jst.j2ee.ejb.annotations.emitter 1.1.300-SNAPSHOT SUCCESS [  2.536 s]
[INFO] org.eclipse.jst.j2ee.ejb.annotations.ui 1.1.301-SNAPSHOT SUCCESS [ 10.056 s]
[INFO] org.eclipse.jst.j2ee.ejb.annotations.xdoclet 1.2.300-SNAPSHOT SUCCESS [  5.962 s]
[INFO] org.eclipse.jst.j2ee.webservice 1.1.600-SNAPSHOT ... SUCCESS [  3.818 s]
[INFO] org.eclipse.jst.j2ee.webservice.ui 1.1.700-SNAPSHOT  SUCCESS [  7.985 s]
[INFO] org.eclipse.jst.j2ee.xdoclet.runtime 1.1.300-SNAPSHOT SUCCESS [  2.619 s]
[INFO] org.eclipse.jst.jee.ejb 1.0.500-SNAPSHOT ........... SUCCESS [  8.626 s]
[INFO] org.eclipse.jst.jee.web 1.0.701-SNAPSHOT ........... SUCCESS [ 22.692 s]
[INFO] org.eclipse.jst.servlet.ui 1.1.921-SNAPSHOT ........ SUCCESS [01:25 min]
[INFO] org.eclipse.wtp.jee.capabilities 1.0.100-SNAPSHOT .. SUCCESS [ 12.025 s]
[INFO] javaee.tests ....................................... SUCCESS [  0.213 s]
[INFO] org.eclipse.jst.validation.sample 1.1.1-SNAPSHOT ... SUCCESS [ 42.038 s]
[INFO] org.eclipse.jst.ejb.ui.tests 1.0.0-SNAPSHOT ........ SUCCESS [ 33.589 s]
[INFO] org.eclipse.jem.tests 1.2.300-SNAPSHOT ............. SUCCESS [ 14.348 s]
[INFO] org.eclipse.jst.j2ee.core.tests 1.1.500-SNAPSHOT ... SUCCESS [01:07 min]
[INFO] org.eclipse.jst.j2ee.tests 1.1.700-SNAPSHOT ........ SUCCESS [03:40 min]
[INFO] org.eclipse.jst.jee.tests 1.0.0-SNAPSHOT ........... FAILURE [30:12 min]
[INFO] org.eclipse.jst.servlet.tests 1.1.401-SNAPSHOT ..... SUCCESS [ 42.195 s]
[INFO] org.eclipse.jst.validation.test 1.1.100-SNAPSHOT ... SUCCESS [ 44.206 s]
[INFO] org.eclipse.webtools.javaee.site 3.6.0-SNAPSHOT .... SKIPPED
[INFO] ------------------------------------------------------------------------
[INFO] BUILD FAILURE
[INFO] ------------------------------------------------------------------------
[INFO] Total time: 01:11 h
[INFO] Finished at: 2018-11-09T09:07:08-05:00
[INFO] ------------------------------------------------------------------------
[ERROR] Failed to execute goal org.eclipse.tycho:tycho-surefire-plugin:1.2.0:test (default-test) on project org.eclipse.jst.jee.tests: An unexpected error occured while launching the test runtime (return code 143). See log /jobs/genie.webtools/webtools-javaee_master/workspace/tests/org.eclipse.jst.jee.tests/target/work/data/.metadata/.log for details. -> [Help 1]
[ERROR] 
[ERROR] To see the full stack trace of the errors, re-run Maven with the -e switch.
[ERROR] Re-run Maven using the -X switch to enable full debug logging.
[ERROR] 
[ERROR] For more information about the errors and possible solutions, please read the following articles:
[ERROR] [Help 1] http://cwiki.apache.org/confluence/display/MAVEN/MojoFailureException
[ERROR] 
[ERROR] After correcting the problems, you can resume the build with the command
[ERROR]   mvn <goals> -rf :org.eclipse.jst.jee.tests
Build step 'Invoke top-level Maven targets' marked build as failure
Taking screenshot.
[workspace] $ echo $XAUTHORITY
<https://ci.eclipse.org/webtools/job/webtools-javaee_master/ws/.Xauthority-7156161185704103552>
[workspace] $ ls -l $XAUTHORITY
-rw-rw-r-- 1 genie.webtools webtools 0 Nov  9 07:55 <https://ci.eclipse.org/webtools/job/webtools-javaee_master/ws/.Xauthority-7156161185704103552>
[workspace] $ import -window root -display :457 screenshot.jpg
Terminating xvnc.
[WARNINGS] Skipping publisher since build result is FAILURE
append disk usage
Started calculate disk usage of build
Finished Calculation of disk usage of build in 0 seconds
Started calculate disk usage of workspace
Finished Calculation of disk usage of workspace in  7 second