[Date Prev][Date Next][Thread Prev][Thread Next][Date Index][Thread Index] [List Home]
[wtp-releng] Build failed in Jenkins: webtools-dali_master #365

See <https://ci.eclipse.org/webtools/job/webtools-dali_master/365/display/redirect>

------------------------------------------
[...truncated 341.16 KB...]
Downloading from tycho-snapshot: https://repo.eclipse.org/content/repositories/tycho-snapshots/org/apache/commons/commons-lang3/3.1/commons-lang3-3.1.pom
Downloading from sonatype-public-grid: https://repository.sonatype.org/content/groups/sonatype-public-grid/org/apache/commons/commons-lang3/3.1/commons-lang3-3.1.pom
Progress (1): 4.1/17 kBProgress (1): 7.9/17 kBProgress (1): 7.9/17 kBProgress (1): 12/17 kB Progress (1): 16/17 kBProgress (1): 17 kB                      Downloaded from sonatype-public-grid: https://repository.sonatype.org/content/groups/sonatype-public-grid/org/apache/commons/commons-lang3/3.1/commons-lang3-3.1.pom (17 kB at 186 kB/s)
Downloading from tycho: https://oss.sonatype.org/content/repositories/public/org/apache/commons/commons-parent/22/commons-parent-22.pom
Downloading from cbi-repo: https://repo.eclipse.org/content/repositories/cbi/org/apache/commons/commons-parent/22/commons-parent-22.pom
Downloading from tycho-snapshot: https://repo.eclipse.org/content/repositories/tycho-snapshots/org/apache/commons/commons-parent/22/commons-parent-22.pom
Downloading from sonatype-public-grid: https://repository.sonatype.org/content/groups/sonatype-public-grid/org/apache/commons/commons-parent/22/commons-parent-22.pom
Progress (1): 4.1/42 kBProgress (1): 7.9/42 kBProgress (1): 12/42 kB Progress (1): 16/42 kBProgress (1): 20/42 kBProgress (1): 24/42 kBProgress (1): 26/42 kBProgress (1): 30/42 kBProgress (1): 34/42 kBProgress (1): 38/42 kBProgress (1): 42 kB                      Downloaded from sonatype-public-grid: https://repository.sonatype.org/content/groups/sonatype-public-grid/org/apache/commons/commons-parent/22/commons-parent-22.pom (42 kB at 30 kB/s)
Downloading from tycho: https://oss.sonatype.org/content/repositories/public/org/eclipse/tycho/org.eclipse.tycho.surefire.osgibooter/1.2.0/org.eclipse.tycho.surefire.osgibooter-1.2.0.jar
Downloading from tycho: https://oss.sonatype.org/content/repositories/public/org/eclipse/tycho/org.eclipse.tycho.surefire.junit4/1.2.0/org.eclipse.tycho.surefire.junit4-1.2.0.jar
Downloading from tycho: https://oss.sonatype.org/content/repositories/public/org/eclipse/tycho/org.eclipse.tycho.surefire.junit5/1.2.0/org.eclipse.tycho.surefire.junit5-1.2.0.jar
Downloading from tycho: https://oss.sonatype.org/content/repositories/public/org/eclipse/tycho/org.eclipse.tycho.surefire.junit47/1.2.0/org.eclipse.tycho.surefire.junit47-1.2.0.jar
Downloading from tycho: https://oss.sonatype.org/content/repositories/public/org/eclipse/tycho/org.eclipse.tycho.surefire.junit/1.2.0/org.eclipse.tycho.surefire.junit-1.2.0.jar
Progress (1): 4.1/411 kBProgress (1): 7.8/411 kBProgress (1): 12/411 kB Progress (1): 12/411 kBProgress (1): 16/411 kBProgress (1): 20/411 kBProgress (1): 24/411 kBProgress (1): 28/411 kBProgress (2): 28/411 kB | 4.1/181 kBProgress (2): 28/411 kB | 7.8/181 kBProgress (2): 28/411 kB | 12/181 kB Progress (2): 28/411 kB | 16/181 kBProgress (2): 28/411 kB | 20/181 kBProgress (2): 28/411 kB | 24/181 kBProgress (2): 28/411 kB | 28/181 kBProgress (2): 28/411 kB | 32/181 kBProgress (2): 32/411 kB | 32/181 kBProgress (2): 37/411 kB | 32/181 kBProgress (2): 41/411 kB | 32/181 kBProgress (2): 45/411 kB | 32/181 kBProgress (2): 45/411 kB | 37/181 kBProgress (2): 45/411 kB | 37/181 kBProgress (2): 45/411 kB | 41/181 kBProgress (2): 45/411 kB | 45/181 kBProgress (2): 45/411 kB | 49/181 kBProgress (2): 49/411 kB | 49/181 kBProgress (2): 53/411 kB | 49/181 kBProgress (2): 57/411 kB | 49/181 kBProgress (2): 57/411 kB | 53/181 kBProgress (2): 61/411 kB | 53/181 kBProgress (2): 61/411 kB | 57/181 kBProgress (2): 61/411 kB | 61/181 kBProgress (2): 61/411 kB | 61/181 kBProgress (2): 66/411 kB | 61/181 kBProgress (2): 70/411 kB | 61/181 kBProgress (2): 72/411 kB | 61/181 kBProgress (2): 76/411 kB | 61/181 kBProgress (2): 78/411 kB | 61/181 kBProgress (2): 82/411 kB | 61/181 kBProgress (2): 86/411 kB | 61/181 kBProgress (2): 90/411 kB | 61/181 kBProgress (2): 94/411 kB | 61/181 kBProgress (2): 94/411 kB | 66/181 kBProgress (2): 94/411 kB | 70/181 kBProgress (2): 98/411 kB | 70/181 kBProgress (2): 98/411 kB | 74/181 kBProgress (2): 102/411 kB | 74/181 kBProgress (2): 102/411 kB | 78/181 kBProgress (2): 105/411 kB | 78/181 kBProgress (2): 105/411 kB | 82/181 kBProgress (2): 109/411 kB | 82/181 kBProgress (2): 109/411 kB | 86/181 kBProgress (2): 113/411 kB | 86/181 kBProgress (2): 113/411 kB | 90/181 kBProgress (2): 117/411 kB | 90/181 kBProgress (2): 117/411 kB | 94/181 kBProgress (2): 121/411 kB | 94/181 kBProgress (2): 125/411 kB | 94/181 kBProgress (2): 129/411 kB | 94/181 kBProgress (2): 133/411 kB | 94/181 kBProgress (2): 137/411 kB | 94/181 kBProgress (2): 137/411 kB | 98/181 kBProgress (2): 137/411 kB | 102/181 kBProgress (2): 137/411 kB | 106/181 kBProgress (2): 137/411 kB | 111/181 kBProgress (2): 142/411 kB | 111/181 kBProgress (2): 146/411 kB | 111/181 kBProgress (2): 150/411 kB | 111/181 kBProgress (2): 154/411 kB | 111/181 kBProgress (2): 154/411 kB | 115/181 kBProgress (2): 158/411 kB | 115/181 kBProgress (2): 158/411 kB | 119/181 kBProgress (2): 162/411 kB | 119/181 kBProgress (2): 162/411 kB | 123/181 kBProgress (2): 166/411 kB | 123/181 kBProgress (2): 166/411 kB | 127/181 kBProgress (2): 170/411 kB | 127/181 kBProgress (2): 170/411 kB | 131/181 kBProgress (2): 170/411 kB | 135/181 kBProgress (2): 170/411 kB | 139/181 kBProgress (2): 174/411 kB | 139/181 kBProgress (2): 174/411 kB | 143/181 kBProgress (2): 178/411 kB | 143/181 kBProgress (2): 182/411 kB | 143/181 kBProgress (2): 187/411 kB | 143/181 kBProgress (2): 187/411 kB | 147/181 kBProgress (2): 187/411 kB | 152/181 kBProgress (2): 187/411 kB | 156/181 kBProgress (2): 191/411 kB | 156/181 kBProgress (2): 191/411 kB | 160/181 kBProgress (2): 195/411 kB | 160/181 kBProgress (2): 199/411 kB | 160/181 kBProgress (2): 203/411 kB | 160/181 kBProgress (2): 203/411 kB | 164/181 kBProgress (2): 203/411 kB | 168/181 kBProgress (2): 203/411 kB | 172/181 kBProgress (2): 203/411 kB | 176/181 kBProgress (2): 203/411 kB | 180/181 kBProgress (2): 203/411 kB | 181 kB    Progress (2): 207/411 kB | 181 kBProgress (2): 211/411 kB | 181 kBProgress (2): 215/411 kB | 181 kBProgress (2): 219/411 kB | 181 kBProgress (2): 223/411 kB | 181 kBProgress (2): 228/411 kB | 181 kBProgress (2): 232/411 kB | 181 kBProgress (2): 236/411 kB | 181 kBProgress (2): 240/411 kB | 181 kBProgress (2): 244/411 kB | 181 kBProgress (2): 248/411 kB | 181 kBProgress (2): 252/411 kB | 181 kBProgress (2): 256/411 kB | 181 kBProgress (2): 260/411 kB | 181 kBProgress (2): 264/411 kB | 181 kBProgress (2): 269/411 kB | 181 kBProgress (2): 273/411 kB | 181 kBProgress (2): 277/411 kB | 181 kBProgress (2): 281/411 kB | 181 kBProgress (2): 285/411 kB | 181 kBProgress (2): 289/411 kB | 181 kBProgress (2): 293/411 kB | 181 kBProgress (2): 297/411 kB | 181 kBProgress (2): 301/411 kB | 181 kBProgress (2): 305/411 kB | 181 kBProgress (2): 309/411 kB | 181 kBProgress (2): 314/411 kB | 181 kBProgress (2): 318/411 kB | 181 kBProgress (2): 322/411 kB | 181 kBProgress (2): 326/411 kB | 181 kBProgress (2): 330/411 kB | 181 kBProgress (2): 334/411 kB | 181 kBProgress (2): 338/411 kB | 181 kBProgress (2): 342/411 kB | 181 kBProgress (2): 346/411 kB | 181 kBProgress (2): 350/411 kB | 181 kB                                 Downloaded from tycho: https://oss.sonatype.org/content/repositories/public/org/eclipse/tycho/org.eclipse.tycho.surefire.junit47/1.2.0/org.eclipse.tycho.surefire.junit47-1.2.0.jar (181 kB at 432 kB/s)
Progress (1): 355/411 kB                        Downloading from tycho: https://oss.sonatype.org/content/repositories/public/org/eclipse/tycho/org.eclipse.tycho.surefire.testng/1.2.0/org.eclipse.tycho.surefire.testng-1.2.0.jar
Progress (1): 359/411 kBProgress (1): 363/411 kBProgress (1): 367/411 kBProgress (1): 371/411 kBProgress (1): 375/411 kBProgress (1): 379/411 kBProgress (1): 383/411 kBProgress (1): 387/411 kBProgress (1): 391/411 kBProgress (1): 395/411 kBProgress (1): 400/411 kBProgress (1): 404/411 kBProgress (1): 408/411 kBProgress (1): 411 kB                        Downloaded from tycho: https://oss.sonatype.org/content/repositories/public/org/eclipse/tycho/org.eclipse.tycho.surefire.junit5/1.2.0/org.eclipse.tycho.surefire.junit5-1.2.0.jar (411 kB at 845 kB/s)
Downloading from tycho: https://oss.sonatype.org/content/repositories/public/org/apache/maven/surefire/surefire-api/2.19.1/surefire-api-2.19.1.jar
Progress (1): 4.1/496 kBProgress (1): 7.8/496 kBProgress (1): 7.9/496 kBProgress (1): 12/496 kB Progress (1): 16/496 kBProgress (1): 20/496 kBProgress (1): 24/496 kBProgress (1): 28/496 kBProgress (1): 32/496 kBProgress (1): 37/496 kBProgress (1): 41/496 kBProgress (1): 45/496 kBProgress (1): 49/496 kBProgress (1): 53/496 kBProgress (1): 57/496 kBProgress (1): 61/496 kBProgress (1): 65/496 kBProgress (1): 69/496 kBProgress (1): 73/496 kBProgress (1): 77/496 kBProgress (1): 82/496 kBProgress (1): 86/496 kBProgress (1): 90/496 kBProgress (1): 94/496 kBProgress (1): 98/496 kBProgress (1): 102/496 kBProgress (1): 106/496 kBProgress (1): 110/496 kBProgress (1): 114/496 kBProgress (1): 118/496 kBProgress (1): 123/496 kBProgress (1): 127/496 kBProgress (1): 128/496 kBProgress (1): 133/496 kBProgress (1): 137/496 kBProgress (1): 141/496 kBProgress (1): 145/496 kBProgress (1): 149/496 kBProgress (1): 153/496 kBProgress (1): 155/496 kBProgress (1): 159/496 kBProgress (1): 164/496 kBProgress (1): 168/496 kBProgress (1): 172/496 kB                        Downloading from tycho: https://oss.sonatype.org/content/repositories/public/org/apache/maven/surefire/maven-surefire-common/2.19.1/maven-surefire-common-2.19.1.jar
Progress (1): 176/496 kBProgress (1): 180/496 kBProgress (1): 184/496 kBProgress (1): 188/496 kBProgress (1): 192/496 kBProgress (1): 196/496 kBProgress (1): 200/496 kBProgress (1): 204/496 kBProgress (1): 209/496 kBProgress (1): 213/496 kBProgress (1): 217/496 kBProgress (1): 221/496 kBProgress (1): 225/496 kBProgress (1): 229/496 kBProgress (1): 233/496 kBProgress (1): 237/496 kBProgress (1): 241/496 kBProgress (1): 245/496 kBProgress (1): 250/496 kBProgress (1): 254/496 kBProgress (1): 258/496 kBProgress (1): 262/496 kBProgress (1): 266/496 kBProgress (1): 270/496 kBProgress (1): 274/496 kBProgress (1): 278/496 kBProgress (1): 282/496 kBProgress (1): 286/496 kBProgress (1): 291/496 kBProgress (1): 295/496 kBProgress (1): 299/496 kBProgress (1): 303/496 kBProgress (1): 307/496 kBProgress (1): 311/496 kBProgress (1): 315/496 kBProgress (1): 319/496 kBProgress (1): 323/496 kBProgress (1): 327/496 kBProgress (1): 331/496 kBProgress (1): 336/496 kBProgress (1): 340/496 kBProgress (1): 344/496 kBProgress (1): 348/496 kBProgress (1): 352/496 kBProgress (1): 356/496 kBProgress (1): 360/496 kBProgress (1): 364/496 kBProgress (1): 368/496 kBProgress (1): 372/496 kBProgress (1): 377/496 kBProgress (1): 381/496 kBProgress (1): 385/496 kBProgress (1): 389/496 kBProgress (1): 393/496 kBProgress (1): 397/496 kBProgress (1): 401/496 kBProgress (1): 405/496 kBProgress (1): 409/496 kBProgress (1): 413/496 kBProgress (1): 417/496 kBProgress (1): 422/496 kBProgress (1): 426/496 kBProgress (1): 430/496 kBProgress (1): 434/496 kBProgress (1): 438/496 kBProgress (1): 442/496 kBProgress (1): 446/496 kBProgress (1): 448/496 kBProgress (1): 452/496 kBProgress (2): 452/496 kB | 3.8/25 kBProgress (2): 456/496 kB | 3.8/25 kBProgress (2): 460/496 kB | 3.8/25 kBProgress (2): 464/496 kB | 3.8/25 kBProgress (3): 464/496 kB | 3.8/25 kB | 4.1/58 kBProgress (3): 464/496 kB | 3.8/25 kB | 7.8/58 kBProgress (3): 464/496 kB | 3.8/25 kB | 12/58 kB Progress (3): 468/496 kB | 3.8/25 kB | 12/58 kBProgress (3): 468/496 kB | 3.8/25 kB | 12/58 kBProgress (3): 472/496 kB | 3.8/25 kB | 12/58 kBProgress (3): 475/496 kB | 3.8/25 kB | 12/58 kBProgress (3): 479/496 kB | 3.8/25 kB | 12/58 kBProgress (3): 483/496 kB | 3.8/25 kB | 12/58 kBProgress (3): 487/496 kB | 3.8/25 kB | 12/58 kBProgress (3): 491/496 kB | 3.8/25 kB | 12/58 kBProgress (3): 495/496 kB | 3.8/25 kB | 12/58 kBProgress (3): 496 kB | 3.8/25 kB | 12/58 kB    Progress (3): 496 kB | 3.8/25 kB | 16/58 kBProgress (3): 496 kB | 7.9/25 kB | 16/58 kBProgress (3): 496 kB | 7.9/25 kB | 20/58 kBProgress (3): 496 kB | 12/25 kB | 20/58 kB Progress (3): 496 kB | 12/25 kB | 24/58 kBProgress (3): 496 kB | 16/25 kB | 24/58 kBProgress (3): 496 kB | 16/25 kB | 28/58 kBProgress (3): 496 kB | 20/25 kB | 28/58 kBProgress (3): 496 kB | 24/25 kB | 28/58 kBProgress (3): 496 kB | 25 kB | 28/58 kB                                          Downloaded from tycho: https://oss.sonatype.org/content/repositories/public/org/eclipse/tycho/org.eclipse.tycho.surefire.osgibooter/1.2.0/org.eclipse.tycho.surefire.osgibooter-1.2.0.jar (496 kB at 719 kB/s)
Downloading from tycho: https://oss.sonatype.org/content/repositories/public/org/apache/maven/surefire/surefire-booter/2.19.1/surefire-booter-2.19.1.jar
Progress (2): 25 kB | 32/58 kBProgress (2): 25 kB | 37/58 kBProgress (2): 25 kB | 41/58 kBProgress (2): 25 kB | 45/58 kBProgress (2): 25 kB | 49/58 kBProgress (2): 25 kB | 53/58 kBProgress (2): 25 kB | 57/58 kBProgress (2): 25 kB | 58 kB                              Downloading from tycho: https://oss.sonatype.org/content/repositories/public/org/apache/maven/maven-plugin-descriptor/2.2.1/maven-plugin-descriptor-2.2.1.jar
Downloading from tycho: https://oss.sonatype.org/content/repositories/public/org/apache/maven/maven-project/2.2.1/maven-project-2.2.1.jar
Downloading from tycho: https://oss.sonatype.org/content/repositories/public/org/apache/maven/maven-profile/2.2.1/maven-profile-2.2.1.jar
Downloaded from tycho: https://oss.sonatype.org/content/repositories/public/org/eclipse/tycho/org.eclipse.tycho.surefire.junit4/1.2.0/org.eclipse.tycho.surefire.junit4-1.2.0.jar (58 kB at 60 kB/s)
Downloaded from tycho: https://oss.sonatype.org/content/repositories/public/org/eclipse/tycho/org.eclipse.tycho.surefire.junit/1.2.0/org.eclipse.tycho.surefire.junit-1.2.0.jar (25 kB at 25 kB/s)
Downloading from tycho: https://oss.sonatype.org/content/repositories/public/backport-util-concurrent/backport-util-concurrent/3.1/backport-util-concurrent-3.1.jar
Downloading from tycho: https://oss.sonatype.org/content/repositories/public/org/apache/maven/maven-artifact-manager/2.2.1/maven-artifact-manager-2.2.1.jar
Downloading from tycho: https://oss.sonatype.org/content/repositories/public/org/apache/maven/maven-plugin-registry/2.2.1/maven-plugin-registry-2.2.1.jar
Downloading from tycho: https://oss.sonatype.org/content/repositories/public/org/apache/maven/maven-toolchain/2.2.1/maven-toolchain-2.2.1.jar
Downloading from tycho: https://oss.sonatype.org/content/repositories/public/org/apache/commons/commons-lang3/3.1/commons-lang3-3.1.jar
Progress (1): 4.1/103 kBProgress (1): 7.8/103 kBProgress (1): 12/103 kB Progress (1): 12/103 kBProgress (1): 16/103 kBProgress (1): 20/103 kBProgress (1): 24/103 kBProgress (1): 28/103 kBProgress (1): 32/103 kBProgress (1): 33/103 kBProgress (1): 37/103 kBProgress (1): 41/103 kBProgress (1): 45/103 kBProgress (1): 49/103 kBProgress (1): 53/103 kBProgress (1): 57/103 kBProgress (1): 61/103 kBProgress (1): 66/103 kBProgress (1): 70/103 kBProgress (1): 74/103 kBProgress (1): 78/103 kBProgress (1): 82/103 kBProgress (1): 86/103 kBProgress (1): 90/103 kBProgress (1): 94/103 kBProgress (1): 98/103 kBProgress (1): 102/103 kBProgress (1): 103 kB                        Downloaded from tycho: https://oss.sonatype.org/content/repositories/public/org/eclipse/tycho/org.eclipse.tycho.surefire.testng/1.2.0/org.eclipse.tycho.surefire.testng-1.2.0.jar (103 kB at 9.5 kB/s)
Downloading from cbi-repo: https://repo.eclipse.org/content/repositories/cbi/org/apache/maven/surefire/surefire-api/2.19.1/surefire-api-2.19.1.jar
Downloading from cbi-repo: https://repo.eclipse.org/content/repositories/cbi/org/apache/maven/surefire/maven-surefire-common/2.19.1/maven-surefire-common-2.19.1.jar
Downloading from cbi-repo: https://repo.eclipse.org/content/repositories/cbi/org/apache/maven/surefire/surefire-booter/2.19.1/surefire-booter-2.19.1.jar
Downloading from cbi-repo: https://repo.eclipse.org/content/repositories/cbi/org/apache/maven/maven-plugin-descriptor/2.2.1/maven-plugin-descriptor-2.2.1.jar
Downloading from cbi-repo: https://repo.eclipse.org/content/repositories/cbi/org/apache/maven/maven-project/2.2.1/maven-project-2.2.1.jar
Downloading from cbi-repo: https://repo.eclipse.org/content/repositories/cbi/org/apache/maven/maven-profile/2.2.1/maven-profile-2.2.1.jar
Downloading from cbi-repo: https://repo.eclipse.org/content/repositories/cbi/org/apache/maven/maven-artifact-manager/2.2.1/maven-artifact-manager-2.2.1.jar
Downloading from cbi-repo: https://repo.eclipse.org/content/repositories/cbi/backport-util-concurrent/backport-util-concurrent/3.1/backport-util-concurrent-3.1.jar
Downloading from cbi-repo: https://repo.eclipse.org/content/repositories/cbi/org/apache/maven/maven-plugin-registry/2.2.1/maven-plugin-registry-2.2.1.jar
Downloading from cbi-repo: https://repo.eclipse.org/content/repositories/cbi/org/apache/maven/maven-toolchain/2.2.1/maven-toolchain-2.2.1.jar
Downloading from cbi-repo: https://repo.eclipse.org/content/repositories/cbi/org/apache/commons/commons-lang3/3.1/commons-lang3-3.1.jar
Downloading from tycho-snapshot: https://repo.eclipse.org/content/repositories/tycho-snapshots/org/apache/maven/surefire/surefire-api/2.19.1/surefire-api-2.19.1.jar
Downloading from tycho-snapshot: https://repo.eclipse.org/content/repositories/tycho-snapshots/org/apache/maven/surefire/maven-surefire-common/2.19.1/maven-surefire-common-2.19.1.jar
Downloading from tycho-snapshot: https://repo.eclipse.org/content/repositories/tycho-snapshots/org/apache/maven/maven-project/2.2.1/maven-project-2.2.1.jar
Downloading from tycho-snapshot: https://repo.eclipse.org/content/repositories/tycho-snapshots/org/apache/maven/maven-plugin-descriptor/2.2.1/maven-plugin-descriptor-2.2.1.jar
Downloading from tycho-snapshot: https://repo.eclipse.org/content/repositories/tycho-snapshots/org/apache/maven/surefire/surefire-booter/2.19.1/surefire-booter-2.19.1.jar
Downloading from tycho-snapshot: https://repo.eclipse.org/content/repositories/tycho-snapshots/org/apache/maven/maven-profile/2.2.1/maven-profile-2.2.1.jar
Downloading from tycho-snapshot: https://repo.eclipse.org/content/repositories/tycho-snapshots/org/apache/maven/maven-artifact-manager/2.2.1/maven-artifact-manager-2.2.1.jar
Downloading from tycho-snapshot: https://repo.eclipse.org/content/repositories/tycho-snapshots/backport-util-concurrent/backport-util-concurrent/3.1/backport-util-concurrent-3.1.jar
Downloading from tycho-snapshot: https://repo.eclipse.org/content/repositories/tycho-snapshots/org/apache/maven/maven-plugin-registry/2.2.1/maven-plugin-registry-2.2.1.jar
Downloading from tycho-snapshot: https://repo.eclipse.org/content/repositories/tycho-snapshots/org/apache/maven/maven-toolchain/2.2.1/maven-toolchain-2.2.1.jar
Downloading from tycho-snapshot: https://repo.eclipse.org/content/repositories/tycho-snapshots/org/apache/commons/commons-lang3/3.1/commons-lang3-3.1.jar
Downloading from sonatype-public-grid: https://repository.sonatype.org/content/groups/sonatype-public-grid/org/apache/maven/surefire/surefire-api/2.19.1/surefire-api-2.19.1.jar
Downloading from sonatype-public-grid: https://repository.sonatype.org/content/groups/sonatype-public-grid/org/apache/maven/surefire/surefire-booter/2.19.1/surefire-booter-2.19.1.jar
Downloading from sonatype-public-grid: https://repository.sonatype.org/content/groups/sonatype-public-grid/org/apache/maven/surefire/maven-surefire-common/2.19.1/maven-surefire-common-2.19.1.jar
Downloading from sonatype-public-grid: https://repository.sonatype.org/content/groups/sonatype-public-grid/org/apache/maven/maven-project/2.2.1/maven-project-2.2.1.jar
Downloading from sonatype-public-grid: https://repository.sonatype.org/content/groups/sonatype-public-grid/org/apache/maven/maven-plugin-descriptor/2.2.1/maven-plugin-descriptor-2.2.1.jar
Progress (1): 4.1/196 kBProgress (1): 7.8/196 kBProgress (1): 12/196 kB Progress (1): 16/196 kBProgress (1): 20/196 kBProgress (1): 20/196 kBProgress (1): 24/196 kBProgress (1): 28/196 kBProgress (1): 32/196 kBProgress (1): 37/196 kBProgress (1): 37/196 kBProgress (1): 41/196 kBProgress (1): 45/196 kBProgress (2): 45/196 kB | 4.1/293 kBProgress (2): 49/196 kB | 4.1/293 kBProgress (2): 49/196 kB | 7.8/293 kBProgress (2): 53/196 kB | 7.8/293 kBProgress (2): 53/196 kB | 12/293 kB Progress (2): 53/196 kB | 16/293 kBProgress (2): 57/196 kB | 16/293 kBProgress (2): 61/196 kB | 16/293 kBProgress (2): 61/196 kB | 20/293 kBProgress (2): 61/196 kB | 24/293 kBProgress (2): 61/196 kB | 28/293 kBProgress (2): 61/196 kB | 32/293 kBProgress (2): 61/196 kB | 37/293 kBProgress (2): 61/196 kB | 41/293 kBProgress (3): 61/196 kB | 41/293 kB | 4.1/156 kBProgress (3): 61/196 kB | 45/293 kB | 4.1/156 kBProgress (3): 61/196 kB | 45/293 kB | 7.8/156 kBProgress (3): 61/196 kB | 45/293 kB | 7.8/156 kBProgress (3): 61/196 kB | 45/293 kB | 7.9/156 kBProgress (3): 61/196 kB | 49/293 kB | 7.9/156 kBProgress (3): 61/196 kB | 53/293 kB | 7.9/156 kBProgress (3): 61/196 kB | 54/293 kB | 7.9/156 kBProgress (3): 61/196 kB | 54/293 kB | 12/156 kB Progress (3): 61/196 kB | 58/293 kB | 12/156 kBProgress (3): 61/196 kB | 58/293 kB | 16/156 kBProgress (3): 61/196 kB | 62/293 kB | 16/156 kBProgress (3): 61/196 kB | 62/293 kB | 20/156 kBProgress (3): 61/196 kB | 63/293 kB | 20/156 kBProgress (3): 61/196 kB | 63/293 kB | 24/156 kBProgress (3): 61/196 kB | 67/293 kB | 24/156 kBProgress (3): 61/196 kB | 71/293 kB | 24/156 kBProgress (3): 61/196 kB | 71/293 kB | 28/156 kBProgress (3): 61/196 kB | 75/293 kB | 28/156 kBProgress (3): 61/196 kB | 75/293 kB | 32/156 kBProgress (3): 61/196 kB | 79/293 kB | 32/156 kBProgress (3): 61/196 kB | 79/293 kB | 37/156 kBProgress (3): 61/196 kB | 79/293 kB | 41/156 kBProgress (3): 61/196 kB | 83/293 kB | 41/156 kBProgress (3): 61/196 kB | 88/293 kB | 41/156 kBProgress (3): 61/196 kB | 88/293 kB | 45/156 kBProgress (3): 61/196 kB | 92/293 kB | 45/156 kBProgress (3): 61/196 kB | 92/293 kB | 49/156 kBProgress (3): 61/196 kB | 96/293 kB | 49/156 kBProgress (3): 61/196 kB | 96/293 kB | 53/156 kBProgress (3): 61/196 kB | 96/293 kB | 57/156 kBProgress (3): 61/196 kB | 96/293 kB | 61/156 kBProgress (3): 61/196 kB | 96/293 kB | 61/156 kBProgress (3): 61/196 kB | 100/293 kB | 61/156 kBProgress (3): 61/196 kB | 104/293 kB | 61/156 kBProgress (3): 61/196 kB | 108/293 kB | 61/156 kBProgress (3): 61/196 kB | 112/293 kB | 61/156 kBProgress (3): 61/196 kB | 112/293 kB | 66/156 kBProgress (3): 61/196 kB | 112/293 kB | 70/156 kBProgress (3): 61/196 kB | 112/293 kB | 74/156 kBProgress (3): 61/196 kB | 112/293 kB | 78/156 kBProgress (3): 61/196 kB | 112/293 kB | 82/156 kBProgress (3): 61/196 kB | 112/293 kB | 86/156 kBProgress (3): 61/196 kB | 112/293 kB | 90/156 kBProgress (3): 61/196 kB | 112/293 kB | 94/156 kBProgress (3): 61/196 kB | 112/293 kB | 98/156 kBProgress (3): 61/196 kB | 112/293 kB | 102/156 kBProgress (3): 61/196 kB | 112/293 kB | 106/156 kBProgress (3): 61/196 kB | 112/293 kB | 111/156 kBProgress (3): 61/196 kB | 112/293 kB | 115/156 kBProgress (3): 61/196 kB | 112/293 kB | 119/156 kBProgress (3): 61/196 kB | 112/293 kB | 123/156 kBProgress (3): 61/196 kB | 112/293 kB | 127/156 kBProgress (3): 61/196 kB | 112/293 kB | 131/156 kBProgress (3): 61/196 kB | 112/293 kB | 135/156 kBProgress (3): 61/196 kB | 112/293 kB | 137/156 kBProgress (3): 61/196 kB | 112/293 kB | 142/156 kBProgress (3): 61/196 kB | 112/293 kB | 146/156 kBProgress (3): 61/196 kB | 112/293 kB | 150/156 kBProgress (3): 61/196 kB | 112/293 kB | 154/156 kBProgress (3): 61/196 kB | 112/293 kB | 156 kB    Progress (3): 66/196 kB | 112/293 kB | 156 kBProgress (3): 70/196 kB | 112/293 kB | 156 kBProgress (3): 74/196 kB | 112/293 kB | 156 kBProgress (3): 78/196 kB | 112/293 kB | 156 kBProgress (3): 79/196 kB | 112/293 kB | 156 kBProgress (3): 83/196 kB | 112/293 kB | 156 kBProgress (3): 88/196 kB | 112/293 kB | 156 kBProgress (3): 92/196 kB | 112/293 kB | 156 kBProgress (3): 96/196 kB | 112/293 kB | 156 kBProgress (3): 98/196 kB | 112/293 kB | 156 kBProgress (3): 102/196 kB | 112/293 kB | 156 kBProgress (3): 106/196 kB | 112/293 kB | 156 kBProgress (3): 111/196 kB | 112/293 kB | 156 kBProgress (3): 115/196 kB | 112/293 kB | 156 kBProgress (3): 119/196 kB | 112/293 kB | 156 kBProgress (3): 123/196 kB | 112/293 kB | 156 kBProgress (3): 127/196 kB | 112/293 kB | 156 kBProgress (3): 131/196 kB | 112/293 kB | 156 kBProgress (3): 135/196 kB | 112/293 kB | 156 kBProgress (3): 139/196 kB | 112/293 kB | 156 kBProgress (3): 143/196 kB | 112/293 kB | 156 kBProgress (3): 147/196 kB | 112/293 kB | 156 kBProgress (3): 152/196 kB | 112/293 kB | 156 kBProgress (3): 156/196 kB | 112/293 kB | 156 kBProgress (3): 156/196 kB | 116/293 kB | 156 kBProgress (3): 156/196 kB | 120/293 kB | 156 kBProgress (3): 156/196 kB | 124/293 kB | 156 kBProgress (3): 156/196 kB | 126/293 kB | 156 kBProgress (3): 156/196 kB | 130/293 kB | 156 kBProgress (3): 156/196 kB | 134/293 kB | 156 kBProgress (3): 156/196 kB | 138/293 kB | 156 kBProgress (3): 156/196 kB | 142/293 kB | 156 kBProgress (3): 156/196 kB | 146/293 kB | 156 kBProgress (3): 156/196 kB | 150/293 kB | 156 kBProgress (3): 156/196 kB | 154/293 kB | 156 kBProgress (3): 156/196 kB | 158/293 kB | 156 kBProgress (3): 156/196 kB | 162/293 kB | 156 kBProgress (3): 156/196 kB | 167/293 kB | 156 kBProgress (3): 156/196 kB | 171/293 kB | 156 kBProgress (3): 156/196 kB | 175/293 kB | 156 kBProgress (3): 156/196 kB | 179/293 kB | 156 kBProgress (3): 156/196 kB | 183/293 kB | 156 kBProgress (3): 156/196 kB | 187/293 kB | 156 kBProgress (3): 156/196 kB | 188/293 kB | 156 kBProgress (3): 156/196 kB | 192/293 kB | 156 kBProgress (3): 156/196 kB | 196/293 kB | 156 kBProgress (3): 156/196 kB | 201/293 kB | 156 kBProgress (3): 156/196 kB | 205/293 kB | 156 kBProgress (3): 156/196 kB | 209/293 kB | 156 kBProgress (3): 156/196 kB | 213/293 kB | 156 kBProgress (3): 156/196 kB | 217/293 kB | 156 kBProgress (3): 156/196 kB | 221/293 kB | 156 kBProgress (3): 160/196 kB | 221/293 kB | 156 kBProgress (3): 164/196 kB | 221/293 kB | 156 kBProgress (3): 168/196 kB | 221/293 kB | 156 kBProgress (3): 172/196 kB | 221/293 kB | 156 kBProgress (3): 176/196 kB | 221/293 kB | 156 kBProgress (3): 180/196 kB | 221/293 kB | 156 kBProgress (3): 184/196 kB | 221/293 kB | 156 kBProgress (3): 188/196 kB | 221/293 kB | 156 kBProgress (3): 193/196 kB | 221/293 kB | 156 kBProgress (3): 196 kB | 221/293 kB | 156 kB    Progress (3): 196 kB | 225/293 kB | 156 kBProgress (3): 196 kB | 229/293 kB | 156 kBProgress (3): 196 kB | 233/293 kB | 156 kBProgress (3): 196 kB | 237/293 kB | 156 kBProgress (3): 196 kB | 241/293 kB | 156 kBProgress (3): 196 kB | 246/293 kB | 156 kBProgress (3): 196 kB | 250/293 kB | 156 kBProgress (3): 196 kB | 254/293 kB | 156 kBProgress (3): 196 kB | 258/293 kB | 156 kBProgress (3): 196 kB | 262/293 kB | 156 kBProgress (3): 196 kB | 266/293 kB | 156 kBProgress (3): 196 kB | 270/293 kB | 156 kBProgress (3): 196 kB | 274/293 kB | 156 kBProgress (3): 196 kB | 278/293 kB | 156 kBProgress (3): 196 kB | 282/293 kB | 156 kBProgress (3): 196 kB | 287/293 kB | 156 kBProgress (3): 196 kB | 291/293 kB | 156 kBProgress (3): 196 kB | 293 kB | 156 kB                                          Downloaded from sonatype-public-grid: https://repository.sonatype.org/content/groups/sonatype-public-grid/org/apache/maven/maven-project/2.2.1/maven-project-2.2.1.jar (156 kB at 965 kB/s)
Downloading from sonatype-public-grid: https://repository.sonatype.org/content/groups/sonatype-public-grid/org/apache/maven/maven-profile/2.2.1/maven-profile-2.2.1.jar
Downloaded from sonatype-public-grid: https://repository.sonatype.org/content/groups/sonatype-public-grid/org/apache/maven/surefire/surefire-api/2.19.1/surefire-api-2.19.1.jar (196 kB at 1.1 MB/s)
Downloading from sonatype-public-grid: https://repository.sonatype.org/content/groups/sonatype-public-grid/org/apache/maven/maven-artifact-manager/2.2.1/maven-artifact-manager-2.2.1.jar
Downloaded from sonatype-public-grid: https://repository.sonatype.org/content/groups/sonatype-public-grid/org/apache/maven/surefire/maven-surefire-common/2.19.1/maven-surefire-common-2.19.1.jar (293 kB at 1.6 MB/s)
Downloading from sonatype-public-grid: https://repository.sonatype.org/content/groups/sonatype-public-grid/backport-util-concurrent/backport-util-concurrent/3.1/backport-util-concurrent-3.1.jar
Progress (1): 4.1/39 kBProgress (1): 7.8/39 kBProgress (1): 12/39 kB Progress (1): 16/39 kBProgress (1): 20/39 kBProgress (1): 20/39 kBProgress (1): 24/39 kBProgress (1): 28/39 kBProgress (1): 32/39 kBProgress (1): 37/39 kBProgress (1): 39 kB   Progress (2): 39 kB | 4.1/35 kBProgress (2): 39 kB | 7.8/35 kBProgress (2): 39 kB | 7.9/35 kBProgress (2): 39 kB | 12/35 kB Progress (2): 39 kB | 16/35 kBProgress (2): 39 kB | 20/35 kBProgress (2): 39 kB | 22/35 kBProgress (3): 39 kB | 22/35 kB | 4.1/68 kBProgress (3): 39 kB | 26/35 kB | 4.1/68 kBProgress (3): 39 kB | 26/35 kB | 7.8/68 kBProgress (3): 39 kB | 30/35 kB | 7.8/68 kBProgress (3): 39 kB | 30/35 kB | 7.9/68 kBProgress (3): 39 kB | 34/35 kB | 7.9/68 kBProgress (3): 39 kB | 35 kB | 7.9/68 kB   Progress (3): 39 kB | 35 kB | 12/68 kB Progress (3): 39 kB | 35 kB | 16/68 kBProgress (3): 39 kB | 35 kB | 20/68 kBProgress (3): 39 kB | 35 kB | 24/68 kBProgress (3): 39 kB | 35 kB | 28/68 kBProgress (3): 39 kB | 35 kB | 32/68 kBProgress (3): 39 kB | 35 kB | 33/68 kBProgress (3): 39 kB | 35 kB | 37/68 kBProgress (3): 39 kB | 35 kB | 41/68 kBProgress (3): 39 kB | 35 kB | 45/68 kBProgress (3): 39 kB | 35 kB | 49/68 kBProgress (3): 39 kB | 35 kB | 53/68 kBProgress (3): 39 kB | 35 kB | 57/68 kBProgress (3): 39 kB | 35 kB | 61/68 kBProgress (3): 39 kB | 35 kB | 66/68 kBProgress (3): 39 kB | 35 kB | 68 kB   Progress (4): 39 kB | 35 kB | 68 kB | 4.1/46 kBProgress (4): 39 kB | 35 kB | 68 kB | 7.8/46 kBProgress (4): 39 kB | 35 kB | 68 kB | 12/46 kB Progress (4): 39 kB | 35 kB | 68 kB | 16/46 kBProgress (4): 39 kB | 35 kB | 68 kB | 20/46 kBProgress (4): 39 kB | 35 kB | 68 kB | 24/46 kBProgress (4): 39 kB | 35 kB | 68 kB | 28/46 kBProgress (4): 39 kB | 35 kB | 68 kB | 32/46 kBProgress (5): 39 kB | 35 kB | 68 kB | 32/46 kB | 4.1/332 kBProgress (5): 39 kB | 35 kB | 68 kB | 32/46 kB | 7.8/332 kBProgress (5): 39 kB | 35 kB | 68 kB | 32/46 kB | 7.9/332 kBProgress (5): 39 kB | 35 kB | 68 kB | 32/46 kB | 12/332 kB Progress (5): 39 kB | 35 kB | 68 kB | 32/46 kB | 16/332 kBProgress (5): 39 kB | 35 kB | 68 kB | 32/46 kB | 20/332 kBProgress (5): 39 kB | 35 kB | 68 kB | 32/46 kB | 24/332 kBProgress (5): 39 kB | 35 kB | 68 kB | 32/46 kB | 28/332 kBProgress (5): 39 kB | 35 kB | 68 kB | 32/46 kB | 32/332 kBProgress (5): 39 kB | 35 kB | 68 kB | 32/46 kB | 33/332 kBProgress (5): 39 kB | 35 kB | 68 kB | 32/46 kB | 37/332 kBProgress (5): 39 kB | 35 kB | 68 kB | 32/46 kB | 41/332 kBProgress (5): 39 kB | 35 kB | 68 kB | 32/46 kB | 45/332 kBProgress (5): 39 kB | 35 kB | 68 kB | 32/46 kB | 49/332 kBProgress (5): 39 kB | 35 kB | 68 kB | 32/46 kB | 53/332 kBProgress (5): 39 kB | 35 kB | 68 kB | 32/46 kB | 57/332 kBProgress (5): 39 kB | 35 kB | 68 kB | 32/46 kB | 61/332 kBProgress (5): 39 kB | 35 kB | 68 kB | 32/46 kB | 66/332 kBProgress (5): 39 kB | 35 kB | 68 kB | 32/46 kB | 70/332 kBProgress (5): 39 kB | 35 kB | 68 kB | 32/46 kB | 74/332 kBProgress (5): 39 kB | 35 kB | 68 kB | 32/46 kB | 78/332 kBProgress (5): 39 kB | 35 kB | 68 kB | 32/46 kB | 82/332 kBProgress (5): 39 kB | 35 kB | 68 kB | 32/46 kB | 86/332 kBProgress (5): 39 kB | 35 kB | 68 kB | 32/46 kB | 90/332 kBProgress (5): 39 kB | 35 kB | 68 kB | 32/46 kB | 94/332 kBProgress (5): 39 kB | 35 kB | 68 kB | 32/46 kB | 98/332 kBProgress (5): 39 kB | 35 kB | 68 kB | 32/46 kB | 102/332 kBProgress (5): 39 kB | 35 kB | 68 kB | 32/46 kB | 106/332 kBProgress (5): 39 kB | 35 kB | 68 kB | 32/46 kB | 111/332 kBProgress (5): 39 kB | 35 kB | 68 kB | 32/46 kB | 115/332 kB                                                           Downloaded from sonatype-public-grid: https://repository.sonatype.org/content/groups/sonatype-public-grid/org/apache/maven/maven-plugin-descriptor/2.2.1/maven-plugin-descriptor-2.2.1.jar (39 kB at 153 kB/s)
Downloading from sonatype-public-grid: https://repository.sonatype.org/content/groups/sonatype-public-grid/org/apache/maven/maven-plugin-registry/2.2.1/maven-plugin-registry-2.2.1.jar
Progress (4): 35 kB | 68 kB | 37/46 kB | 115/332 kBProgress (4): 35 kB | 68 kB | 41/46 kB | 115/332 kBProgress (4): 35 kB | 68 kB | 45/46 kB | 115/332 kBProgress (4): 35 kB | 68 kB | 46 kB | 115/332 kB   Progress (4): 35 kB | 68 kB | 46 kB | 119/332 kBProgress (4): 35 kB | 68 kB | 46 kB | 123/332 kBProgress (4): 35 kB | 68 kB | 46 kB | 127/332 kBProgress (4): 35 kB | 68 kB | 46 kB | 131/332 kBProgress (4): 35 kB | 68 kB | 46 kB | 135/332 kBProgress (4): 35 kB | 68 kB | 46 kB | 139/332 kBProgress (4): 35 kB | 68 kB | 46 kB | 143/332 kBProgress (4): 35 kB | 68 kB | 46 kB | 147/332 kBProgress (4): 35 kB | 68 kB | 46 kB | 152/332 kBProgress (4): 35 kB | 68 kB | 46 kB | 156/332 kBProgress (4): 35 kB | 68 kB | 46 kB | 160/332 kBProgress (4): 35 kB | 68 kB | 46 kB | 164/332 kBProgress (4): 35 kB | 68 kB | 46 kB | 168/332 kBProgress (4): 35 kB | 68 kB | 46 kB | 172/332 kBProgress (4): 35 kB | 68 kB | 46 kB | 176/332 kBProgress (4): 35 kB | 68 kB | 46 kB | 180/332 kB                                                Downloaded from sonatype-public-grid: https://repository.sonatype.org/content/groups/sonatype-public-grid/org/apache/maven/maven-profile/2.2.1/maven-profile-2.2.1.jar (35 kB at 126 kB/s)
Progress (3): 68 kB | 46 kB | 184/332 kB                                        Downloading from sonatype-public-grid: https://repository.sonatype.org/content/groups/sonatype-public-grid/org/apache/maven/maven-toolchain/2.2.1/maven-toolchain-2.2.1.jar
Progress (3): 68 kB | 46 kB | 188/332 kBProgress (3): 68 kB | 46 kB | 193/332 kB                                        Downloaded from sonatype-public-grid: https://repository.sonatype.org/content/groups/sonatype-public-grid/org/apache/maven/surefire/surefire-booter/2.19.1/surefire-booter-2.19.1.jar (46 kB at 134 kB/s)
Progress (2): 68 kB | 197/332 kB                                Downloaded from sonatype-public-grid: https://repository.sonatype.org/content/groups/sonatype-public-grid/org/apache/maven/maven-artifact-manager/2.2.1/maven-artifact-manager-2.2.1.jar (68 kB at 199 kB/s)
Downloading from sonatype-public-grid: https://repository.sonatype.org/content/groups/sonatype-public-grid/org/apache/commons/commons-lang3/3.1/commons-lang3-3.1.jar
Progress (1): 201/332 kBProgress (1): 205/332 kBProgress (1): 209/332 kBProgress (1): 213/332 kBProgress (1): 217/332 kBProgress (1): 221/332 kBProgress (1): 225/332 kBProgress (1): 229/332 kBProgress (1): 233/332 kBProgress (1): 238/332 kBProgress (1): 242/332 kBProgress (1): 246/332 kBProgress (1): 250/332 kBProgress (1): 254/332 kBProgress (1): 258/332 kBProgress (1): 262/332 kBProgress (1): 266/332 kBProgress (1): 270/332 kBProgress (1): 274/332 kBProgress (1): 279/332 kBProgress (1): 283/332 kBProgress (1): 287/332 kBProgress (1): 291/332 kBProgress (1): 295/332 kBProgress (1): 299/332 kBProgress (1): 303/332 kBProgress (1): 307/332 kBProgress (1): 311/332 kBProgress (1): 315/332 kBProgress (1): 319/332 kBProgress (1): 324/332 kBProgress (1): 328/332 kBProgress (1): 332 kB    Progress (2): 332 kB | 4.1/30 kBProgress (2): 332 kB | 7.8/30 kBProgress (2): 332 kB | 7.9/30 kBProgress (2): 332 kB | 12/30 kB Progress (2): 332 kB | 16/30 kBProgress (2): 332 kB | 20/30 kBProgress (2): 332 kB | 24/30 kBProgress (2): 332 kB | 28/30 kBProgress (2): 332 kB | 30 kB   Progress (3): 332 kB | 30 kB | 4.1/38 kBProgress (3): 332 kB | 30 kB | 7.8/38 kBProgress (3): 332 kB | 30 kB | 12/38 kB Progress (3): 332 kB | 30 kB | 16/38 kBProgress (3): 332 kB | 30 kB | 20/38 kBProgress (3): 332 kB | 30 kB | 20/38 kBProgress (4): 332 kB | 30 kB | 20/38 kB | 4.1/316 kBProgress (4): 332 kB | 30 kB | 20/38 kB | 7.8/316 kBProgress (4): 332 kB | 30 kB | 20/38 kB | 12/316 kB Progress (4): 332 kB | 30 kB | 24/38 kB | 12/316 kBProgress (4): 332 kB | 30 kB | 24/38 kB | 16/316 kBProgress (4): 332 kB | 30 kB | 28/38 kB | 16/316 kBProgress (4): 332 kB | 30 kB | 32/38 kB | 16/316 kBProgress (4): 332 kB | 30 kB | 37/38 kB | 16/316 kBProgress (4): 332 kB | 30 kB | 38 kB | 16/316 kB   Progress (4): 332 kB | 30 kB | 38 kB | 20/316 kBProgress (4): 332 kB | 30 kB | 38 kB | 24/316 kBProgress (4): 332 kB | 30 kB | 38 kB | 28/316 kBProgress (4): 332 kB | 30 kB | 38 kB | 29/316 kB                                                Downloaded from sonatype-public-grid: https://repository.sonatype.org/content/groups/sonatype-public-grid/backport-util-concurrent/backport-util-concurrent/3.1/backport-util-concurrent-3.1.jar (332 kB at 827 kB/s)
Progress (3): 30 kB | 38 kB | 33/316 kBProgress (3): 30 kB | 38 kB | 37/316 kBProgress (3): 30 kB | 38 kB | 41/316 kBProgress (3): 30 kB | 38 kB | 45/316 kBProgress (3): 30 kB | 38 kB | 50/316 kBProgress (3): 30 kB | 38 kB | 54/316 kBProgress (3): 30 kB | 38 kB | 58/316 kBProgress (3): 30 kB | 38 kB | 62/316 kBProgress (3): 30 kB | 38 kB | 66/316 kBProgress (3): 30 kB | 38 kB | 70/316 kBProgress (3): 30 kB | 38 kB | 74/316 kBProgress (3): 30 kB | 38 kB | 78/316 kB                                       Downloaded from sonatype-public-grid: https://repository.sonatype.org/content/groups/sonatype-public-grid/org/apache/maven/maven-toolchain/2.2.1/maven-toolchain-2.2.1.jar (38 kB at 89 kB/s)
Progress (2): 30 kB | 82/316 kBProgress (2): 30 kB | 86/316 kBProgress (2): 30 kB | 91/316 kBProgress (2): 30 kB | 95/316 kBProgress (2): 30 kB | 99/316 kBProgress (2): 30 kB | 103/316 kBProgress (2): 30 kB | 107/316 kBProgress (2): 30 kB | 111/316 kBProgress (2): 30 kB | 115/316 kBProgress (2): 30 kB | 119/316 kBProgress (2): 30 kB | 123/316 kBProgress (2): 30 kB | 127/316 kBProgress (2): 30 kB | 131/316 kBProgress (2): 30 kB | 136/316 kBProgress (2): 30 kB | 140/316 kBProgress (2): 30 kB | 144/316 kB                                Downloaded from sonatype-public-grid: https://repository.sonatype.org/content/groups/sonatype-public-grid/org/apache/maven/maven-plugin-registry/2.2.1/maven-plugin-registry-2.2.1.jar (30 kB at 63 kB/s)
Progress (1): 148/316 kBProgress (1): 152/316 kBProgress (1): 156/316 kBProgress (1): 160/316 kBProgress (1): 164/316 kBProgress (1): 168/316 kBProgress (1): 172/316 kBProgress (1): 177/316 kBProgress (1): 181/316 kBProgress (1): 185/316 kBProgress (1): 189/316 kBProgress (1): 193/316 kBProgress (1): 197/316 kBProgress (1): 201/316 kBProgress (1): 205/316 kBProgress (1): 209/316 kBProgress (1): 213/316 kBProgress (1): 218/316 kBProgress (1): 222/316 kBProgress (1): 226/316 kBProgress (1): 230/316 kBProgress (1): 234/316 kBProgress (1): 238/316 kBProgress (1): 242/316 kBProgress (1): 246/316 kBProgress (1): 250/316 kBProgress (1): 254/316 kBProgress (1): 258/316 kBProgress (1): 263/316 kBProgress (1): 267/316 kBProgress (1): 271/316 kBProgress (1): 275/316 kBProgress (1): 279/316 kBProgress (1): 283/316 kBProgress (1): 287/316 kBProgress (1): 291/316 kBProgress (1): 295/316 kBProgress (1): 299/316 kBProgress (1): 304/316 kBProgress (1): 308/316 kBProgress (1): 312/316 kBProgress (1): 316 kB                        Downloaded from sonatype-public-grid: https://repository.sonatype.org/content/groups/sonatype-public-grid/org/apache/commons/commons-lang3/3.1/commons-lang3-3.1.jar (316 kB at 534 kB/s)
Downloading from tycho: https://oss.sonatype.org/content/repositories/public/org/eclipse/tycho/tycho-p2-publisher-plugin/1.2.0/tycho-p2-publisher-plugin-1.2.0.pom
Progress (1): 2.1 kB                    Downloaded from tycho: https://oss.sonatype.org/content/repositories/public/org/eclipse/tycho/tycho-p2-publisher-plugin/1.2.0/tycho-p2-publisher-plugin-1.2.0.pom (2.1 kB at 9.1 kB/s)
Downloading from tycho: https://oss.sonatype.org/content/repositories/public/org/eclipse/tycho/tycho-p2-publisher-plugin/1.2.0/tycho-p2-publisher-plugin-1.2.0.jar
Progress (1): 3.8/22 kBProgress (1): 7.9/22 kBProgress (1): 12/22 kB Progress (1): 16/22 kBProgress (1): 20/22 kBProgress (1): 22 kB                      Downloaded from tycho: https://oss.sonatype.org/content/repositories/public/org/eclipse/tycho/tycho-p2-publisher-plugin/1.2.0/tycho-p2-publisher-plugin-1.2.0.jar (22 kB at 110 kB/s)
Downloading from tycho: https://oss.sonatype.org/content/repositories/public/org/eclipse/tycho/tycho-p2-repository-plugin/1.2.0/tycho-p2-repository-plugin-1.2.0.pom
Progress (1): 1.4 kB                    Downloaded from tycho: https://oss.sonatype.org/content/repositories/public/org/eclipse/tycho/tycho-p2-repository-plugin/1.2.0/tycho-p2-repository-plugin-1.2.0.pom (1.4 kB at 304 B/s)
Downloading from tycho: https://oss.sonatype.org/content/repositories/public/org/eclipse/tycho/tycho-p2-repository-plugin/1.2.0/tycho-p2-repository-plugin-1.2.0.jar
Progress (1): 4.1/14 kBProgress (1): 7.8/14 kBProgress (1): 12/14 kB Progress (1): 14 kB                      Downloaded from tycho: https://oss.sonatype.org/content/repositories/public/org/eclipse/tycho/tycho-p2-repository-plugin/1.2.0/tycho-p2-repository-plugin-1.2.0.jar (14 kB at 84 kB/s)
[INFO] Computing target platform for MavenProject: org.eclipse.webtools.dali:org.eclipse.jpt.assembly.feature:2.3.2-SNAPSHOT @ /jobs/genie.webtools/webtools-dali_master/workspace/assembly/features/org.eclipse.jpt.assembly.feature/pom.xml
[INFO] Fetching p2.index from https://ci.eclipse.org/webtools/job/webtools-common_master/lastSuccessfulBuild/artifact/site/target/repository/ (172B)
[INFO] Fetching p2.index from https://ci.eclipse.org/webtools/job/webtools-common_master/lastSuccessfulBuild/artifact/site/target/repository/ (172B)
[INFO] Adding repository https://ci.eclipse.org/webtools/job/webtools-common_master/lastSuccessfulBuild/artifact/site/target/repository
[INFO] Fetching content.xml.xz from https://ci.eclipse.org/webtools/job/webtools-common_master/lastSuccessfulBuild/artifact/site/target/repository/ (14.95kB)
[INFO] Fetching content.xml.xz from https://ci.eclipse.org/webtools/job/webtools-common_master/lastSuccessfulBuild/artifact/site/target/repository/ (14.95kB)
[INFO] Fetching p2.index from https://ci.eclipse.org/webtools/job/webtools-servertools_master/lastSuccessfulBuild/artifact/site/target/repository/ (172B)
[INFO] Fetching p2.index from https://ci.eclipse.org/webtools/job/webtools-servertools_master/lastSuccessfulBuild/artifact/site/target/repository/ (172B)
[INFO] Adding repository https://ci.eclipse.org/webtools/job/webtools-servertools_master/lastSuccessfulBuild/artifact/site/target/repository
[INFO] Fetching content.xml.xz from https://ci.eclipse.org/webtools/job/webtools-servertools_master/lastSuccessfulBuild/artifact/site/target/repository/ (13.96kB)
[INFO] Fetching content.xml.xz from https://ci.eclipse.org/webtools/job/webtools-servertools_master/lastSuccessfulBuild/artifact/site/target/repository/ (13.96kB)
[INFO] Fetching p2.index from https://ci.eclipse.org/webtools/job/webtools-jsdt_master/lastSuccessfulBuild/artifact/site/target/repository/ (172B)
[INFO] Adding repository https://ci.eclipse.org/webtools/job/webtools-jsdt_master/lastSuccessfulBuild/artifact/site/target/repository
[INFO] Fetching content.xml.xz from https://ci.eclipse.org/webtools/job/webtools-jsdt_master/lastSuccessfulBuild/artifact/site/target/repository/ (17.14kB)
[INFO] Fetching content.xml.xz from https://ci.eclipse.org/webtools/job/webtools-jsdt_master/lastSuccessfulBuild/artifact/site/target/repository/ (17.14kB)
[INFO] Fetching p2.index from https://ci.eclipse.org/webtools/job/webtools-sourceediting_master/lastSuccessfulBuild/artifact/site/target/repository/ (172B)
[INFO] Fetching p2.index from https://ci.eclipse.org/webtools/job/webtools-sourceediting_master/lastSuccessfulBuild/artifact/site/target/repository/ (172B)
[INFO] Adding repository https://ci.eclipse.org/webtools/job/webtools-sourceediting_master/lastSuccessfulBuild/artifact/site/target/repository
[INFO] Fetching content.xml.xz from https://ci.eclipse.org/webtools/job/webtools-sourceediting_master/lastSuccessfulBuild/artifact/site/target/repository/ (30.09kB)
[INFO] Fetching content.xml.xz from https://ci.eclipse.org/webtools/job/webtools-sourceediting_master/lastSuccessfulBuild/artifact/site/target/repository/ (30.09kB)
[INFO] Fetching p2.index from https://ci.eclipse.org/webtools/job/webtools-javaee_master/lastSuccessfulBuild/artifact/site/target/repository/ (172B)
[INFO] Fetching p2.index from https://ci.eclipse.org/webtools/job/webtools-javaee_master/lastSuccessfulBuild/artifact/site/target/repository/ (172B)
[INFO] Adding repository https://ci.eclipse.org/webtools/job/webtools-javaee_master/lastSuccessfulBuild/artifact/site/target/repository
[INFO] Fetching content.xml.xz from https://ci.eclipse.org/webtools/job/webtools-javaee_master/lastSuccessfulBuild/artifact/site/target/repository/ (13.41kB)
[INFO] Fetching content.xml.xz from https://ci.eclipse.org/webtools/job/webtools-javaee_master/lastSuccessfulBuild/artifact/site/target/repository/ (13.41kB)
[INFO] Adding repository http://download.eclipse.org/cbi/updates/license/1.0.1.v20140414-1359
[INFO] Fetching content.jar from http://download.eclipse.org/cbi/updates/license/1.0.1.v20140414-1359/ (3.83kB)
[INFO] Fetching content.jar from http://download.eclipse.org/cbi/updates/license/1.0.1.v20140414-1359/ (3.83kB)
[INFO] Fetching p2.index from http://download.eclipse.org/eclipse/updates/4.10-I-builds/
[INFO] Fetching p2.index from http://download.eclipse.org/eclipse/updates/4.10-I-builds/
[INFO] Adding repository http://download.eclipse.org/eclipse/updates/4.10-I-builds
[ERROR] Internal error: java.lang.RuntimeException: Failed to load p2 repository with ID 'platform' from location http://download.eclipse.org/eclipse/updates/4.10-I-builds/: HTTP Server 'Bad Gateway' : http://download.eclipse.org/eclipse/updates/4.10-I-builds/compositeContent.jar: HttpComponents connection error response code 502. -> [Help 1]
org.apache.maven.InternalErrorException: Internal error: java.lang.RuntimeException: Failed to load p2 repository with ID 'platform' from location http://download.eclipse.org/eclipse/updates/4.10-I-builds/
    at org.apache.maven.DefaultMaven.execute (DefaultMaven.java:120)
    at org.apache.maven.cli.MavenCli.execute (MavenCli.java:954)
    at org.apache.maven.cli.MavenCli.doMain (MavenCli.java:288)
    at org.apache.maven.cli.MavenCli.main (MavenCli.java:192)
    at sun.reflect.NativeMethodAccessorImpl.invoke0 (Native Method)
    at sun.reflect.NativeMethodAccessorImpl.invoke (NativeMethodAccessorImpl.java:62)
    at sun.reflect.DelegatingMethodAccessorImpl.invoke (DelegatingMethodAccessorImpl.java:43)
    at java.lang.reflect.Method.invoke (Method.java:498)
    at org.codehaus.plexus.classworlds.launcher.Launcher.launchEnhanced (Launcher.java:289)
    at org.codehaus.plexus.classworlds.launcher.Launcher.launch (Launcher.java:229)
    at org.codehaus.plexus.classworlds.launcher.Launcher.mainWithExitCode (Launcher.java:415)
    at org.codehaus.plexus.classworlds.launcher.Launcher.main (Launcher.java:356)
Caused by: java.lang.RuntimeException: Failed to load p2 repository with ID 'platform' from location http://download.eclipse.org/eclipse/updates/4.10-I-builds/
    at org.eclipse.tycho.p2.target.TargetPlatformFactoryImpl.loadMetadataRepository (TargetPlatformFactoryImpl.java:302)
    at org.eclipse.tycho.p2.target.TargetPlatformFactoryImpl.gatherExternalInstallableUnits (TargetPlatformFactoryImpl.java:270)
    at org.eclipse.tycho.p2.target.TargetPlatformFactoryImpl.createTargetPlatform (TargetPlatformFactoryImpl.java:176)
    at org.eclipse.tycho.p2.target.TargetPlatformFactoryImpl.createTargetPlatform (TargetPlatformFactoryImpl.java:128)
    at org.eclipse.tycho.p2.target.TargetPlatformFactoryImpl.createTargetPlatform (TargetPlatformFactoryImpl.java:1)
    at org.eclipse.tycho.p2.manager.ReactorRepositoryManagerImpl.computePreliminaryTargetPlatform (ReactorRepositoryManagerImpl.java:84)
    at org.eclipse.tycho.p2.resolver.P2DependencyResolver.computePreliminaryTargetPlatform (P2DependencyResolver.java:223)
    at org.eclipse.tycho.core.resolver.DefaultTychoResolver.resolveProject (DefaultTychoResolver.java:109)
    at org.eclipse.tycho.core.maven.TychoMavenLifecycleParticipant.afterProjectsRead (TychoMavenLifecycleParticipant.java:95)
    at org.apache.maven.DefaultMaven.doExecute (DefaultMaven.java:264)
    at org.apache.maven.DefaultMaven.doExecute (DefaultMaven.java:192)
    at org.apache.maven.DefaultMaven.execute (DefaultMaven.java:105)
    at org.apache.maven.cli.MavenCli.execute (MavenCli.java:954)
    at org.apache.maven.cli.MavenCli.doMain (MavenCli.java:288)
    at org.apache.maven.cli.MavenCli.main (MavenCli.java:192)
    at sun.reflect.NativeMethodAccessorImpl.invoke0 (Native Method)
    at sun.reflect.NativeMethodAccessorImpl.invoke (NativeMethodAccessorImpl.java:62)
    at sun.reflect.DelegatingMethodAccessorImpl.invoke (DelegatingMethodAccessorImpl.java:43)
    at java.lang.reflect.Method.invoke (Method.java:498)
    at org.codehaus.plexus.classworlds.launcher.Launcher.launchEnhanced (Launcher.java:289)
    at org.codehaus.plexus.classworlds.launcher.Launcher.launch (Launcher.java:229)
    at org.codehaus.plexus.classworlds.launcher.Launcher.mainWithExitCode (Launcher.java:415)
    at org.codehaus.plexus.classworlds.launcher.Launcher.main (Launcher.java:356)
Caused by: org.eclipse.equinox.p2.core.ProvisionException: HTTP Server 'Bad Gateway' : http://download.eclipse.org/eclipse/updates/4.10-I-builds/compositeContent.jar
    at org.eclipse.equinox.internal.p2.repository.CacheManager.updateCache (CacheManager.java:428)
    at org.eclipse.equinox.internal.p2.repository.CacheManager.createCache (CacheManager.java:259)
    at org.eclipse.tycho.p2.remote.RemoteRepositoryCacheManager.createCache (RemoteRepositoryCacheManager.java:67)
    at org.eclipse.equinox.internal.p2.metadata.repository.CompositeMetadataRepositoryFactory.getLocalFile (CompositeMetadataRepositoryFactory.java:74)
    at org.eclipse.equinox.internal.p2.metadata.repository.CompositeMetadataRepositoryFactory.load (CompositeMetadataRepositoryFactory.java:97)
    at org.eclipse.equinox.internal.p2.metadata.repository.MetadataRepositoryManager.factoryLoad (MetadataRepositoryManager.java:60)
    at org.eclipse.equinox.internal.p2.repository.helpers.AbstractRepositoryManager.loadRepository (AbstractRepositoryManager.java:767)
    at org.eclipse.equinox.internal.p2.repository.helpers.AbstractRepositoryManager.loadRepository (AbstractRepositoryManager.java:668)
    at org.eclipse.equinox.internal.p2.metadata.repository.MetadataRepositoryManager.loadRepository (MetadataRepositoryManager.java:107)
    at org.eclipse.tycho.p2.remote.RemoteMetadataRepositoryManager.loadRepository (RemoteMetadataRepositoryManager.java:61)
    at org.eclipse.tycho.p2.remote.RemoteMetadataRepositoryManager.loadRepository (RemoteMetadataRepositoryManager.java:53)
    at org.eclipse.tycho.p2.target.TargetPlatformFactoryImpl.loadMetadataRepository (TargetPlatformFactoryImpl.java:298)
    at org.eclipse.tycho.p2.target.TargetPlatformFactoryImpl.gatherExternalInstallableUnits (TargetPlatformFactoryImpl.java:270)
    at org.eclipse.tycho.p2.target.TargetPlatformFactoryImpl.createTargetPlatform (TargetPlatformFactoryImpl.java:176)
    at org.eclipse.tycho.p2.target.TargetPlatformFactoryImpl.createTargetPlatform (TargetPlatformFactoryImpl.java:128)
    at org.eclipse.tycho.p2.target.TargetPlatformFactoryImpl.createTargetPlatform (TargetPlatformFactoryImpl.java:1)
    at org.eclipse.tycho.p2.manager.ReactorRepositoryManagerImpl.computePreliminaryTargetPlatform (ReactorRepositoryManagerImpl.java:84)
    at org.eclipse.tycho.p2.resolver.P2DependencyResolver.computePreliminaryTargetPlatform (P2DependencyResolver.java:223)
    at org.eclipse.tycho.core.resolver.DefaultTychoResolver.resolveProject (DefaultTychoResolver.java:109)
    at org.eclipse.tycho.core.maven.TychoMavenLifecycleParticipant.afterProjectsRead (TychoMavenLifecycleParticipant.java:95)
    at org.apache.maven.DefaultMaven.doExecute (DefaultMaven.java:264)
    at org.apache.maven.DefaultMaven.doExecute (DefaultMaven.java:192)
    at org.apache.maven.DefaultMaven.execute (DefaultMaven.java:105)
    at org.apache.maven.cli.MavenCli.execute (MavenCli.java:954)
    at org.apache.maven.cli.MavenCli.doMain (MavenCli.java:288)
    at org.apache.maven.cli.MavenCli.main (MavenCli.java:192)
    at sun.reflect.NativeMethodAccessorImpl.invoke0 (Native Method)
    at sun.reflect.NativeMethodAccessorImpl.invoke (NativeMethodAccessorImpl.java:62)
    at sun.reflect.DelegatingMethodAccessorImpl.invoke (DelegatingMethodAccessorImpl.java:43)
    at java.lang.reflect.Method.invoke (Method.java:498)
    at org.codehaus.plexus.classworlds.launcher.Launcher.launchEnhanced (Launcher.java:289)
    at org.codehaus.plexus.classworlds.launcher.Launcher.launch (Launcher.java:229)
    at org.codehaus.plexus.classworlds.launcher.Launcher.mainWithExitCode (Launcher.java:415)
    at org.codehaus.plexus.classworlds.launcher.Launcher.main (Launcher.java:356)
Caused by: org.eclipse.ecf.filetransfer.IncomingFileTransferException: HttpComponents connection error response code 502.
    at org.eclipse.ecf.provider.filetransfer.httpclient4.HttpClientRetrieveFileTransfer.openStreams (HttpClientRetrieveFileTransfer.java:667)
    at org.eclipse.ecf.provider.filetransfer.retrieve.AbstractRetrieveFileTransfer.sendRetrieveRequest (AbstractRetrieveFileTransfer.java:885)
    at org.eclipse.ecf.provider.filetransfer.retrieve.MultiProtocolRetrieveAdapter.sendRetrieveRequest (MultiProtocolRetrieveAdapter.java:146)
    at org.eclipse.equinox.internal.p2.transport.ecf.FileReader.sendRetrieveRequest (FileReader.java:439)
    at org.eclipse.equinox.internal.p2.transport.ecf.FileReader.readInto (FileReader.java:375)
    at org.eclipse.equinox.internal.p2.transport.ecf.RepositoryTransport.download (RepositoryTransport.java:102)
    at org.eclipse.equinox.internal.p2.transport.ecf.RepositoryTransport.download (RepositoryTransport.java:158)
    at org.eclipse.equinox.internal.p2.repository.CacheManager.updateCache (CacheManager.java:402)
    at org.eclipse.equinox.internal.p2.repository.CacheManager.createCache (CacheManager.java:259)
    at org.eclipse.tycho.p2.remote.RemoteRepositoryCacheManager.createCache (RemoteRepositoryCacheManager.java:67)
    at org.eclipse.equinox.internal.p2.metadata.repository.CompositeMetadataRepositoryFactory.getLocalFile (CompositeMetadataRepositoryFactory.java:74)
    at org.eclipse.equinox.internal.p2.metadata.repository.CompositeMetadataRepositoryFactory.load (CompositeMetadataRepositoryFactory.java:97)
    at org.eclipse.equinox.internal.p2.metadata.repository.MetadataRepositoryManager.factoryLoad (MetadataRepositoryManager.java:60)
    at org.eclipse.equinox.internal.p2.repository.helpers.AbstractRepositoryManager.loadRepository (AbstractRepositoryManager.java:767)
    at org.eclipse.equinox.internal.p2.repository.helpers.AbstractRepositoryManager.loadRepository (AbstractRepositoryManager.java:668)
    at org.eclipse.equinox.internal.p2.metadata.repository.MetadataRepositoryManager.loadRepository (MetadataRepositoryManager.java:107)
    at org.eclipse.tycho.p2.remote.RemoteMetadataRepositoryManager.loadRepository (RemoteMetadataRepositoryManager.java:61)
    at org.eclipse.tycho.p2.remote.RemoteMetadataRepositoryManager.loadRepository (RemoteMetadataRepositoryManager.java:53)
    at org.eclipse.tycho.p2.target.TargetPlatformFactoryImpl.loadMetadataRepository (TargetPlatformFactoryImpl.java:298)
    at org.eclipse.tycho.p2.target.TargetPlatformFactoryImpl.gatherExternalInstallableUnits (TargetPlatformFactoryImpl.java:270)
    at org.eclipse.tycho.p2.target.TargetPlatformFactoryImpl.createTargetPlatform (TargetPlatformFactoryImpl.java:176)
    at org.eclipse.tycho.p2.target.TargetPlatformFactoryImpl.createTargetPlatform (TargetPlatformFactoryImpl.java:128)
    at org.eclipse.tycho.p2.target.TargetPlatformFactoryImpl.createTargetPlatform (TargetPlatformFactoryImpl.java:1)
    at org.eclipse.tycho.p2.manager.ReactorRepositoryManagerImpl.computePreliminaryTargetPlatform (ReactorRepositoryManagerImpl.java:84)
    at org.eclipse.tycho.p2.resolver.P2DependencyResolver.computePreliminaryTargetPlatform (P2DependencyResolver.java:223)
    at org.eclipse.tycho.core.resolver.DefaultTychoResolver.resolveProject (DefaultTychoResolver.java:109)
    at org.eclipse.tycho.core.maven.TychoMavenLifecycleParticipant.afterProjectsRead (TychoMavenLifecycleParticipant.java:95)
    at org.apache.maven.DefaultMaven.doExecute (DefaultMaven.java:264)
    at org.apache.maven.DefaultMaven.doExecute (DefaultMaven.java:192)
    at org.apache.maven.DefaultMaven.execute (DefaultMaven.java:105)
    at org.apache.maven.cli.MavenCli.execute (MavenCli.java:954)
    at org.apache.maven.cli.MavenCli.doMain (MavenCli.java:288)
    at org.apache.maven.cli.MavenCli.main (MavenCli.java:192)
    at sun.reflect.NativeMethodAccessorImpl.invoke0 (Native Method)
    at sun.reflect.NativeMethodAccessorImpl.invoke (NativeMethodAccessorImpl.java:62)
    at sun.reflect.DelegatingMethodAccessorImpl.invoke (DelegatingMethodAccessorImpl.java:43)
    at java.lang.reflect.Method.invoke (Method.java:498)
    at org.codehaus.plexus.classworlds.launcher.Launcher.launchEnhanced (Launcher.java:289)
    at org.codehaus.plexus.classworlds.launcher.Launcher.launch (Launcher.java:229)
    at org.codehaus.plexus.classworlds.launcher.Launcher.mainWithExitCode (Launcher.java:415)
    at org.codehaus.plexus.classworlds.launcher.Launcher.main (Launcher.java:356)
[ERROR] 
[ERROR] To see the full stack trace of the errors, re-run Maven with the -e switch.
[ERROR] Re-run Maven using the -X switch to enable full debug logging.
[ERROR] 
[ERROR] For more information about the errors and possible solutions, please read the following articles:
[ERROR] [Help 1] http://cwiki.apache.org/confluence/display/MAVEN/InternalErrorException
Build step 'Invoke top-level Maven targets' marked build as failure
Taking screenshot.
[workspace] $ echo $XAUTHORITY
<https://ci.eclipse.org/webtools/job/webtools-dali_master/ws/.Xauthority-4527837969472965550>
[workspace] $ ls -l $XAUTHORITY
-rw-rw-r-- 1 genie.webtools webtools 0 Nov  8 00:33 <https://ci.eclipse.org/webtools/job/webtools-dali_master/ws/.Xauthority-4527837969472965550>
[workspace] $ import -window root -display :456 screenshot.jpg
Terminating xvnc.
[WARNINGS] Skipping publisher since build result is FAILURE
append disk usage
Started calculate disk usage of build
Finished Calculation of disk usage of build in 0 seconds
Started calculate disk usage of workspace
Finished Calculation of disk usage of workspace in  2 second