[Date Prev][Date Next][Thread Prev][Thread Next][Date Index][Thread Index] [List Home]
[wtp-releng] Build failed in Jenkins: webtools-jsf_master #339

See <https://ci.eclipse.org/webtools/job/webtools-jsf_master/339/display/redirect>

------------------------------------------
[...truncated 340.66 KB...]
Downloading from tycho-snapshot: https://repo.eclipse.org/content/repositories/tycho-snapshots/org/apache/commons/commons-lang3/3.1/commons-lang3-3.1.pom
Downloading from sonatype-public-grid: https://repository.sonatype.org/content/groups/sonatype-public-grid/org/apache/commons/commons-lang3/3.1/commons-lang3-3.1.pom
Progress (1): 4.1/17 kBProgress (1): 7.9/17 kBProgress (1): 7.9/17 kBProgress (1): 12/17 kB Progress (1): 16/17 kBProgress (1): 17 kB                      Downloaded from sonatype-public-grid: https://repository.sonatype.org/content/groups/sonatype-public-grid/org/apache/commons/commons-lang3/3.1/commons-lang3-3.1.pom (17 kB at 197 kB/s)
Downloading from tycho: https://oss.sonatype.org/content/repositories/public/org/apache/commons/commons-parent/22/commons-parent-22.pom
Downloading from cbi-repo: https://repo.eclipse.org/content/repositories/cbi/org/apache/commons/commons-parent/22/commons-parent-22.pom
Downloading from tycho-snapshot: https://repo.eclipse.org/content/repositories/tycho-snapshots/org/apache/commons/commons-parent/22/commons-parent-22.pom
Downloading from sonatype-public-grid: https://repository.sonatype.org/content/groups/sonatype-public-grid/org/apache/commons/commons-parent/22/commons-parent-22.pom
Progress (1): 4.1/42 kBProgress (1): 7.9/42 kBProgress (1): 12/42 kB Progress (1): 16/42 kBProgress (1): 20/42 kBProgress (1): 24/42 kBProgress (1): 28/42 kBProgress (1): 28/42 kBProgress (1): 32/42 kBProgress (1): 37/42 kBProgress (1): 41/42 kBProgress (1): 42 kB                      Downloaded from sonatype-public-grid: https://repository.sonatype.org/content/groups/sonatype-public-grid/org/apache/commons/commons-parent/22/commons-parent-22.pom (42 kB at 505 kB/s)
Downloading from tycho: https://oss.sonatype.org/content/repositories/public/org/eclipse/tycho/org.eclipse.tycho.surefire.osgibooter/1.2.0/org.eclipse.tycho.surefire.osgibooter-1.2.0.jar
Downloading from tycho: https://oss.sonatype.org/content/repositories/public/org/eclipse/tycho/org.eclipse.tycho.surefire.junit4/1.2.0/org.eclipse.tycho.surefire.junit4-1.2.0.jar
Downloading from tycho: https://oss.sonatype.org/content/repositories/public/org/eclipse/tycho/org.eclipse.tycho.surefire.junit5/1.2.0/org.eclipse.tycho.surefire.junit5-1.2.0.jar
Downloading from tycho: https://oss.sonatype.org/content/repositories/public/org/eclipse/tycho/org.eclipse.tycho.surefire.junit47/1.2.0/org.eclipse.tycho.surefire.junit47-1.2.0.jar
Downloading from tycho: https://oss.sonatype.org/content/repositories/public/org/eclipse/tycho/org.eclipse.tycho.surefire.junit/1.2.0/org.eclipse.tycho.surefire.junit-1.2.0.jar
Progress (1): 4.1/58 kBProgress (1): 7.8/58 kBProgress (1): 12/58 kB Progress (1): 12/58 kBProgress (2): 12/58 kB | 4.1/411 kBProgress (2): 12/58 kB | 7.8/411 kBProgress (2): 12/58 kB | 12/411 kB Progress (2): 12/58 kB | 12/411 kBProgress (2): 16/58 kB | 12/411 kBProgress (2): 20/58 kB | 12/411 kBProgress (2): 24/58 kB | 12/411 kBProgress (2): 28/58 kB | 12/411 kBProgress (2): 28/58 kB | 16/411 kBProgress (2): 28/58 kB | 20/411 kBProgress (2): 28/58 kB | 24/411 kBProgress (2): 28/58 kB | 28/411 kBProgress (3): 28/58 kB | 28/411 kB | 4.1/25 kBProgress (3): 28/58 kB | 28/411 kB | 7.8/25 kBProgress (3): 28/58 kB | 28/411 kB | 12/25 kB Progress (3): 28/58 kB | 28/411 kB | 16/25 kBProgress (3): 28/58 kB | 28/411 kB | 20/25 kBProgress (3): 28/58 kB | 28/411 kB | 24/25 kBProgress (3): 28/58 kB | 28/411 kB | 25 kB   Progress (3): 32/58 kB | 28/411 kB | 25 kBProgress (3): 37/58 kB | 28/411 kB | 25 kBProgress (3): 41/58 kB | 28/411 kB | 25 kBProgress (3): 45/58 kB | 28/411 kB | 25 kBProgress (3): 49/58 kB | 28/411 kB | 25 kBProgress (3): 53/58 kB | 28/411 kB | 25 kBProgress (3): 57/58 kB | 28/411 kB | 25 kBProgress (3): 58 kB | 28/411 kB | 25 kB   Progress (3): 58 kB | 32/411 kB | 25 kBProgress (3): 58 kB | 37/411 kB | 25 kBProgress (3): 58 kB | 41/411 kB | 25 kBProgress (3): 58 kB | 45/411 kB | 25 kBProgress (3): 58 kB | 49/411 kB | 25 kBProgress (3): 58 kB | 53/411 kB | 25 kBProgress (3): 58 kB | 57/411 kB | 25 kBProgress (3): 58 kB | 61/411 kB | 25 kBProgress (3): 58 kB | 65/411 kB | 25 kBProgress (3): 58 kB | 69/411 kB | 25 kBProgress (3): 58 kB | 73/411 kB | 25 kBProgress (3): 58 kB | 77/411 kB | 25 kBProgress (3): 58 kB | 82/411 kB | 25 kBProgress (3): 58 kB | 86/411 kB | 25 kBProgress (3): 58 kB | 90/411 kB | 25 kBProgress (3): 58 kB | 94/411 kB | 25 kBProgress (3): 58 kB | 98/411 kB | 25 kBProgress (3): 58 kB | 102/411 kB | 25 kBProgress (3): 58 kB | 106/411 kB | 25 kBProgress (3): 58 kB | 110/411 kB | 25 kBProgress (3): 58 kB | 114/411 kB | 25 kBProgress (3): 58 kB | 118/411 kB | 25 kBProgress (3): 58 kB | 123/411 kB | 25 kBProgress (3): 58 kB | 127/411 kB | 25 kBProgress (3): 58 kB | 131/411 kB | 25 kBProgress (3): 58 kB | 135/411 kB | 25 kBProgress (3): 58 kB | 139/411 kB | 25 kBProgress (3): 58 kB | 143/411 kB | 25 kBProgress (3): 58 kB | 147/411 kB | 25 kBProgress (3): 58 kB | 151/411 kB | 25 kBProgress (3): 58 kB | 155/411 kB | 25 kBProgress (3): 58 kB | 159/411 kB | 25 kBProgress (3): 58 kB | 164/411 kB | 25 kBProgress (3): 58 kB | 168/411 kB | 25 kBProgress (3): 58 kB | 172/411 kB | 25 kBProgress (3): 58 kB | 176/411 kB | 25 kBProgress (3): 58 kB | 180/411 kB | 25 kBProgress (3): 58 kB | 184/411 kB | 25 kBProgress (3): 58 kB | 188/411 kB | 25 kBProgress (3): 58 kB | 192/411 kB | 25 kBProgress (3): 58 kB | 196/411 kB | 25 kBProgress (3): 58 kB | 200/411 kB | 25 kBProgress (3): 58 kB | 204/411 kB | 25 kBProgress (3): 58 kB | 209/411 kB | 25 kBProgress (3): 58 kB | 213/411 kB | 25 kBProgress (3): 58 kB | 217/411 kB | 25 kBProgress (3): 58 kB | 221/411 kB | 25 kBProgress (3): 58 kB | 225/411 kB | 25 kBProgress (3): 58 kB | 229/411 kB | 25 kBProgress (3): 58 kB | 233/411 kB | 25 kBProgress (3): 58 kB | 237/411 kB | 25 kB                                        Downloaded from tycho: https://oss.sonatype.org/content/repositories/public/org/eclipse/tycho/org.eclipse.tycho.surefire.junit4/1.2.0/org.eclipse.tycho.surefire.junit4-1.2.0.jar (58 kB at 98 kB/s)
Downloaded from tycho: https://oss.sonatype.org/content/repositories/public/org/eclipse/tycho/org.eclipse.tycho.surefire.junit/1.2.0/org.eclipse.tycho.surefire.junit-1.2.0.jar (25 kB at 42 kB/s)
Progress (1): 241/411 kB                        Downloading from tycho: https://oss.sonatype.org/content/repositories/public/org/apache/maven/surefire/surefire-api/2.19.1/surefire-api-2.19.1.jar
Downloading from tycho: https://oss.sonatype.org/content/repositories/public/org/eclipse/tycho/org.eclipse.tycho.surefire.testng/1.2.0/org.eclipse.tycho.surefire.testng-1.2.0.jar
Progress (1): 245/411 kBProgress (1): 250/411 kBProgress (1): 254/411 kBProgress (1): 258/411 kBProgress (1): 262/411 kBProgress (1): 266/411 kBProgress (1): 270/411 kBProgress (1): 274/411 kBProgress (1): 278/411 kBProgress (1): 282/411 kBProgress (1): 286/411 kBProgress (1): 290/411 kBProgress (1): 295/411 kBProgress (1): 299/411 kBProgress (1): 303/411 kBProgress (1): 307/411 kBProgress (1): 311/411 kBProgress (1): 315/411 kBProgress (1): 319/411 kBProgress (1): 323/411 kBProgress (1): 327/411 kBProgress (1): 331/411 kBProgress (1): 336/411 kBProgress (1): 340/411 kBProgress (1): 344/411 kBProgress (1): 348/411 kBProgress (1): 352/411 kBProgress (1): 356/411 kBProgress (1): 360/411 kBProgress (1): 364/411 kBProgress (1): 368/411 kBProgress (1): 372/411 kBProgress (1): 376/411 kBProgress (1): 381/411 kBProgress (1): 385/411 kBProgress (1): 389/411 kBProgress (1): 393/411 kBProgress (1): 397/411 kBProgress (1): 401/411 kBProgress (1): 405/411 kBProgress (1): 409/411 kBProgress (1): 411 kB                        Downloading from tycho: https://oss.sonatype.org/content/repositories/public/org/apache/maven/surefire/maven-surefire-common/2.19.1/maven-surefire-common-2.19.1.jar
Progress (2): 411 kB | 4.1/103 kBProgress (2): 411 kB | 7.8/103 kBProgress (2): 411 kB | 12/103 kB Progress (2): 411 kB | 16/103 kBProgress (2): 411 kB | 20/103 kBProgress (2): 411 kB | 24/103 kBProgress (2): 411 kB | 28/103 kBProgress (2): 411 kB | 28/103 kBProgress (2): 411 kB | 32/103 kBProgress (2): 411 kB | 37/103 kBProgress (2): 411 kB | 41/103 kBProgress (2): 411 kB | 45/103 kB                                Downloaded from tycho: https://oss.sonatype.org/content/repositories/public/org/eclipse/tycho/org.eclipse.tycho.surefire.junit5/1.2.0/org.eclipse.tycho.surefire.junit5-1.2.0.jar (411 kB at 594 kB/s)
Downloading from tycho: https://oss.sonatype.org/content/repositories/public/org/apache/maven/surefire/surefire-booter/2.19.1/surefire-booter-2.19.1.jar
Progress (1): 49/103 kBProgress (1): 53/103 kBProgress (1): 57/103 kBProgress (1): 57/103 kBProgress (1): 61/103 kBProgress (1): 66/103 kBProgress (1): 70/103 kBProgress (1): 74/103 kBProgress (1): 78/103 kBProgress (1): 82/103 kBProgress (1): 86/103 kBProgress (1): 90/103 kB                       Downloading from tycho: https://oss.sonatype.org/content/repositories/public/org/apache/maven/maven-plugin-descriptor/2.2.1/maven-plugin-descriptor-2.2.1.jar
Progress (1): 94/103 kBProgress (1): 98/103 kBProgress (1): 102/103 kBProgress (1): 103 kB                        Downloaded from tycho: https://oss.sonatype.org/content/repositories/public/org/eclipse/tycho/org.eclipse.tycho.surefire.testng/1.2.0/org.eclipse.tycho.surefire.testng-1.2.0.jar (103 kB at 124 kB/s)
Downloading from tycho: https://oss.sonatype.org/content/repositories/public/org/apache/maven/maven-project/2.2.1/maven-project-2.2.1.jar
Downloading from tycho: https://oss.sonatype.org/content/repositories/public/org/apache/maven/maven-profile/2.2.1/maven-profile-2.2.1.jar
Downloading from tycho: https://oss.sonatype.org/content/repositories/public/org/apache/maven/maven-artifact-manager/2.2.1/maven-artifact-manager-2.2.1.jar
Downloading from tycho: https://oss.sonatype.org/content/repositories/public/backport-util-concurrent/backport-util-concurrent/3.1/backport-util-concurrent-3.1.jar
Downloading from tycho: https://oss.sonatype.org/content/repositories/public/org/apache/maven/maven-plugin-registry/2.2.1/maven-plugin-registry-2.2.1.jar
Downloading from tycho: https://oss.sonatype.org/content/repositories/public/org/apache/maven/maven-toolchain/2.2.1/maven-toolchain-2.2.1.jar
Downloading from tycho: https://oss.sonatype.org/content/repositories/public/org/apache/commons/commons-lang3/3.1/commons-lang3-3.1.jar
Progress (1): 4.1/496 kBProgress (1): 7.8/496 kBProgress (2): 7.8/496 kB | 4.1/181 kBProgress (2): 12/496 kB | 4.1/181 kB Progress (2): 12/496 kB | 7.8/181 kBProgress (2): 16/496 kB | 7.8/181 kBProgress (2): 16/496 kB | 12/181 kB Progress (2): 16/496 kB | 12/181 kBProgress (2): 16/496 kB | 16/181 kBProgress (2): 16/496 kB | 20/181 kBProgress (2): 16/496 kB | 24/181 kBProgress (2): 16/496 kB | 24/181 kBProgress (2): 20/496 kB | 24/181 kBProgress (2): 24/496 kB | 24/181 kBProgress (2): 28/496 kB | 24/181 kBProgress (2): 28/496 kB | 28/181 kBProgress (2): 32/496 kB | 28/181 kBProgress (2): 32/496 kB | 32/181 kBProgress (2): 32/496 kB | 33/181 kBProgress (2): 32/496 kB | 37/181 kBProgress (2): 32/496 kB | 41/181 kBProgress (2): 37/496 kB | 41/181 kBProgress (2): 37/496 kB | 45/181 kBProgress (2): 41/496 kB | 45/181 kBProgress (2): 41/496 kB | 49/181 kBProgress (2): 45/496 kB | 49/181 kBProgress (2): 45/496 kB | 53/181 kBProgress (2): 49/496 kB | 53/181 kBProgress (2): 53/496 kB | 53/181 kBProgress (2): 57/496 kB | 53/181 kBProgress (2): 61/496 kB | 53/181 kBProgress (2): 65/496 kB | 53/181 kBProgress (2): 69/496 kB | 53/181 kBProgress (2): 69/496 kB | 57/181 kBProgress (2): 73/496 kB | 57/181 kBProgress (2): 73/496 kB | 61/181 kBProgress (2): 77/496 kB | 61/181 kBProgress (2): 77/496 kB | 66/181 kBProgress (2): 82/496 kB | 66/181 kBProgress (2): 82/496 kB | 70/181 kBProgress (2): 86/496 kB | 70/181 kBProgress (2): 86/496 kB | 74/181 kBProgress (2): 90/496 kB | 74/181 kBProgress (2): 90/496 kB | 78/181 kBProgress (2): 94/496 kB | 78/181 kBProgress (2): 94/496 kB | 82/181 kBProgress (2): 98/496 kB | 82/181 kBProgress (2): 98/496 kB | 86/181 kBProgress (2): 98/496 kB | 90/181 kBProgress (2): 98/496 kB | 94/181 kBProgress (2): 98/496 kB | 98/181 kBProgress (2): 98/496 kB | 102/181 kBProgress (2): 102/496 kB | 102/181 kBProgress (2): 106/496 kB | 102/181 kBProgress (2): 110/496 kB | 102/181 kBProgress (2): 114/496 kB | 102/181 kBProgress (2): 118/496 kB | 102/181 kBProgress (2): 123/496 kB | 102/181 kBProgress (2): 127/496 kB | 102/181 kBProgress (2): 131/496 kB | 102/181 kBProgress (2): 131/496 kB | 106/181 kBProgress (2): 131/496 kB | 111/181 kBProgress (2): 131/496 kB | 115/181 kBProgress (2): 131/496 kB | 119/181 kBProgress (2): 135/496 kB | 119/181 kBProgress (2): 139/496 kB | 119/181 kBProgress (2): 143/496 kB | 119/181 kBProgress (2): 147/496 kB | 119/181 kBProgress (2): 147/496 kB | 123/181 kBProgress (2): 147/496 kB | 127/181 kBProgress (2): 147/496 kB | 131/181 kBProgress (2): 147/496 kB | 135/181 kBProgress (2): 151/496 kB | 135/181 kBProgress (2): 155/496 kB | 135/181 kBProgress (2): 159/496 kB | 135/181 kBProgress (2): 164/496 kB | 135/181 kBProgress (2): 164/496 kB | 139/181 kBProgress (2): 164/496 kB | 143/181 kBProgress (2): 164/496 kB | 147/181 kBProgress (2): 164/496 kB | 152/181 kBProgress (2): 168/496 kB | 152/181 kBProgress (2): 172/496 kB | 152/181 kBProgress (2): 176/496 kB | 152/181 kBProgress (2): 180/496 kB | 152/181 kBProgress (2): 180/496 kB | 156/181 kBProgress (2): 180/496 kB | 160/181 kBProgress (2): 184/496 kB | 160/181 kBProgress (2): 184/496 kB | 164/181 kBProgress (2): 188/496 kB | 164/181 kBProgress (2): 188/496 kB | 168/181 kBProgress (2): 192/496 kB | 168/181 kBProgress (2): 196/496 kB | 168/181 kBProgress (2): 196/496 kB | 172/181 kBProgress (2): 196/496 kB | 176/181 kBProgress (2): 196/496 kB | 180/181 kBProgress (2): 196/496 kB | 181 kB    Progress (2): 200/496 kB | 181 kBProgress (2): 204/496 kB | 181 kBProgress (2): 209/496 kB | 181 kBProgress (2): 213/496 kB | 181 kBProgress (2): 217/496 kB | 181 kBProgress (2): 221/496 kB | 181 kBProgress (2): 225/496 kB | 181 kBProgress (2): 229/496 kB | 181 kBProgress (2): 233/496 kB | 181 kBProgress (2): 237/496 kB | 181 kBProgress (2): 241/496 kB | 181 kBProgress (2): 245/496 kB | 181 kBProgress (2): 250/496 kB | 181 kBProgress (2): 254/496 kB | 181 kBProgress (2): 258/496 kB | 181 kBProgress (2): 262/496 kB | 181 kBProgress (2): 266/496 kB | 181 kBProgress (2): 270/496 kB | 181 kBProgress (2): 274/496 kB | 181 kBProgress (2): 278/496 kB | 181 kBProgress (2): 282/496 kB | 181 kBProgress (2): 286/496 kB | 181 kBProgress (2): 290/496 kB | 181 kBProgress (2): 295/496 kB | 181 kBProgress (2): 299/496 kB | 181 kBProgress (2): 303/496 kB | 181 kBProgress (2): 307/496 kB | 181 kBProgress (2): 311/496 kB | 181 kBProgress (2): 315/496 kB | 181 kBProgress (2): 319/496 kB | 181 kBProgress (2): 323/496 kB | 181 kBProgress (2): 327/496 kB | 181 kBProgress (2): 331/496 kB | 181 kBProgress (2): 336/496 kB | 181 kBProgress (2): 340/496 kB | 181 kBProgress (2): 344/496 kB | 181 kBProgress (2): 348/496 kB | 181 kBProgress (2): 352/496 kB | 181 kBProgress (2): 356/496 kB | 181 kBProgress (2): 360/496 kB | 181 kBProgress (2): 364/496 kB | 181 kBProgress (2): 368/496 kB | 181 kBProgress (2): 372/496 kB | 181 kBProgress (2): 376/496 kB | 181 kBProgress (2): 381/496 kB | 181 kBProgress (2): 385/496 kB | 181 kBProgress (2): 389/496 kB | 181 kBProgress (2): 393/496 kB | 181 kBProgress (2): 397/496 kB | 181 kBProgress (2): 401/496 kB | 181 kBProgress (2): 405/496 kB | 181 kBProgress (2): 409/496 kB | 181 kBProgress (2): 413/496 kB | 181 kBProgress (2): 417/496 kB | 181 kBProgress (2): 422/496 kB | 181 kBProgress (2): 426/496 kB | 181 kBProgress (2): 430/496 kB | 181 kBProgress (2): 434/496 kB | 181 kBProgress (2): 438/496 kB | 181 kBProgress (2): 442/496 kB | 181 kBProgress (2): 446/496 kB | 181 kBProgress (2): 450/496 kB | 181 kBProgress (2): 454/496 kB | 181 kBProgress (2): 458/496 kB | 181 kBProgress (2): 463/496 kB | 181 kBProgress (2): 467/496 kB | 181 kBProgress (2): 471/496 kB | 181 kBProgress (2): 475/496 kB | 181 kBProgress (2): 479/496 kB | 181 kBProgress (2): 483/496 kB | 181 kBProgress (2): 487/496 kB | 181 kBProgress (2): 491/496 kB | 181 kBProgress (2): 495/496 kB | 181 kBProgress (2): 496 kB | 181 kB                                 Downloaded from tycho: https://oss.sonatype.org/content/repositories/public/org/eclipse/tycho/org.eclipse.tycho.surefire.junit47/1.2.0/org.eclipse.tycho.surefire.junit47-1.2.0.jar (181 kB at 15 kB/s)
Downloaded from tycho: https://oss.sonatype.org/content/repositories/public/org/eclipse/tycho/org.eclipse.tycho.surefire.osgibooter/1.2.0/org.eclipse.tycho.surefire.osgibooter-1.2.0.jar (496 kB at 41 kB/s)
Downloading from cbi-repo: https://repo.eclipse.org/content/repositories/cbi/org/apache/maven/surefire/surefire-api/2.19.1/surefire-api-2.19.1.jar
Downloading from cbi-repo: https://repo.eclipse.org/content/repositories/cbi/org/apache/maven/surefire/maven-surefire-common/2.19.1/maven-surefire-common-2.19.1.jar
Downloading from cbi-repo: https://repo.eclipse.org/content/repositories/cbi/org/apache/maven/maven-project/2.2.1/maven-project-2.2.1.jar
Downloading from cbi-repo: https://repo.eclipse.org/content/repositories/cbi/org/apache/maven/surefire/surefire-booter/2.19.1/surefire-booter-2.19.1.jar
Downloading from cbi-repo: https://repo.eclipse.org/content/repositories/cbi/org/apache/maven/maven-plugin-descriptor/2.2.1/maven-plugin-descriptor-2.2.1.jar
Downloading from cbi-repo: https://repo.eclipse.org/content/repositories/cbi/org/apache/maven/maven-profile/2.2.1/maven-profile-2.2.1.jar
Downloading from cbi-repo: https://repo.eclipse.org/content/repositories/cbi/org/apache/maven/maven-artifact-manager/2.2.1/maven-artifact-manager-2.2.1.jar
Downloading from cbi-repo: https://repo.eclipse.org/content/repositories/cbi/backport-util-concurrent/backport-util-concurrent/3.1/backport-util-concurrent-3.1.jar
Downloading from cbi-repo: https://repo.eclipse.org/content/repositories/cbi/org/apache/maven/maven-plugin-registry/2.2.1/maven-plugin-registry-2.2.1.jar
Downloading from cbi-repo: https://repo.eclipse.org/content/repositories/cbi/org/apache/maven/maven-toolchain/2.2.1/maven-toolchain-2.2.1.jar
Downloading from cbi-repo: https://repo.eclipse.org/content/repositories/cbi/org/apache/commons/commons-lang3/3.1/commons-lang3-3.1.jar
Downloading from tycho-snapshot: https://repo.eclipse.org/content/repositories/tycho-snapshots/org/apache/maven/surefire/surefire-api/2.19.1/surefire-api-2.19.1.jar
Downloading from tycho-snapshot: https://repo.eclipse.org/content/repositories/tycho-snapshots/org/apache/maven/maven-plugin-descriptor/2.2.1/maven-plugin-descriptor-2.2.1.jar
Downloading from tycho-snapshot: https://repo.eclipse.org/content/repositories/tycho-snapshots/org/apache/maven/surefire/surefire-booter/2.19.1/surefire-booter-2.19.1.jar
Downloading from tycho-snapshot: https://repo.eclipse.org/content/repositories/tycho-snapshots/org/apache/maven/surefire/maven-surefire-common/2.19.1/maven-surefire-common-2.19.1.jar
Downloading from tycho-snapshot: https://repo.eclipse.org/content/repositories/tycho-snapshots/org/apache/maven/maven-project/2.2.1/maven-project-2.2.1.jar
Downloading from tycho-snapshot: https://repo.eclipse.org/content/repositories/tycho-snapshots/org/apache/maven/maven-profile/2.2.1/maven-profile-2.2.1.jar
Downloading from tycho-snapshot: https://repo.eclipse.org/content/repositories/tycho-snapshots/org/apache/maven/maven-artifact-manager/2.2.1/maven-artifact-manager-2.2.1.jar
Downloading from tycho-snapshot: https://repo.eclipse.org/content/repositories/tycho-snapshots/backport-util-concurrent/backport-util-concurrent/3.1/backport-util-concurrent-3.1.jar
Downloading from tycho-snapshot: https://repo.eclipse.org/content/repositories/tycho-snapshots/org/apache/maven/maven-plugin-registry/2.2.1/maven-plugin-registry-2.2.1.jar
Downloading from tycho-snapshot: https://repo.eclipse.org/content/repositories/tycho-snapshots/org/apache/maven/maven-toolchain/2.2.1/maven-toolchain-2.2.1.jar
Downloading from tycho-snapshot: https://repo.eclipse.org/content/repositories/tycho-snapshots/org/apache/commons/commons-lang3/3.1/commons-lang3-3.1.jar
Downloading from sonatype-public-grid: https://repository.sonatype.org/content/groups/sonatype-public-grid/org/apache/maven/surefire/surefire-api/2.19.1/surefire-api-2.19.1.jar
Downloading from sonatype-public-grid: https://repository.sonatype.org/content/groups/sonatype-public-grid/org/apache/maven/surefire/maven-surefire-common/2.19.1/maven-surefire-common-2.19.1.jar
Downloading from sonatype-public-grid: https://repository.sonatype.org/content/groups/sonatype-public-grid/org/apache/maven/maven-project/2.2.1/maven-project-2.2.1.jar
Downloading from sonatype-public-grid: https://repository.sonatype.org/content/groups/sonatype-public-grid/org/apache/maven/maven-plugin-descriptor/2.2.1/maven-plugin-descriptor-2.2.1.jar
Downloading from sonatype-public-grid: https://repository.sonatype.org/content/groups/sonatype-public-grid/org/apache/maven/surefire/surefire-booter/2.19.1/surefire-booter-2.19.1.jar
Progress (1): 4.1/196 kBProgress (1): 7.8/196 kBProgress (1): 7.9/196 kBProgress (1): 12/196 kB Progress (1): 16/196 kBProgress (1): 20/196 kBProgress (1): 24/196 kBProgress (1): 28/196 kBProgress (1): 32/196 kBProgress (1): 37/196 kBProgress (1): 41/196 kBProgress (1): 45/196 kBProgress (1): 49/196 kBProgress (1): 53/196 kBProgress (1): 57/196 kBProgress (1): 61/196 kBProgress (1): 65/196 kBProgress (1): 69/196 kBProgress (1): 73/196 kBProgress (2): 73/196 kB | 4.1/156 kBProgress (2): 73/196 kB | 7.8/156 kBProgress (2): 73/196 kB | 12/156 kB Progress (2): 73/196 kB | 16/156 kBProgress (2): 73/196 kB | 20/156 kBProgress (2): 73/196 kB | 20/156 kBProgress (2): 73/196 kB | 24/156 kBProgress (2): 73/196 kB | 28/156 kBProgress (2): 73/196 kB | 32/156 kBProgress (2): 73/196 kB | 37/156 kBProgress (2): 73/196 kB | 41/156 kBProgress (2): 73/196 kB | 45/156 kBProgress (2): 73/196 kB | 49/156 kBProgress (2): 73/196 kB | 53/156 kBProgress (2): 73/196 kB | 57/156 kBProgress (2): 73/196 kB | 61/156 kBProgress (2): 73/196 kB | 61/156 kBProgress (2): 73/196 kB | 66/156 kBProgress (2): 73/196 kB | 70/156 kBProgress (2): 73/196 kB | 74/156 kBProgress (2): 73/196 kB | 78/156 kBProgress (2): 73/196 kB | 82/156 kBProgress (2): 73/196 kB | 86/156 kBProgress (2): 73/196 kB | 88/156 kBProgress (2): 73/196 kB | 92/156 kBProgress (2): 73/196 kB | 96/156 kBProgress (2): 73/196 kB | 101/156 kBProgress (2): 73/196 kB | 105/156 kBProgress (2): 73/196 kB | 109/156 kBProgress (2): 73/196 kB | 113/156 kBProgress (2): 73/196 kB | 117/156 kBProgress (2): 73/196 kB | 121/156 kBProgress (2): 73/196 kB | 125/156 kBProgress (2): 73/196 kB | 129/156 kBProgress (2): 73/196 kB | 133/156 kBProgress (2): 73/196 kB | 137/156 kBProgress (2): 73/196 kB | 142/156 kBProgress (2): 73/196 kB | 146/156 kBProgress (2): 73/196 kB | 150/156 kBProgress (2): 73/196 kB | 154/156 kBProgress (2): 73/196 kB | 156 kB    Progress (2): 77/196 kB | 156 kBProgress (2): 82/196 kB | 156 kBProgress (2): 86/196 kB | 156 kBProgress (2): 90/196 kB | 156 kBProgress (2): 94/196 kB | 156 kBProgress (2): 98/196 kB | 156 kBProgress (2): 102/196 kB | 156 kBProgress (2): 106/196 kB | 156 kBProgress (2): 110/196 kB | 156 kBProgress (2): 114/196 kB | 156 kBProgress (2): 118/196 kB | 156 kBProgress (2): 123/196 kB | 156 kBProgress (2): 127/196 kB | 156 kBProgress (2): 131/196 kB | 156 kBProgress (2): 135/196 kB | 156 kBProgress (2): 139/196 kB | 156 kBProgress (2): 143/196 kB | 156 kBProgress (2): 147/196 kB | 156 kBProgress (2): 151/196 kB | 156 kBProgress (2): 155/196 kB | 156 kBProgress (2): 159/196 kB | 156 kBProgress (2): 164/196 kB | 156 kBProgress (2): 168/196 kB | 156 kBProgress (2): 172/196 kB | 156 kBProgress (2): 176/196 kB | 156 kBProgress (2): 180/196 kB | 156 kBProgress (2): 184/196 kB | 156 kBProgress (2): 188/196 kB | 156 kBProgress (2): 192/196 kB | 156 kBProgress (2): 196 kB | 156 kB    Progress (3): 196 kB | 156 kB | 4.1/39 kBProgress (3): 196 kB | 156 kB | 7.8/39 kBProgress (3): 196 kB | 156 kB | 7.9/39 kBProgress (3): 196 kB | 156 kB | 12/39 kB Progress (3): 196 kB | 156 kB | 16/39 kBProgress (3): 196 kB | 156 kB | 20/39 kBProgress (3): 196 kB | 156 kB | 24/39 kBProgress (3): 196 kB | 156 kB | 28/39 kBProgress (3): 196 kB | 156 kB | 32/39 kBProgress (3): 196 kB | 156 kB | 37/39 kBProgress (3): 196 kB | 156 kB | 39 kB                                        Downloaded from sonatype-public-grid: https://repository.sonatype.org/content/groups/sonatype-public-grid/org/apache/maven/maven-plugin-descriptor/2.2.1/maven-plugin-descriptor-2.2.1.jar (39 kB at 134 kB/s)
Downloading from sonatype-public-grid: https://repository.sonatype.org/content/groups/sonatype-public-grid/org/apache/maven/maven-profile/2.2.1/maven-profile-2.2.1.jar
Downloaded from sonatype-public-grid: https://repository.sonatype.org/content/groups/sonatype-public-grid/org/apache/maven/maven-project/2.2.1/maven-project-2.2.1.jar (156 kB at 511 kB/s)
Downloaded from sonatype-public-grid: https://repository.sonatype.org/content/groups/sonatype-public-grid/org/apache/maven/surefire/surefire-api/2.19.1/surefire-api-2.19.1.jar (196 kB at 639 kB/s)
Downloading from sonatype-public-grid: https://repository.sonatype.org/content/groups/sonatype-public-grid/backport-util-concurrent/backport-util-concurrent/3.1/backport-util-concurrent-3.1.jar
Downloading from sonatype-public-grid: https://repository.sonatype.org/content/groups/sonatype-public-grid/org/apache/maven/maven-artifact-manager/2.2.1/maven-artifact-manager-2.2.1.jar
Progress (1): 4.1/35 kBProgress (1): 7.8/35 kBProgress (1): 12/35 kB Progress (1): 16/35 kBProgress (1): 20/35 kBProgress (1): 20/35 kBProgress (1): 24/35 kBProgress (1): 28/35 kBProgress (1): 32/35 kBProgress (1): 35 kB   Progress (2): 35 kB | 4.1/332 kBProgress (2): 35 kB | 7.8/332 kBProgress (2): 35 kB | 12/332 kB Progress (2): 35 kB | 16/332 kBProgress (2): 35 kB | 20/332 kBProgress (2): 35 kB | 20/332 kBProgress (2): 35 kB | 24/332 kBProgress (2): 35 kB | 28/332 kBProgress (2): 35 kB | 32/332 kBProgress (2): 35 kB | 37/332 kBProgress (2): 35 kB | 41/332 kBProgress (2): 35 kB | 45/332 kBProgress (2): 35 kB | 49/332 kBProgress (2): 35 kB | 53/332 kBProgress (2): 35 kB | 57/332 kBProgress (2): 35 kB | 61/332 kBProgress (2): 35 kB | 65/332 kBProgress (2): 35 kB | 69/332 kBProgress (2): 35 kB | 73/332 kBProgress (2): 35 kB | 77/332 kBProgress (2): 35 kB | 82/332 kBProgress (2): 35 kB | 86/332 kBProgress (3): 35 kB | 86/332 kB | 4.1/68 kBProgress (3): 35 kB | 86/332 kB | 7.8/68 kBProgress (3): 35 kB | 86/332 kB | 12/68 kB Progress (3): 35 kB | 90/332 kB | 12/68 kBProgress (3): 35 kB | 90/332 kB | 12/68 kBProgress (3): 35 kB | 94/332 kB | 12/68 kBProgress (3): 35 kB | 98/332 kB | 12/68 kBProgress (3): 35 kB | 102/332 kB | 12/68 kBProgress (3): 35 kB | 102/332 kB | 16/68 kBProgress (3): 35 kB | 102/332 kB | 20/68 kBProgress (3): 35 kB | 106/332 kB | 20/68 kBProgress (3): 35 kB | 110/332 kB | 20/68 kBProgress (3): 35 kB | 114/332 kB | 20/68 kBProgress (3): 35 kB | 114/332 kB | 24/68 kBProgress (3): 35 kB | 118/332 kB | 24/68 kBProgress (3): 35 kB | 118/332 kB | 28/68 kBProgress (3): 35 kB | 118/332 kB | 32/68 kBProgress (3): 35 kB | 118/332 kB | 37/68 kBProgress (3): 35 kB | 123/332 kB | 37/68 kBProgress (3): 35 kB | 127/332 kB | 37/68 kBProgress (3): 35 kB | 127/332 kB | 41/68 kBProgress (3): 35 kB | 131/332 kB | 41/68 kBProgress (3): 35 kB | 131/332 kB | 45/68 kBProgress (3): 35 kB | 135/332 kB | 45/68 kBProgress (3): 35 kB | 135/332 kB | 49/68 kBProgress (3): 35 kB | 135/332 kB | 49/68 kBProgress (3): 35 kB | 139/332 kB | 49/68 kBProgress (3): 35 kB | 143/332 kB | 49/68 kBProgress (3): 35 kB | 143/332 kB | 53/68 kBProgress (3): 35 kB | 147/332 kB | 53/68 kBProgress (3): 35 kB | 147/332 kB | 57/68 kBProgress (3): 35 kB | 151/332 kB | 57/68 kBProgress (3): 35 kB | 151/332 kB | 61/68 kBProgress (3): 35 kB | 151/332 kB | 66/68 kBProgress (3): 35 kB | 151/332 kB | 68 kB   Progress (3): 35 kB | 155/332 kB | 68 kBProgress (3): 35 kB | 159/332 kB | 68 kBProgress (3): 35 kB | 164/332 kB | 68 kBProgress (3): 35 kB | 168/332 kB | 68 kBProgress (3): 35 kB | 172/332 kB | 68 kBProgress (3): 35 kB | 176/332 kB | 68 kBProgress (3): 35 kB | 180/332 kB | 68 kBProgress (3): 35 kB | 184/332 kB | 68 kBProgress (3): 35 kB | 188/332 kB | 68 kBProgress (3): 35 kB | 192/332 kB | 68 kBProgress (3): 35 kB | 196/332 kB | 68 kBProgress (3): 35 kB | 200/332 kB | 68 kBProgress (3): 35 kB | 204/332 kB | 68 kBProgress (3): 35 kB | 209/332 kB | 68 kBProgress (3): 35 kB | 213/332 kB | 68 kBProgress (3): 35 kB | 217/332 kB | 68 kBProgress (3): 35 kB | 221/332 kB | 68 kBProgress (3): 35 kB | 225/332 kB | 68 kBProgress (3): 35 kB | 229/332 kB | 68 kBProgress (3): 35 kB | 233/332 kB | 68 kBProgress (3): 35 kB | 237/332 kB | 68 kBProgress (3): 35 kB | 241/332 kB | 68 kBProgress (3): 35 kB | 245/332 kB | 68 kBProgress (3): 35 kB | 250/332 kB | 68 kBProgress (3): 35 kB | 254/332 kB | 68 kBProgress (3): 35 kB | 258/332 kB | 68 kBProgress (3): 35 kB | 262/332 kB | 68 kBProgress (3): 35 kB | 266/332 kB | 68 kBProgress (3): 35 kB | 270/332 kB | 68 kBProgress (3): 35 kB | 274/332 kB | 68 kBProgress (3): 35 kB | 278/332 kB | 68 kBProgress (3): 35 kB | 282/332 kB | 68 kB                                        Downloaded from sonatype-public-grid: https://repository.sonatype.org/content/groups/sonatype-public-grid/org/apache/maven/maven-artifact-manager/2.2.1/maven-artifact-manager-2.2.1.jar (68 kB at 187 kB/s)
Downloading from sonatype-public-grid: https://repository.sonatype.org/content/groups/sonatype-public-grid/org/apache/maven/maven-plugin-registry/2.2.1/maven-plugin-registry-2.2.1.jar
Progress (2): 35 kB | 286/332 kBProgress (2): 35 kB | 290/332 kBProgress (2): 35 kB | 295/332 kBProgress (2): 35 kB | 299/332 kBProgress (2): 35 kB | 303/332 kBProgress (2): 35 kB | 307/332 kBProgress (2): 35 kB | 311/332 kBProgress (2): 35 kB | 315/332 kBProgress (2): 35 kB | 319/332 kBProgress (2): 35 kB | 323/332 kBProgress (2): 35 kB | 327/332 kBProgress (2): 35 kB | 331/332 kBProgress (2): 35 kB | 332 kB    Progress (3): 35 kB | 332 kB | 4.1/30 kBProgress (3): 35 kB | 332 kB | 7.8/30 kBProgress (3): 35 kB | 332 kB | 7.9/30 kB                                        Downloaded from sonatype-public-grid: https://repository.sonatype.org/content/groups/sonatype-public-grid/backport-util-concurrent/backport-util-concurrent/3.1/backport-util-concurrent-3.1.jar (332 kB at 815 kB/s)
Downloading from sonatype-public-grid: https://repository.sonatype.org/content/groups/sonatype-public-grid/org/apache/maven/maven-toolchain/2.2.1/maven-toolchain-2.2.1.jar
Progress (2): 35 kB | 12/30 kBProgress (2): 35 kB | 16/30 kBProgress (2): 35 kB | 20/30 kBProgress (2): 35 kB | 24/30 kBProgress (2): 35 kB | 28/30 kBProgress (2): 35 kB | 30 kB                              Downloaded from sonatype-public-grid: https://repository.sonatype.org/content/groups/sonatype-public-grid/org/apache/maven/maven-profile/2.2.1/maven-profile-2.2.1.jar (35 kB at 72 kB/s)
Downloading from sonatype-public-grid: https://repository.sonatype.org/content/groups/sonatype-public-grid/org/apache/commons/commons-lang3/3.1/commons-lang3-3.1.jar
Progress (2): 30 kB | 4.1/46 kBProgress (3): 30 kB | 4.1/46 kB | 4.1/38 kBProgress (3): 30 kB | 7.8/46 kB | 4.1/38 kBProgress (3): 30 kB | 7.8/46 kB | 7.8/38 kBProgress (3): 30 kB | 12/46 kB | 7.8/38 kB Progress (3): 30 kB | 12/46 kB | 7.9/38 kBProgress (3): 30 kB | 16/46 kB | 7.9/38 kBProgress (3): 30 kB | 16/46 kB | 12/38 kB Progress (3): 30 kB | 16/46 kB | 16/38 kBProgress (3): 30 kB | 16/46 kB | 20/38 kBProgress (3): 30 kB | 20/46 kB | 20/38 kBProgress (3): 30 kB | 20/46 kB | 24/38 kBProgress (3): 30 kB | 24/46 kB | 24/38 kBProgress (3): 30 kB | 28/46 kB | 24/38 kBProgress (3): 30 kB | 32/46 kB | 24/38 kBProgress (3): 30 kB | 32/46 kB | 28/38 kBProgress (3): 30 kB | 37/46 kB | 28/38 kBProgress (3): 30 kB | 37/46 kB | 32/38 kBProgress (3): 30 kB | 38/46 kB | 32/38 kBProgress (3): 30 kB | 38/46 kB | 37/38 kBProgress (3): 30 kB | 38/46 kB | 38 kB                                         Downloaded from sonatype-public-grid: https://repository.sonatype.org/content/groups/sonatype-public-grid/org/apache/maven/maven-plugin-registry/2.2.1/maven-plugin-registry-2.2.1.jar (30 kB at 66 kB/s)
Progress (3): 38/46 kB | 38 kB | 4.1/293 kBProgress (3): 38/46 kB | 38 kB | 7.8/293 kBProgress (3): 38/46 kB | 38 kB | 12/293 kB Progress (3): 38/46 kB | 38 kB | 16/293 kBProgress (3): 38/46 kB | 38 kB | 20/293 kBProgress (3): 38/46 kB | 38 kB | 20/293 kBProgress (3): 38/46 kB | 38 kB | 24/293 kBProgress (3): 38/46 kB | 38 kB | 28/293 kBProgress (3): 38/46 kB | 38 kB | 32/293 kBProgress (3): 38/46 kB | 38 kB | 37/293 kBProgress (3): 42/46 kB | 38 kB | 37/293 kBProgress (3): 46 kB | 38 kB | 37/293 kB   Progress (4): 46 kB | 38 kB | 37/293 kB | 4.1/316 kBProgress (4): 46 kB | 38 kB | 37/293 kB | 7.8/316 kBProgress (4): 46 kB | 38 kB | 37/293 kB | 12/316 kB Progress (4): 46 kB | 38 kB | 37/293 kB | 16/316 kBProgress (4): 46 kB | 38 kB | 37/293 kB | 20/316 kBProgress (4): 46 kB | 38 kB | 37/293 kB | 20/316 kBProgress (4): 46 kB | 38 kB | 37/293 kB | 24/316 kBProgress (4): 46 kB | 38 kB | 37/293 kB | 28/316 kBProgress (4): 46 kB | 38 kB | 37/293 kB | 32/316 kBProgress (4): 46 kB | 38 kB | 37/293 kB | 37/316 kBProgress (4): 46 kB | 38 kB | 41/293 kB | 37/316 kBProgress (4): 46 kB | 38 kB | 45/293 kB | 37/316 kBProgress (4): 46 kB | 38 kB | 49/293 kB | 37/316 kBProgress (4): 46 kB | 38 kB | 53/293 kB | 37/316 kBProgress (4): 46 kB | 38 kB | 53/293 kB | 41/316 kBProgress (4): 46 kB | 38 kB | 53/293 kB | 45/316 kBProgress (4): 46 kB | 38 kB | 53/293 kB | 49/316 kBProgress (4): 46 kB | 38 kB | 53/293 kB | 53/316 kBProgress (4): 46 kB | 38 kB | 53/293 kB | 57/316 kBProgress (4): 46 kB | 38 kB | 53/293 kB | 61/316 kBProgress (4): 46 kB | 38 kB | 53/293 kB | 65/316 kBProgress (4): 46 kB | 38 kB | 53/293 kB | 69/316 kBProgress (4): 46 kB | 38 kB | 53/293 kB | 73/316 kBProgress (4): 46 kB | 38 kB | 53/293 kB | 77/316 kBProgress (4): 46 kB | 38 kB | 53/293 kB | 82/316 kBProgress (4): 46 kB | 38 kB | 53/293 kB | 86/316 kB                                                   Downloaded from sonatype-public-grid: https://repository.sonatype.org/content/groups/sonatype-public-grid/org/apache/maven/surefire/surefire-booter/2.19.1/surefire-booter-2.19.1.jar (46 kB at 80 kB/s)
Downloaded from sonatype-public-grid: https://repository.sonatype.org/content/groups/sonatype-public-grid/org/apache/maven/maven-toolchain/2.2.1/maven-toolchain-2.2.1.jar (38 kB at 72 kB/s)
Progress (2): 57/293 kB | 86/316 kBProgress (2): 61/293 kB | 86/316 kBProgress (2): 65/293 kB | 86/316 kBProgress (2): 69/293 kB | 86/316 kBProgress (2): 73/293 kB | 86/316 kBProgress (2): 77/293 kB | 86/316 kBProgress (2): 79/293 kB | 86/316 kBProgress (2): 83/293 kB | 86/316 kBProgress (2): 86/293 kB | 86/316 kBProgress (2): 90/293 kB | 86/316 kBProgress (2): 94/293 kB | 86/316 kBProgress (2): 98/293 kB | 86/316 kBProgress (2): 102/293 kB | 86/316 kBProgress (2): 106/293 kB | 86/316 kBProgress (2): 110/293 kB | 86/316 kBProgress (2): 111/293 kB | 86/316 kBProgress (2): 115/293 kB | 86/316 kBProgress (2): 120/293 kB | 86/316 kBProgress (2): 124/293 kB | 86/316 kBProgress (2): 128/293 kB | 86/316 kBProgress (2): 128/293 kB | 90/316 kBProgress (2): 128/293 kB | 94/316 kBProgress (2): 128/293 kB | 98/316 kBProgress (2): 128/293 kB | 102/316 kBProgress (2): 128/293 kB | 106/316 kBProgress (2): 128/293 kB | 110/316 kBProgress (2): 128/293 kB | 114/316 kBProgress (2): 128/293 kB | 118/316 kBProgress (2): 128/293 kB | 123/316 kBProgress (2): 128/293 kB | 127/316 kBProgress (2): 128/293 kB | 131/316 kBProgress (2): 128/293 kB | 135/316 kBProgress (2): 128/293 kB | 139/316 kBProgress (2): 128/293 kB | 143/316 kBProgress (2): 128/293 kB | 147/316 kBProgress (2): 128/293 kB | 151/316 kBProgress (2): 132/293 kB | 151/316 kBProgress (2): 136/293 kB | 151/316 kBProgress (2): 140/293 kB | 151/316 kBProgress (2): 144/293 kB | 151/316 kBProgress (2): 148/293 kB | 151/316 kBProgress (2): 152/293 kB | 151/316 kBProgress (2): 156/293 kB | 151/316 kBProgress (2): 161/293 kB | 151/316 kBProgress (2): 161/293 kB | 155/316 kBProgress (2): 161/293 kB | 159/316 kBProgress (2): 161/293 kB | 164/316 kBProgress (2): 161/293 kB | 168/316 kBProgress (2): 161/293 kB | 172/316 kBProgress (2): 161/293 kB | 176/316 kBProgress (2): 161/293 kB | 180/316 kBProgress (2): 161/293 kB | 184/316 kBProgress (2): 161/293 kB | 188/316 kBProgress (2): 161/293 kB | 192/316 kBProgress (2): 161/293 kB | 196/316 kBProgress (2): 161/293 kB | 200/316 kBProgress (2): 161/293 kB | 204/316 kBProgress (2): 161/293 kB | 209/316 kBProgress (2): 161/293 kB | 213/316 kBProgress (2): 161/293 kB | 217/316 kBProgress (2): 161/293 kB | 221/316 kBProgress (2): 161/293 kB | 225/316 kBProgress (2): 161/293 kB | 229/316 kBProgress (2): 161/293 kB | 233/316 kBProgress (2): 161/293 kB | 237/316 kBProgress (2): 161/293 kB | 241/316 kBProgress (2): 161/293 kB | 245/316 kBProgress (2): 161/293 kB | 250/316 kBProgress (2): 161/293 kB | 254/316 kBProgress (2): 161/293 kB | 258/316 kBProgress (2): 161/293 kB | 262/316 kBProgress (2): 161/293 kB | 266/316 kBProgress (2): 165/293 kB | 266/316 kBProgress (2): 169/293 kB | 266/316 kBProgress (2): 173/293 kB | 266/316 kBProgress (2): 177/293 kB | 266/316 kBProgress (2): 181/293 kB | 266/316 kBProgress (2): 185/293 kB | 266/316 kBProgress (2): 189/293 kB | 266/316 kBProgress (2): 193/293 kB | 266/316 kBProgress (2): 197/293 kB | 266/316 kBProgress (2): 201/293 kB | 266/316 kBProgress (2): 206/293 kB | 266/316 kBProgress (2): 210/293 kB | 266/316 kBProgress (2): 214/293 kB | 266/316 kBProgress (2): 218/293 kB | 266/316 kBProgress (2): 222/293 kB | 266/316 kBProgress (2): 226/293 kB | 266/316 kBProgress (2): 230/293 kB | 266/316 kBProgress (2): 234/293 kB | 266/316 kBProgress (2): 238/293 kB | 266/316 kBProgress (2): 242/293 kB | 266/316 kBProgress (2): 247/293 kB | 266/316 kBProgress (2): 251/293 kB | 266/316 kBProgress (2): 255/293 kB | 266/316 kBProgress (2): 259/293 kB | 266/316 kBProgress (2): 263/293 kB | 266/316 kBProgress (2): 267/293 kB | 266/316 kBProgress (2): 271/293 kB | 266/316 kBProgress (2): 275/293 kB | 266/316 kBProgress (2): 279/293 kB | 266/316 kBProgress (2): 283/293 kB | 266/316 kBProgress (2): 287/293 kB | 266/316 kBProgress (2): 292/293 kB | 266/316 kBProgress (2): 293 kB | 266/316 kB    Progress (2): 293 kB | 270/316 kBProgress (2): 293 kB | 274/316 kBProgress (2): 293 kB | 278/316 kBProgress (2): 293 kB | 282/316 kBProgress (2): 293 kB | 286/316 kBProgress (2): 293 kB | 290/316 kBProgress (2): 293 kB | 295/316 kBProgress (2): 293 kB | 299/316 kBProgress (2): 293 kB | 303/316 kBProgress (2): 293 kB | 307/316 kBProgress (2): 293 kB | 311/316 kBProgress (2): 293 kB | 315/316 kBProgress (2): 293 kB | 316 kB                                 Downloaded from sonatype-public-grid: https://repository.sonatype.org/content/groups/sonatype-public-grid/org/apache/maven/surefire/maven-surefire-common/2.19.1/maven-surefire-common-2.19.1.jar (293 kB at 420 kB/s)
Downloaded from sonatype-public-grid: https://repository.sonatype.org/content/groups/sonatype-public-grid/org/apache/commons/commons-lang3/3.1/commons-lang3-3.1.jar (316 kB at 435 kB/s)
Downloading from tycho: https://oss.sonatype.org/content/repositories/public/org/eclipse/tycho/tycho-p2-publisher-plugin/1.2.0/tycho-p2-publisher-plugin-1.2.0.pom
Progress (1): 2.1 kB                    Downloaded from tycho: https://oss.sonatype.org/content/repositories/public/org/eclipse/tycho/tycho-p2-publisher-plugin/1.2.0/tycho-p2-publisher-plugin-1.2.0.pom (2.1 kB at 584 B/s)
Downloading from tycho: https://oss.sonatype.org/content/repositories/public/org/eclipse/tycho/tycho-p2-publisher-plugin/1.2.0/tycho-p2-publisher-plugin-1.2.0.jar
Progress (1): 4.1/22 kBProgress (1): 7.8/22 kBProgress (1): 12/22 kB Progress (1): 16/22 kBProgress (1): 16/22 kBProgress (1): 20/22 kBProgress (1): 22 kB                      Downloaded from tycho: https://oss.sonatype.org/content/repositories/public/org/eclipse/tycho/tycho-p2-publisher-plugin/1.2.0/tycho-p2-publisher-plugin-1.2.0.jar (22 kB at 100 kB/s)
Downloading from tycho: https://oss.sonatype.org/content/repositories/public/org/eclipse/tycho/tycho-p2-repository-plugin/1.2.0/tycho-p2-repository-plugin-1.2.0.pom
Progress (1): 1.4 kB                    Downloaded from tycho: https://oss.sonatype.org/content/repositories/public/org/eclipse/tycho/tycho-p2-repository-plugin/1.2.0/tycho-p2-repository-plugin-1.2.0.pom (1.4 kB at 1.0 kB/s)
Downloading from tycho: https://oss.sonatype.org/content/repositories/public/org/eclipse/tycho/tycho-p2-repository-plugin/1.2.0/tycho-p2-repository-plugin-1.2.0.jar
Progress (1): 4.1/14 kBProgress (1): 7.8/14 kBProgress (1): 12/14 kB Progress (1): 14 kB                      Downloaded from tycho: https://oss.sonatype.org/content/repositories/public/org/eclipse/tycho/tycho-p2-repository-plugin/1.2.0/tycho-p2-repository-plugin-1.2.0.jar (14 kB at 68 kB/s)
[INFO] Computing target platform for MavenProject: org.eclipse.webtools.jsf:org.eclipse.jsf.assembly.feature:3.4.1-SNAPSHOT @ /jobs/genie.webtools/webtools-jsf_master/workspace/assembly/features/org.eclipse.jsf.assembly.feature/pom.xml
[INFO] Fetching p2.index from https://ci.eclipse.org/webtools/job/webtools-common_master/lastSuccessfulBuild/artifact/site/target/repository/ (172B)
[INFO] Adding repository https://ci.eclipse.org/webtools/job/webtools-common_master/lastSuccessfulBuild/artifact/site/target/repository
[INFO] Fetching content.xml.xz from https://ci.eclipse.org/webtools/job/webtools-common_master/lastSuccessfulBuild/artifact/site/target/repository/ (14.95kB)
[INFO] Fetching content.xml.xz from https://ci.eclipse.org/webtools/job/webtools-common_master/lastSuccessfulBuild/artifact/site/target/repository/ (14.95kB)
[INFO] Fetching p2.index from https://ci.eclipse.org/webtools/job/webtools-servertools_master/lastSuccessfulBuild/artifact/site/target/repository/ (172B)
[INFO] Fetching p2.index from https://ci.eclipse.org/webtools/job/webtools-servertools_master/lastSuccessfulBuild/artifact/site/target/repository/ (172B)
[INFO] Adding repository https://ci.eclipse.org/webtools/job/webtools-servertools_master/lastSuccessfulBuild/artifact/site/target/repository
[INFO] Fetching content.xml.xz from https://ci.eclipse.org/webtools/job/webtools-servertools_master/lastSuccessfulBuild/artifact/site/target/repository/ (13.96kB)
[INFO] Fetching content.xml.xz from https://ci.eclipse.org/webtools/job/webtools-servertools_master/lastSuccessfulBuild/artifact/site/target/repository/ (13.96kB)
[INFO] Fetching p2.index from https://ci.eclipse.org/webtools/job/webtools-sourceediting_master/lastSuccessfulBuild/artifact/site/target/repository/ (172B)
[INFO] Fetching p2.index from https://ci.eclipse.org/webtools/job/webtools-sourceediting_master/lastSuccessfulBuild/artifact/site/target/repository/ (172B)
[INFO] Adding repository https://ci.eclipse.org/webtools/job/webtools-sourceediting_master/lastSuccessfulBuild/artifact/site/target/repository
[INFO] Fetching content.xml.xz from https://ci.eclipse.org/webtools/job/webtools-sourceediting_master/lastSuccessfulBuild/artifact/site/target/repository/ (30.09kB)
[INFO] Fetching content.xml.xz from https://ci.eclipse.org/webtools/job/webtools-sourceediting_master/lastSuccessfulBuild/artifact/site/target/repository/ (30.09kB)
[INFO] Fetching p2.index from https://ci.eclipse.org/webtools/job/webtools-jsdt_master/lastSuccessfulBuild/artifact/site/target/repository/ (172B)
[INFO] Fetching p2.index from https://ci.eclipse.org/webtools/job/webtools-jsdt_master/lastSuccessfulBuild/artifact/site/target/repository/ (172B)
[INFO] Adding repository https://ci.eclipse.org/webtools/job/webtools-jsdt_master/lastSuccessfulBuild/artifact/site/target/repository
[INFO] Fetching content.xml.xz from https://ci.eclipse.org/webtools/job/webtools-jsdt_master/lastSuccessfulBuild/artifact/site/target/repository/ (17.14kB)
[INFO] Fetching content.xml.xz from https://ci.eclipse.org/webtools/job/webtools-jsdt_master/lastSuccessfulBuild/artifact/site/target/repository/ (17.14kB)
[INFO] Fetching p2.index from https://ci.eclipse.org/webtools/job/webtools-javaee_master/lastSuccessfulBuild/artifact/site/target/repository/ (172B)
[INFO] Fetching p2.index from https://ci.eclipse.org/webtools/job/webtools-javaee_master/lastSuccessfulBuild/artifact/site/target/repository/ (172B)
[INFO] Adding repository https://ci.eclipse.org/webtools/job/webtools-javaee_master/lastSuccessfulBuild/artifact/site/target/repository
[INFO] Fetching content.xml.xz from https://ci.eclipse.org/webtools/job/webtools-javaee_master/lastSuccessfulBuild/artifact/site/target/repository/ (13.41kB)
[INFO] Fetching content.xml.xz from https://ci.eclipse.org/webtools/job/webtools-javaee_master/lastSuccessfulBuild/artifact/site/target/repository/ (13.41kB)
[INFO] Adding repository http://download.eclipse.org/cbi/updates/license/1.0.1.v20140414-1359
[INFO] Fetching content.jar from http://download.eclipse.org/cbi/updates/license/1.0.1.v20140414-1359/ (3.83kB)
[INFO] Fetching content.jar from http://download.eclipse.org/cbi/updates/license/1.0.1.v20140414-1359/ (3.83kB)
[INFO] Fetching p2.index from http://download.eclipse.org/eclipse/updates/4.10-I-builds/
[INFO] Fetching p2.index from http://download.eclipse.org/eclipse/updates/4.10-I-builds/
[INFO] Adding repository http://download.eclipse.org/eclipse/updates/4.10-I-builds
[ERROR] Internal error: java.lang.RuntimeException: Failed to load p2 repository with ID 'platform' from location http://download.eclipse.org/eclipse/updates/4.10-I-builds/: HTTP Server 'Bad Gateway' : http://download.eclipse.org/eclipse/updates/4.10-I-builds/compositeContent.jar: HttpComponents connection error response code 502. -> [Help 1]
org.apache.maven.InternalErrorException: Internal error: java.lang.RuntimeException: Failed to load p2 repository with ID 'platform' from location http://download.eclipse.org/eclipse/updates/4.10-I-builds/
    at org.apache.maven.DefaultMaven.execute (DefaultMaven.java:120)
    at org.apache.maven.cli.MavenCli.execute (MavenCli.java:954)
    at org.apache.maven.cli.MavenCli.doMain (MavenCli.java:288)
    at org.apache.maven.cli.MavenCli.main (MavenCli.java:192)
    at sun.reflect.NativeMethodAccessorImpl.invoke0 (Native Method)
    at sun.reflect.NativeMethodAccessorImpl.invoke (NativeMethodAccessorImpl.java:62)
    at sun.reflect.DelegatingMethodAccessorImpl.invoke (DelegatingMethodAccessorImpl.java:43)
    at java.lang.reflect.Method.invoke (Method.java:498)
    at org.codehaus.plexus.classworlds.launcher.Launcher.launchEnhanced (Launcher.java:289)
    at org.codehaus.plexus.classworlds.launcher.Launcher.launch (Launcher.java:229)
    at org.codehaus.plexus.classworlds.launcher.Launcher.mainWithExitCode (Launcher.java:415)
    at org.codehaus.plexus.classworlds.launcher.Launcher.main (Launcher.java:356)
Caused by: java.lang.RuntimeException: Failed to load p2 repository with ID 'platform' from location http://download.eclipse.org/eclipse/updates/4.10-I-builds/
    at org.eclipse.tycho.p2.target.TargetPlatformFactoryImpl.loadMetadataRepository (TargetPlatformFactoryImpl.java:302)
    at org.eclipse.tycho.p2.target.TargetPlatformFactoryImpl.gatherExternalInstallableUnits (TargetPlatformFactoryImpl.java:270)
    at org.eclipse.tycho.p2.target.TargetPlatformFactoryImpl.createTargetPlatform (TargetPlatformFactoryImpl.java:176)
    at org.eclipse.tycho.p2.target.TargetPlatformFactoryImpl.createTargetPlatform (TargetPlatformFactoryImpl.java:128)
    at org.eclipse.tycho.p2.target.TargetPlatformFactoryImpl.createTargetPlatform (TargetPlatformFactoryImpl.java:1)
    at org.eclipse.tycho.p2.manager.ReactorRepositoryManagerImpl.computePreliminaryTargetPlatform (ReactorRepositoryManagerImpl.java:84)
    at org.eclipse.tycho.p2.resolver.P2DependencyResolver.computePreliminaryTargetPlatform (P2DependencyResolver.java:223)
    at org.eclipse.tycho.core.resolver.DefaultTychoResolver.resolveProject (DefaultTychoResolver.java:109)
    at org.eclipse.tycho.core.maven.TychoMavenLifecycleParticipant.afterProjectsRead (TychoMavenLifecycleParticipant.java:95)
    at org.apache.maven.DefaultMaven.doExecute (DefaultMaven.java:264)
    at org.apache.maven.DefaultMaven.doExecute (DefaultMaven.java:192)
    at org.apache.maven.DefaultMaven.execute (DefaultMaven.java:105)
    at org.apache.maven.cli.MavenCli.execute (MavenCli.java:954)
    at org.apache.maven.cli.MavenCli.doMain (MavenCli.java:288)
    at org.apache.maven.cli.MavenCli.main (MavenCli.java:192)
    at sun.reflect.NativeMethodAccessorImpl.invoke0 (Native Method)
    at sun.reflect.NativeMethodAccessorImpl.invoke (NativeMethodAccessorImpl.java:62)
    at sun.reflect.DelegatingMethodAccessorImpl.invoke (DelegatingMethodAccessorImpl.java:43)
    at java.lang.reflect.Method.invoke (Method.java:498)
    at org.codehaus.plexus.classworlds.launcher.Launcher.launchEnhanced (Launcher.java:289)
    at org.codehaus.plexus.classworlds.launcher.Launcher.launch (Launcher.java:229)
    at org.codehaus.plexus.classworlds.launcher.Launcher.mainWithExitCode (Launcher.java:415)
    at org.codehaus.plexus.classworlds.launcher.Launcher.main (Launcher.java:356)
Caused by: org.eclipse.equinox.p2.core.ProvisionException: HTTP Server 'Bad Gateway' : http://download.eclipse.org/eclipse/updates/4.10-I-builds/compositeContent.jar
    at org.eclipse.equinox.internal.p2.repository.CacheManager.updateCache (CacheManager.java:428)
    at org.eclipse.equinox.internal.p2.repository.CacheManager.createCache (CacheManager.java:259)
    at org.eclipse.tycho.p2.remote.RemoteRepositoryCacheManager.createCache (RemoteRepositoryCacheManager.java:67)
    at org.eclipse.equinox.internal.p2.metadata.repository.CompositeMetadataRepositoryFactory.getLocalFile (CompositeMetadataRepositoryFactory.java:74)
    at org.eclipse.equinox.internal.p2.metadata.repository.CompositeMetadataRepositoryFactory.load (CompositeMetadataRepositoryFactory.java:97)
    at org.eclipse.equinox.internal.p2.metadata.repository.MetadataRepositoryManager.factoryLoad (MetadataRepositoryManager.java:60)
    at org.eclipse.equinox.internal.p2.repository.helpers.AbstractRepositoryManager.loadRepository (AbstractRepositoryManager.java:767)
    at org.eclipse.equinox.internal.p2.repository.helpers.AbstractRepositoryManager.loadRepository (AbstractRepositoryManager.java:668)
    at org.eclipse.equinox.internal.p2.metadata.repository.MetadataRepositoryManager.loadRepository (MetadataRepositoryManager.java:107)
    at org.eclipse.tycho.p2.remote.RemoteMetadataRepositoryManager.loadRepository (RemoteMetadataRepositoryManager.java:61)
    at org.eclipse.tycho.p2.remote.RemoteMetadataRepositoryManager.loadRepository (RemoteMetadataRepositoryManager.java:53)
    at org.eclipse.tycho.p2.target.TargetPlatformFactoryImpl.loadMetadataRepository (TargetPlatformFactoryImpl.java:298)
    at org.eclipse.tycho.p2.target.TargetPlatformFactoryImpl.gatherExternalInstallableUnits (TargetPlatformFactoryImpl.java:270)
    at org.eclipse.tycho.p2.target.TargetPlatformFactoryImpl.createTargetPlatform (TargetPlatformFactoryImpl.java:176)
    at org.eclipse.tycho.p2.target.TargetPlatformFactoryImpl.createTargetPlatform (TargetPlatformFactoryImpl.java:128)
    at org.eclipse.tycho.p2.target.TargetPlatformFactoryImpl.createTargetPlatform (TargetPlatformFactoryImpl.java:1)
    at org.eclipse.tycho.p2.manager.ReactorRepositoryManagerImpl.computePreliminaryTargetPlatform (ReactorRepositoryManagerImpl.java:84)
    at org.eclipse.tycho.p2.resolver.P2DependencyResolver.computePreliminaryTargetPlatform (P2DependencyResolver.java:223)
    at org.eclipse.tycho.core.resolver.DefaultTychoResolver.resolveProject (DefaultTychoResolver.java:109)
    at org.eclipse.tycho.core.maven.TychoMavenLifecycleParticipant.afterProjectsRead (TychoMavenLifecycleParticipant.java:95)
    at org.apache.maven.DefaultMaven.doExecute (DefaultMaven.java:264)
    at org.apache.maven.DefaultMaven.doExecute (DefaultMaven.java:192)
    at org.apache.maven.DefaultMaven.execute (DefaultMaven.java:105)
    at org.apache.maven.cli.MavenCli.execute (MavenCli.java:954)
    at org.apache.maven.cli.MavenCli.doMain (MavenCli.java:288)
    at org.apache.maven.cli.MavenCli.main (MavenCli.java:192)
    at sun.reflect.NativeMethodAccessorImpl.invoke0 (Native Method)
    at sun.reflect.NativeMethodAccessorImpl.invoke (NativeMethodAccessorImpl.java:62)
    at sun.reflect.DelegatingMethodAccessorImpl.invoke (DelegatingMethodAccessorImpl.java:43)
    at java.lang.reflect.Method.invoke (Method.java:498)
    at org.codehaus.plexus.classworlds.launcher.Launcher.launchEnhanced (Launcher.java:289)
    at org.codehaus.plexus.classworlds.launcher.Launcher.launch (Launcher.java:229)
    at org.codehaus.plexus.classworlds.launcher.Launcher.mainWithExitCode (Launcher.java:415)
    at org.codehaus.plexus.classworlds.launcher.Launcher.main (Launcher.java:356)
Caused by: org.eclipse.ecf.filetransfer.IncomingFileTransferException: HttpComponents connection error response code 502.
    at org.eclipse.ecf.provider.filetransfer.httpclient4.HttpClientRetrieveFileTransfer.openStreams (HttpClientRetrieveFileTransfer.java:667)
    at org.eclipse.ecf.provider.filetransfer.retrieve.AbstractRetrieveFileTransfer.sendRetrieveRequest (AbstractRetrieveFileTransfer.java:885)
    at org.eclipse.ecf.provider.filetransfer.retrieve.MultiProtocolRetrieveAdapter.sendRetrieveRequest (MultiProtocolRetrieveAdapter.java:146)
    at org.eclipse.equinox.internal.p2.transport.ecf.FileReader.sendRetrieveRequest (FileReader.java:439)
    at org.eclipse.equinox.internal.p2.transport.ecf.FileReader.readInto (FileReader.java:375)
    at org.eclipse.equinox.internal.p2.transport.ecf.RepositoryTransport.download (RepositoryTransport.java:102)
    at org.eclipse.equinox.internal.p2.transport.ecf.RepositoryTransport.download (RepositoryTransport.java:158)
    at org.eclipse.equinox.internal.p2.repository.CacheManager.updateCache (CacheManager.java:402)
    at org.eclipse.equinox.internal.p2.repository.CacheManager.createCache (CacheManager.java:259)
    at org.eclipse.tycho.p2.remote.RemoteRepositoryCacheManager.createCache (RemoteRepositoryCacheManager.java:67)
    at org.eclipse.equinox.internal.p2.metadata.repository.CompositeMetadataRepositoryFactory.getLocalFile (CompositeMetadataRepositoryFactory.java:74)
    at org.eclipse.equinox.internal.p2.metadata.repository.CompositeMetadataRepositoryFactory.load (CompositeMetadataRepositoryFactory.java:97)
    at org.eclipse.equinox.internal.p2.metadata.repository.MetadataRepositoryManager.factoryLoad (MetadataRepositoryManager.java:60)
    at org.eclipse.equinox.internal.p2.repository.helpers.AbstractRepositoryManager.loadRepository (AbstractRepositoryManager.java:767)
    at org.eclipse.equinox.internal.p2.repository.helpers.AbstractRepositoryManager.loadRepository (AbstractRepositoryManager.java:668)
    at org.eclipse.equinox.internal.p2.metadata.repository.MetadataRepositoryManager.loadRepository (MetadataRepositoryManager.java:107)
    at org.eclipse.tycho.p2.remote.RemoteMetadataRepositoryManager.loadRepository (RemoteMetadataRepositoryManager.java:61)
    at org.eclipse.tycho.p2.remote.RemoteMetadataRepositoryManager.loadRepository (RemoteMetadataRepositoryManager.java:53)
    at org.eclipse.tycho.p2.target.TargetPlatformFactoryImpl.loadMetadataRepository (TargetPlatformFactoryImpl.java:298)
    at org.eclipse.tycho.p2.target.TargetPlatformFactoryImpl.gatherExternalInstallableUnits (TargetPlatformFactoryImpl.java:270)
    at org.eclipse.tycho.p2.target.TargetPlatformFactoryImpl.createTargetPlatform (TargetPlatformFactoryImpl.java:176)
    at org.eclipse.tycho.p2.target.TargetPlatformFactoryImpl.createTargetPlatform (TargetPlatformFactoryImpl.java:128)
    at org.eclipse.tycho.p2.target.TargetPlatformFactoryImpl.createTargetPlatform (TargetPlatformFactoryImpl.java:1)
    at org.eclipse.tycho.p2.manager.ReactorRepositoryManagerImpl.computePreliminaryTargetPlatform (ReactorRepositoryManagerImpl.java:84)
    at org.eclipse.tycho.p2.resolver.P2DependencyResolver.computePreliminaryTargetPlatform (P2DependencyResolver.java:223)
    at org.eclipse.tycho.core.resolver.DefaultTychoResolver.resolveProject (DefaultTychoResolver.java:109)
    at org.eclipse.tycho.core.maven.TychoMavenLifecycleParticipant.afterProjectsRead (TychoMavenLifecycleParticipant.java:95)
    at org.apache.maven.DefaultMaven.doExecute (DefaultMaven.java:264)
    at org.apache.maven.DefaultMaven.doExecute (DefaultMaven.java:192)
    at org.apache.maven.DefaultMaven.execute (DefaultMaven.java:105)
    at org.apache.maven.cli.MavenCli.execute (MavenCli.java:954)
    at org.apache.maven.cli.MavenCli.doMain (MavenCli.java:288)
    at org.apache.maven.cli.MavenCli.main (MavenCli.java:192)
    at sun.reflect.NativeMethodAccessorImpl.invoke0 (Native Method)
    at sun.reflect.NativeMethodAccessorImpl.invoke (NativeMethodAccessorImpl.java:62)
    at sun.reflect.DelegatingMethodAccessorImpl.invoke (DelegatingMethodAccessorImpl.java:43)
    at java.lang.reflect.Method.invoke (Method.java:498)
    at org.codehaus.plexus.classworlds.launcher.Launcher.launchEnhanced (Launcher.java:289)
    at org.codehaus.plexus.classworlds.launcher.Launcher.launch (Launcher.java:229)
    at org.codehaus.plexus.classworlds.launcher.Launcher.mainWithExitCode (Launcher.java:415)
    at org.codehaus.plexus.classworlds.launcher.Launcher.main (Launcher.java:356)
[ERROR] 
[ERROR] To see the full stack trace of the errors, re-run Maven with the -e switch.
[ERROR] Re-run Maven using the -X switch to enable full debug logging.
[ERROR] 
[ERROR] For more information about the errors and possible solutions, please read the following articles:
[ERROR] [Help 1] http://cwiki.apache.org/confluence/display/MAVEN/InternalErrorException
Build step 'Invoke top-level Maven targets' marked build as failure
Taking screenshot.
[workspace] $ echo $XAUTHORITY
<https://ci.eclipse.org/webtools/job/webtools-jsf_master/ws/.Xauthority-4301489586038595645>
[workspace] $ ls -l $XAUTHORITY
-rw-rw-r-- 1 genie.webtools webtools 0 Nov  8 00:33 <https://ci.eclipse.org/webtools/job/webtools-jsf_master/ws/.Xauthority-4301489586038595645>
[workspace] $ import -window root -display :450 screenshot.jpg
Terminating xvnc.
[WARNINGS] Skipping publisher since build result is FAILURE
append disk usage
Started calculate disk usage of build
Finished Calculation of disk usage of build in 0 seconds
Started calculate disk usage of workspace
Finished Calculation of disk usage of workspace in  2 second