Skip to main content

[Date Prev][Date Next][Thread Prev][Thread Next][Date Index][Thread Index] [List Home]
[wtp-releng] [WTPBUILD: wtp-R3.0-M] wtp-R3.0-M Build Failed

View results here -> http://build.eclipse.org:7777/dashboard/tab/build/detail/wtp-R3.0-M?log=log20080730151000

BUILD FAILED
Ant Error Message: /shared/webtools/releng.control/cc_project_build.xml:59: The following error occurred while executing this line: /shared/webtools/releng.control/cc_project_build.xml:67: Build failed due to failing JUnits in the following test plugin(s): org.eclipse.wtp.releng.tests org.eclipse.jpt.eclipselink.core.tests org.eclipse.jst.jsf.core.tests org.eclipse.jst.jsf.validation.el.tests
Date of build: 2008-07-30 15:10 (GMT)
Time to build: 354 minutes 26 seconds
Last changed: 07/30/2008 14:33:20
Last log entry: [242393] Long configuration descriptions can be truncated on first page

 Errors/Warnings: (59)
checkout.builder.clean: true

Version tag for webtools.maps/releng: R3_0_maintenance

Version tag for webtools.releng/releng.wtpbuilder is: v200807291725

cctimestamp: 20080730151000

datetime: 200807301512

timestamp: 20080730151000

basebuilderlocal: true

wtpBuilderPresent: true

J2SE-1.5=/shared/webtools/apps/ibm-java2-sdk-5.0-6.0-linux-ppc/jre/lib/core.jar:/shared/webtools/apps/ibm-java2-sdk-5.0-6.0-linux-ppc/jre/lib/vm.jar:/shared/webtools/apps/ibm-java2-sdk-5.0-6.0-linux-ppc/jre/lib/xml.jar:/shared/webtools/apps/ibm-java2-sdk-5.0-6.0-linux-ppc/jre/lib/graphics.jar:/shared/webtools/apps/ibm-java2-sdk-5.0-6.0-linux-ppc/jre/lib/server.jar:/shared/webtools/apps/ibm-java2-sdk-5.0-6.0-linux-ppc/jre/lib/ibmorbapi.jar:/shared/webtools/apps/ibm-java2-sdk-5.0-6.0-linux-ppc/jre/lib/security.jar

J2SE-1.4=/shared/webtools/apps/IBMJava2-SDK-1.4.2-10.0.ppc/jre/lib/core.jar:/shared/webtools/apps/IBMJava2-SDK-1.4.2-10.0.ppc/jre/lib/xml.jar:/shared/webtools/apps/IBMJava2-SDK-1.4.2-10.0.ppc/jre/lib/graphics.jar:/shared/webtools/apps/IBMJava2-SDK-1.4.2-10.0.ppc/jre/lib/server.jar:/shared/webtools/apps/IBMJava2-SDK-1.4.2-10.0.ppc/jre/lib/ibmorbapi.jar:/shared/webtools/apps/IBMJava2-SDK-1.4.2-10.0.ppc/jre/lib/security.jar

J2SE-1.5=/shared/webtools/apps/ibm-java2-sdk-5.0-6.0-linux-ppc/jre/lib/core.jar:/shared/webtools/apps/ibm-java2-sdk-5.0-6.0-linux-ppc/jre/lib/vm.jar:/shared/webtools/apps/ibm-java2-sdk-5.0-6.0-linux-ppc/jre/lib/xml.jar:/shared/webtools/apps/ibm-java2-sdk-5.0-6.0-linux-ppc/jre/lib/graphics.jar:/shared/webtools/apps/ibm-java2-sdk-5.0-6.0-linux-ppc/jre/lib/server.jar:/shared/webtools/apps/ibm-java2-sdk-5.0-6.0-linux-ppc/jre/lib/ibmorbapi.jar:/shared/webtools/apps/ibm-java2-sdk-5.0-6.0-linux-ppc/jre/lib/security.jar

J2SE-1.4=/shared/webtools/apps/IBMJava2-SDK-1.4.2-10.0.ppc/jre/lib/core.jar:/shared/webtools/apps/IBMJava2-SDK-1.4.2-10.0.ppc/jre/lib/xml.jar:/shared/webtools/apps/IBMJava2-SDK-1.4.2-10.0.ppc/jre/lib/graphics.jar:/shared/webtools/apps/IBMJava2-SDK-1.4.2-10.0.ppc/jre/lib/server.jar:/shared/webtools/apps/IBMJava2-SDK-1.4.2-10.0.ppc/jre/lib/ibmorbapi.jar:/shared/webtools/apps/IBMJava2-SDK-1.4.2-10.0.ppc/jre/lib/security.jar

J2SE-1.5=/shared/webtools/apps/ibm-java2-sdk-5.0-6.0-linux-ppc/jre/lib/core.jar:/shared/webtools/apps/ibm-java2-sdk-5.0-6.0-linux-ppc/jre/lib/vm.jar:/shared/webtools/apps/ibm-java2-sdk-5.0-6.0-linux-ppc/jre/lib/xml.jar:/shared/webtools/apps/ibm-java2-sdk-5.0-6.0-linux-ppc/jre/lib/graphics.jar:/shared/webtools/apps/ibm-java2-sdk-5.0-6.0-linux-ppc/jre/lib/server.jar:/shared/webtools/apps/ibm-java2-sdk-5.0-6.0-linux-ppc/jre/lib/ibmorbapi.jar:/shared/webtools/apps/ibm-java2-sdk-5.0-6.0-linux-ppc/jre/lib/security.jar

J2SE-1.4=/shared/webtools/apps/IBMJava2-SDK-1.4.2-10.0.ppc/jre/lib/core.jar:/shared/webtools/apps/IBMJava2-SDK-1.4.2-10.0.ppc/jre/lib/xml.jar:/shared/webtools/apps/IBMJava2-SDK-1.4.2-10.0.ppc/jre/lib/graphics.jar:/shared/webtools/apps/IBMJava2-SDK-1.4.2-10.0.ppc/jre/lib/server.jar:/shared/webtools/apps/IBMJava2-SDK-1.4.2-10.0.ppc/jre/lib/ibmorbapi.jar:/shared/webtools/apps/IBMJava2-SDK-1.4.2-10.0.ppc/jre/lib/security.jar

J2SE-1.5=/shared/webtools/apps/ibm-java2-sdk-5.0-6.0-linux-ppc/jre/lib/core.jar:/shared/webtools/apps/ibm-java2-sdk-5.0-6.0-linux-ppc/jre/lib/vm.jar:/shared/webtools/apps/ibm-java2-sdk-5.0-6.0-linux-ppc/jre/lib/xml.jar:/shared/webtools/apps/ibm-java2-sdk-5.0-6.0-linux-ppc/jre/lib/graphics.jar:/shared/webtools/apps/ibm-java2-sdk-5.0-6.0-linux-ppc/jre/lib/server.jar:/shared/webtools/apps/ibm-java2-sdk-5.0-6.0-linux-ppc/jre/lib/ibmorbapi.jar:/shared/webtools/apps/ibm-java2-sdk-5.0-6.0-linux-ppc/jre/lib/security.jar

J2SE-1.4=/shared/webtools/apps/IBMJava2-SDK-1.4.2-10.0.ppc/jre/lib/core.jar:/shared/webtools/apps/IBMJava2-SDK-1.4.2-10.0.ppc/jre/lib/xml.jar:/shared/webtools/apps/IBMJava2-SDK-1.4.2-10.0.ppc/jre/lib/graphics.jar:/shared/webtools/apps/IBMJava2-SDK-1.4.2-10.0.ppc/jre/lib/server.jar:/shared/webtools/apps/IBMJava2-SDK-1.4.2-10.0.ppc/jre/lib/ibmorbapi.jar:/shared/webtools/apps/IBMJava2-SDK-1.4.2-10.0.ppc/jre/lib/security.jar

[eclipse.fetch] Missing directory entry: feature@xxxxxxxxxxxxxxx.xml_core.feature.source.

[eclipse.fetch] Missing directory entry: feature@xxxxxxxxxxxxxxx.common_core.feature.source.

[eclipse.fetch] Missing directory entry: feature@xxxxxxxxxxxxxxx.web_core.feature.source.

[eclipse.fetch] Missing directory entry: feature@xxxxxxxxxxxxxxx.xml_core.feature.source.

[eclipse.fetch] Missing directory entry: feature@xxxxxxxxxxxxxxx.common_core.feature.source.

[eclipse.fetch] Missing directory entry: feature@xxxxxxxxxxxxxxx.server_core.feature.source.

[eclipse.fetch] Missing directory entry: feature@xxxxxxxxxxxxxxx.ws_core.feature.source.

J2SE-1.5=/shared/webtools/apps/ibm-java2-sdk-5.0-6.0-linux-ppc/jre/lib/core.jar:/shared/webtools/apps/ibm-java2-sdk-5.0-6.0-linux-ppc/jre/lib/vm.jar:/shared/webtools/apps/ibm-java2-sdk-5.0-6.0-linux-ppc/jre/lib/xml.jar:/shared/webtools/apps/ibm-java2-sdk-5.0-6.0-linux-ppc/jre/lib/graphics.jar:/shared/webtools/apps/ibm-java2-sdk-5.0-6.0-linux-ppc/jre/lib/server.jar:/shared/webtools/apps/ibm-java2-sdk-5.0-6.0-linux-ppc/jre/lib/ibmorbapi.jar:/shared/webtools/apps/ibm-java2-sdk-5.0-6.0-linux-ppc/jre/lib/security.jar

J2SE-1.4=/shared/webtools/apps/IBMJava2-SDK-1.4.2-10.0.ppc/jre/lib/core.jar:/shared/webtools/apps/IBMJava2-SDK-1.4.2-10.0.ppc/jre/lib/xml.jar:/shared/webtools/apps/IBMJava2-SDK-1.4.2-10.0.ppc/jre/lib/graphics.jar:/shared/webtools/apps/IBMJava2-SDK-1.4.2-10.0.ppc/jre/lib/server.jar:/shared/webtools/apps/IBMJava2-SDK-1.4.2-10.0.ppc/jre/lib/ibmorbapi.jar:/shared/webtools/apps/IBMJava2-SDK-1.4.2-10.0.ppc/jre/lib/security.jar

[eclipse.fetch] Missing directory entry: feature@xxxxxxxxxxxxxxx.xml_core.feature.source.

[eclipse.fetch] Missing directory entry: feature@xxxxxxxxxxxxxxx.common_core.feature.source.

[eclipse.fetch] Missing directory entry: feature@xxxxxxxxxxxxxxx.web_core.feature.source.

[eclipse.fetch] Missing directory entry: feature@xxxxxxxxxxxxxxx.xml_core.feature.source.

[eclipse.fetch] Missing directory entry: feature@xxxxxxxxxxxxxxx.common_core.feature.source.

[eclipse.fetch] Missing directory entry: feature@xxxxxxxxxxxxxxx.server_core.feature.source.

[eclipse.fetch] Missing directory entry: feature@xxxxxxxxxxxxxxx.ws_core.feature.source.

[eclipse.fetch] Missing directory entry: feature@xxxxxxxxxxxxxxx.server_core.feature.source.

[eclipse.fetch] Missing directory entry: feature@xxxxxxxxxxxxxxx.web_core.feature.source.

[eclipse.fetch] Missing directory entry: feature@xxxxxxxxxxxxxxx.enterprise_core.feature.source.

J2SE-1.5=/shared/webtools/apps/ibm-java2-sdk-5.0-6.0-linux-ppc/jre/lib/core.jar:/shared/webtools/apps/ibm-java2-sdk-5.0-6.0-linux-ppc/jre/lib/vm.jar:/shared/webtools/apps/ibm-java2-sdk-5.0-6.0-linux-ppc/jre/lib/xml.jar:/shared/webtools/apps/ibm-java2-sdk-5.0-6.0-linux-ppc/jre/lib/graphics.jar:/shared/webtools/apps/ibm-java2-sdk-5.0-6.0-linux-ppc/jre/lib/server.jar:/shared/webtools/apps/ibm-java2-sdk-5.0-6.0-linux-ppc/jre/lib/ibmorbapi.jar:/shared/webtools/apps/ibm-java2-sdk-5.0-6.0-linux-ppc/jre/lib/security.jar

J2SE-1.4=/shared/webtools/apps/IBMJava2-SDK-1.4.2-10.0.ppc/jre/lib/core.jar:/shared/webtools/apps/IBMJava2-SDK-1.4.2-10.0.ppc/jre/lib/xml.jar:/shared/webtools/apps/IBMJava2-SDK-1.4.2-10.0.ppc/jre/lib/graphics.jar:/shared/webtools/apps/IBMJava2-SDK-1.4.2-10.0.ppc/jre/lib/server.jar:/shared/webtools/apps/IBMJava2-SDK-1.4.2-10.0.ppc/jre/lib/ibmorbapi.jar:/shared/webtools/apps/IBMJava2-SDK-1.4.2-10.0.ppc/jre/lib/security.jar

J2SE-1.5=/shared/webtools/apps/ibm-java2-sdk-5.0-6.0-linux-ppc/jre/lib/core.jar:/shared/webtools/apps/ibm-java2-sdk-5.0-6.0-linux-ppc/jre/lib/vm.jar:/shared/webtools/apps/ibm-java2-sdk-5.0-6.0-linux-ppc/jre/lib/xml.jar:/shared/webtools/apps/ibm-java2-sdk-5.0-6.0-linux-ppc/jre/lib/graphics.jar:/shared/webtools/apps/ibm-java2-sdk-5.0-6.0-linux-ppc/jre/lib/server.jar:/shared/webtools/apps/ibm-java2-sdk-5.0-6.0-linux-ppc/jre/lib/ibmorbapi.jar:/shared/webtools/apps/ibm-java2-sdk-5.0-6.0-linux-ppc/jre/lib/security.jar

J2SE-1.4=/shared/webtools/apps/IBMJava2-SDK-1.4.2-10.0.ppc/jre/lib/core.jar:/shared/webtools/apps/IBMJava2-SDK-1.4.2-10.0.ppc/jre/lib/xml.jar:/shared/webtools/apps/IBMJava2-SDK-1.4.2-10.0.ppc/jre/lib/graphics.jar:/shared/webtools/apps/IBMJava2-SDK-1.4.2-10.0.ppc/jre/lib/server.jar:/shared/webtools/apps/IBMJava2-SDK-1.4.2-10.0.ppc/jre/lib/ibmorbapi.jar:/shared/webtools/apps/IBMJava2-SDK-1.4.2-10.0.ppc/jre/lib/security.jar

J2SE-1.5=/shared/webtools/apps/ibm-java2-sdk-5.0-6.0-linux-ppc/jre/lib/core.jar:/shared/webtools/apps/ibm-java2-sdk-5.0-6.0-linux-ppc/jre/lib/vm.jar:/shared/webtools/apps/ibm-java2-sdk-5.0-6.0-linux-ppc/jre/lib/xml.jar:/shared/webtools/apps/ibm-java2-sdk-5.0-6.0-linux-ppc/jre/lib/graphics.jar:/shared/webtools/apps/ibm-java2-sdk-5.0-6.0-linux-ppc/jre/lib/server.jar:/shared/webtools/apps/ibm-java2-sdk-5.0-6.0-linux-ppc/jre/lib/ibmorbapi.jar:/shared/webtools/apps/ibm-java2-sdk-5.0-6.0-linux-ppc/jre/lib/security.jar

J2SE-1.4=/shared/webtools/apps/IBMJava2-SDK-1.4.2-10.0.ppc/jre/lib/core.jar:/shared/webtools/apps/IBMJava2-SDK-1.4.2-10.0.ppc/jre/lib/xml.jar:/shared/webtools/apps/IBMJava2-SDK-1.4.2-10.0.ppc/jre/lib/graphics.jar:/shared/webtools/apps/IBMJava2-SDK-1.4.2-10.0.ppc/jre/lib/server.jar:/shared/webtools/apps/IBMJava2-SDK-1.4.2-10.0.ppc/jre/lib/ibmorbapi.jar:/shared/webtools/apps/IBMJava2-SDK-1.4.2-10.0.ppc/jre/lib/security.jar

[eclipse.fetch] Missing directory entry: fragment@xxxxxxxxxxxxxxxxxxxxxxxxxxxxxxxxxxxxxxx.

J2SE-1.5=/shared/webtools/apps/ibm-java2-sdk-5.0-6.0-linux-ppc/jre/lib/core.jar:/shared/webtools/apps/ibm-java2-sdk-5.0-6.0-linux-ppc/jre/lib/vm.jar:/shared/webtools/apps/ibm-java2-sdk-5.0-6.0-linux-ppc/jre/lib/xml.jar:/shared/webtools/apps/ibm-java2-sdk-5.0-6.0-linux-ppc/jre/lib/graphics.jar:/shared/webtools/apps/ibm-java2-sdk-5.0-6.0-linux-ppc/jre/lib/server.jar:/shared/webtools/apps/ibm-java2-sdk-5.0-6.0-linux-ppc/jre/lib/ibmorbapi.jar:/shared/webtools/apps/ibm-java2-sdk-5.0-6.0-linux-ppc/jre/lib/security.jar

J2SE-1.4=/shared/webtools/apps/IBMJava2-SDK-1.4.2-10.0.ppc/jre/lib/core.jar:/shared/webtools/apps/IBMJava2-SDK-1.4.2-10.0.ppc/jre/lib/xml.jar:/shared/webtools/apps/IBMJava2-SDK-1.4.2-10.0.ppc/jre/lib/graphics.jar:/shared/webtools/apps/IBMJava2-SDK-1.4.2-10.0.ppc/jre/lib/server.jar:/shared/webtools/apps/IBMJava2-SDK-1.4.2-10.0.ppc/jre/lib/ibmorbapi.jar:/shared/webtools/apps/IBMJava2-SDK-1.4.2-10.0.ppc/jre/lib/security.jar

BASEOS: linux BASEWS: gtk BASEARCH: ppc

Creating dependency script: /shared/webtools/projects/wtp-R3.0-M/workdir/dependency.emf.xml

Creating dependency script: /shared/webtools/projects/wtp-R3.0-M/workdir/dependency.emfxsd.xml

Creating dependency script: /shared/webtools/projects/wtp-R3.0-M/workdir/dependency.gef.xml

Creating dependency script: /shared/webtools/projects/wtp-R3.0-M/workdir/dependency.dtp.xml

Creating dependency script: /shared/webtools/projects/wtp-R3.0-M/workdir/dependency.eclipse.xml

Creating dependency script: /shared/webtools/projects/wtp-R3.0-M/workdir/dependency.eclipseTestFramework.xml

Creating dependency script: /shared/webtools/projects/wtp-R3.0-M/workdir/dependency.tomcat.5.xml

Creating dependency script: /shared/webtools/projects/wtp-R3.0-M/workdir/dependency.jonas.4.xml

Creating dependency script: /shared/webtools/projects/wtp-R3.0-M/workdir/dependency.oagis.release.xml

Creating dependency script: /shared/webtools/projects/wtp-R3.0-M/workdir/dependency.oagis.wsdl.xml

Creating dependency script: /shared/webtools/projects/wtp-R3.0-M/workdir/dependency.jsf.1_1.xml

Running junits

eclipse.launcher: /shared/webtools/basebuilders/RC2_34/org.eclipse.releng.basebuilder/plugins/org.eclipse.equinox.launcher.jar

wtpmasterjunitresult 0

 Unit Tests: (8914)
error testHasListeners JptEclipseLinkCoreTests
error testSetTransactionType JptEclipseLinkCoreTests
error testSetJtaDataSource JptEclipseLinkCoreTests
error testSetNonJtaDataSource JptEclipseLinkCoreTests
error testSetNativeSql JptEclipseLinkCoreTests
error testAddRemoveNativeSql JptEclipseLinkCoreTests
error testSetBatchWriting JptEclipseLinkCoreTests
error testAddRemoveBatchWriting JptEclipseLinkCoreTests
error testSetCacheStatements JptEclipseLinkCoreTests
error testAddRemoveCacheStatements JptEclipseLinkCoreTests
error testSetCacheStatementsSize JptEclipseLinkCoreTests
error testAddRemoveCacheStatementsSize JptEclipseLinkCoreTests
error testSetDriver JptEclipseLinkCoreTests
error testAddRemoveDriver JptEclipseLinkCoreTests
error testSetUrl JptEclipseLinkCoreTests
error testAddRemoveUrl JptEclipseLinkCoreTests
error testSetUser JptEclipseLinkCoreTests
error testAddRemoveUser JptEclipseLinkCoreTests
error testSetPassword JptEclipseLinkCoreTests
error testAddRemovePassword JptEclipseLinkCoreTests
error testSetBindParameters JptEclipseLinkCoreTests
error testAddRemoveBindParameters JptEclipseLinkCoreTests
error testSetReadConnectionsShared JptEclipseLinkCoreTests
error testAddRemoveReadConnectionsShared JptEclipseLinkCoreTests
error testSetReadConnectionsMin JptEclipseLinkCoreTests
error testAddRemoveReadConnectionsMin JptEclipseLinkCoreTests
error testSetReadConnectionsMax JptEclipseLinkCoreTests
error testAddRemoveReadConnectionsMax JptEclipseLinkCoreTests
error testSetWriteConnectionsMin JptEclipseLinkCoreTests
error testAddRemoveWriteConnectionsMin JptEclipseLinkCoreTests
error testSetWriteConnectionsMax JptEclipseLinkCoreTests
error testAddRemoveWriteConnectionsMax JptEclipseLinkCoreTests
error testHasListeners JptEclipseLinkCoreTests
error testValue JptEclipseLinkCoreTests
error testSetValue JptEclipseLinkCoreTests
error testSetNullValue JptEclipseLinkCoreTests
error testHasListeners JptEclipseLinkCoreTests
error testSetSessionName JptEclipseLinkCoreTests
error testAddRemoveSessionName JptEclipseLinkCoreTests
error testSetSessionsXml JptEclipseLinkCoreTests
error testAddRemoveSessionsXml JptEclipseLinkCoreTests
error testSetIncludeDescriptorQueries JptEclipseLinkCoreTests
error testAddRemoveIncludeDescriptorQueries JptEclipseLinkCoreTests
error testSetTargetDatabase JptEclipseLinkCoreTests
error testAddRemoveTargetDatabase JptEclipseLinkCoreTests
error testSetEventListener JptEclipseLinkCoreTests
error testAddRemoveEventListener JptEclipseLinkCoreTests
error testHasListeners JptEclipseLinkCoreTests
error testValue JptEclipseLinkCoreTests
error testSetValue JptEclipseLinkCoreTests
error testSetNullValue JptEclipseLinkCoreTests
error testHasListeners JptEclipseLinkCoreTests
error testSetLevel JptEclipseLinkCoreTests
error testAddRemoveLevel JptEclipseLinkCoreTests
error testSetThrowExceptions JptEclipseLinkCoreTests
error testAddRemoveThrowExceptions JptEclipseLinkCoreTests
error testSetThread JptEclipseLinkCoreTests
error testAddRemoveThread JptEclipseLinkCoreTests
error testSetSession JptEclipseLinkCoreTests
error testAddRemoveSession JptEclipseLinkCoreTests
error testSetExceptions JptEclipseLinkCoreTests
error testAddRemoveExceptions JptEclipseLinkCoreTests
error testSetLogFileLocation JptEclipseLinkCoreTests
error testAddRemoveLogFileLocation JptEclipseLinkCoreTests
error testSetLogger JptEclipseLinkCoreTests
error testAddRemoveLogger JptEclipseLinkCoreTests
error testHasListeners JptEclipseLinkCoreTests
error testValue JptEclipseLinkCoreTests
error testSetValue JptEclipseLinkCoreTests
error testSetNullValue JptEclipseLinkCoreTests
error testEntitiesList JptEclipseLinkCoreTests
error testHasListeners JptEclipseLinkCoreTests
error testSetThrowExceptions JptEclipseLinkCoreTests
error testAddRemoveThrowExceptions JptEclipseLinkCoreTests
error testSetWeavingLazy JptEclipseLinkCoreTests
error testAddRemoveWeavingLazy JptEclipseLinkCoreTests
error testSetWeavingChangeTracking JptEclipseLinkCoreTests
error testAddRemoveWeavingChangeTracking JptEclipseLinkCoreTests
error testSetWeavingFetchGroups JptEclipseLinkCoreTests
error testAddRemoveWeavingFetchGroups JptEclipseLinkCoreTests
error testSetSessionCustomizer JptEclipseLinkCoreTests
error testAddRemoveSessionCustomizer JptEclipseLinkCoreTests
error testSetWeaving JptEclipseLinkCoreTests
error testAddRemoveWeaving JptEclipseLinkCoreTests
error testSetCustomization JptEclipseLinkCoreTests
error testAddRemoveCustomization JptEclipseLinkCoreTests
error testHasListeners JptEclipseLinkCoreTests
error testValue JptEclipseLinkCoreTests
error testSetValue JptEclipseLinkCoreTests
error testSetNullValue JptEclipseLinkCoreTests
error testEntitiesList JptEclipseLinkCoreTests
error testHasListeners JptEclipseLinkCoreTests
error testSetCacheTypeDefault JptEclipseLinkCoreTests
error testAddRemoveCacheTypeDefault JptEclipseLinkCoreTests
error testSetCacheSizeDefault JptEclipseLinkCoreTests
error testAddRemoveCacheSizeDefault JptEclipseLinkCoreTests
error testSetSharedCacheDefault JptEclipseLinkCoreTests
error testAddRemoveSharedCacheDefault JptEclipseLinkCoreTests
error testSetCacheType JptEclipseLinkCoreTests
error testAddRemoveCacheType JptEclipseLinkCoreTests
error testSetCacheSize JptEclipseLinkCoreTests
error testAddRemoveCacheSize JptEclipseLinkCoreTests
error testSetSharedCache JptEclipseLinkCoreTests
error testAddRemoveSharedCache JptEclipseLinkCoreTests
error testValue JptEclipseLinkCoreTests
error testSetValue JptEclipseLinkCoreTests
error testSetNullValue JptEclipseLinkCoreTests
error testHasListeners JptEclipseLinkCoreTests
error testOutputModeUpdate JptEclipseLinkCoreTests
error testHasListeners JptEclipseLinkCoreTests
error testSetCreateFileName JptEclipseLinkCoreTests
error testAddRemoveCreateFileName JptEclipseLinkCoreTests
error testSetDropFileName JptEclipseLinkCoreTests
error testAddRemoveDropFileName JptEclipseLinkCoreTests
error testSetApplicationLocation JptEclipseLinkCoreTests
error testAddRemoveApplicationLocation JptEclipseLinkCoreTests
error testSetOutputMode JptEclipseLinkCoreTests
error testAddRemoveOutputMode JptEclipseLinkCoreTests
error testSetDdlGenerationType JptEclipseLinkCoreTests
error testAddRemoveDdlGenerationType JptEclipseLinkCoreTests
error testMapSanity AllTests
failure testErrorExprs AllTests_1_2
failure testVersionCompare TestBuild
 
 Unit Test Error Details: (123)
Test:  testHasListeners
Class:  JptEclipseLinkCoreTests
java.lang.RuntimeException: missing Java system property: "org.eclipse.jpt.jpa.jar" 
at org.eclipse.jpt.core.tests.internal.projects.TestJpaProject.jarName(TestJpaProject.java:65) 
at org.eclipse.jpt.core.tests.internal.projects.TestJpaProject.<init>(TestJpaProject.java:57) 
at org.eclipse.jpt.core.tests.internal.projects.TestJpaProject.buildJpaProject(TestJpaProject.java:35) 
at org.eclipse.jpt.core.tests.internal.context.ContextModelTestCase.buildJpaProject(ContextModelTestCase.java:90) 
at org.eclipse.jpt.core.tests.internal.context.ContextModelTestCase.buildJavaProject(ContextModelTestCase.java:85) 
at org.eclipse.jpt.core.tests.internal.utility.jdt.AnnotationTestCase.setUp(AnnotationTestCase.java:76) 
at org.eclipse.jpt.core.tests.internal.context.ContextModelTestCase.setUp(ContextModelTestCase.java:57) 
at org.eclipse.jpt.eclipselink.core.tests.internal.PersistenceUnitTestCase.setUp(PersistenceUnitTestCase.java:54) 
at org.eclipse.jpt.eclipselink.core.tests.internal.connection.ConnectionAdapterTests.setUp(ConnectionAdapterTests.java:105) 
at org.eclipse.test.EclipseTestRunner.run(EclipseTestRunner.java:354) 
at org.eclipse.test.EclipseTestRunner.run(EclipseTestRunner.java:206) 
at org.eclipse.test.CoreTestApplication.runTests(CoreTestApplication.java:35) 
at org.eclipse.test.CoreTestApplication.run(CoreTestApplication.java:31) 
at org.eclipse.equinox.internal.app.EclipseAppContainer.callMethodWithException(EclipseAppContainer.java:574) 
at org.eclipse.equinox.internal.app.EclipseAppHandle.run(EclipseAppHandle.java:195) 
at org.eclipse.core.runtime.internal.adaptor.EclipseAppLauncher.runApplication(EclipseAppLauncher.java:110) 
at org.eclipse.core.runtime.internal.adaptor.EclipseAppLauncher.start(EclipseAppLauncher.java:79) 
at org.eclipse.core.runtime.adaptor.EclipseStarter.run(EclipseStarter.java:382) 
at org.eclipse.core.runtime.adaptor.EclipseStarter.run(EclipseStarter.java:179) 
at org.eclipse.equinox.launcher.Main.invokeFramework(Main.java:549) 
at org.eclipse.equinox.launcher.Main.basicRun(Main.java:504) 
at org.eclipse.equinox.launcher.Main.run(Main.java:1236) 
at org.eclipse.equinox.launcher.Main.main(Main.java:1212)
Test:  testSetTransactionType
Class:  JptEclipseLinkCoreTests
java.lang.RuntimeException: missing Java system property: "org.eclipse.jpt.jpa.jar" 
at org.eclipse.jpt.core.tests.internal.projects.TestJpaProject.jarName(TestJpaProject.java:65) 
at org.eclipse.jpt.core.tests.internal.projects.TestJpaProject.<init>(TestJpaProject.java:57) 
at org.eclipse.jpt.core.tests.internal.projects.TestJpaProject.buildJpaProject(TestJpaProject.java:35) 
at org.eclipse.jpt.core.tests.internal.context.ContextModelTestCase.buildJpaProject(ContextModelTestCase.java:90) 
at org.eclipse.jpt.core.tests.internal.context.ContextModelTestCase.buildJavaProject(ContextModelTestCase.java:85) 
at org.eclipse.jpt.core.tests.internal.utility.jdt.AnnotationTestCase.setUp(AnnotationTestCase.java:76) 
at org.eclipse.jpt.core.tests.internal.context.ContextModelTestCase.setUp(ContextModelTestCase.java:57) 
at org.eclipse.jpt.eclipselink.core.tests.internal.PersistenceUnitTestCase.setUp(PersistenceUnitTestCase.java:54) 
at org.eclipse.jpt.eclipselink.core.tests.internal.connection.ConnectionAdapterTests.setUp(ConnectionAdapterTests.java:105) 
at org.eclipse.test.EclipseTestRunner.run(EclipseTestRunner.java:354) 
at org.eclipse.test.EclipseTestRunner.run(EclipseTestRunner.java:206) 
at org.eclipse.test.CoreTestApplication.runTests(CoreTestApplication.java:35) 
at org.eclipse.test.CoreTestApplication.run(CoreTestApplication.java:31) 
at org.eclipse.equinox.internal.app.EclipseAppContainer.callMethodWithException(EclipseAppContainer.java:574) 
at org.eclipse.equinox.internal.app.EclipseAppHandle.run(EclipseAppHandle.java:195) 
at org.eclipse.core.runtime.internal.adaptor.EclipseAppLauncher.runApplication(EclipseAppLauncher.java:110) 
at org.eclipse.core.runtime.internal.adaptor.EclipseAppLauncher.start(EclipseAppLauncher.java:79) 
at org.eclipse.core.runtime.adaptor.EclipseStarter.run(EclipseStarter.java:382) 
at org.eclipse.core.runtime.adaptor.EclipseStarter.run(EclipseStarter.java:179) 
at org.eclipse.equinox.launcher.Main.invokeFramework(Main.java:549) 
at org.eclipse.equinox.launcher.Main.basicRun(Main.java:504) 
at org.eclipse.equinox.launcher.Main.run(Main.java:1236) 
at org.eclipse.equinox.launcher.Main.main(Main.java:1212)
Test:  testSetJtaDataSource
Class:  JptEclipseLinkCoreTests
java.lang.RuntimeException: missing Java system property: "org.eclipse.jpt.jpa.jar" 
at org.eclipse.jpt.core.tests.internal.projects.TestJpaProject.jarName(TestJpaProject.java:65) 
at org.eclipse.jpt.core.tests.internal.projects.TestJpaProject.<init>(TestJpaProject.java:57) 
at org.eclipse.jpt.core.tests.internal.projects.TestJpaProject.buildJpaProject(TestJpaProject.java:35) 
at org.eclipse.jpt.core.tests.internal.context.ContextModelTestCase.buildJpaProject(ContextModelTestCase.java:90) 
at org.eclipse.jpt.core.tests.internal.context.ContextModelTestCase.buildJavaProject(ContextModelTestCase.java:85) 
at org.eclipse.jpt.core.tests.internal.utility.jdt.AnnotationTestCase.setUp(AnnotationTestCase.java:76) 
at org.eclipse.jpt.core.tests.internal.context.ContextModelTestCase.setUp(ContextModelTestCase.java:57) 
at org.eclipse.jpt.eclipselink.core.tests.internal.PersistenceUnitTestCase.setUp(PersistenceUnitTestCase.java:54) 
at org.eclipse.jpt.eclipselink.core.tests.internal.connection.ConnectionAdapterTests.setUp(ConnectionAdapterTests.java:105) 
at org.eclipse.test.EclipseTestRunner.run(EclipseTestRunner.java:354) 
at org.eclipse.test.EclipseTestRunner.run(EclipseTestRunner.java:206) 
at org.eclipse.test.CoreTestApplication.runTests(CoreTestApplication.java:35) 
at org.eclipse.test.CoreTestApplication.run(CoreTestApplication.java:31) 
at org.eclipse.equinox.internal.app.EclipseAppContainer.callMethodWithException(EclipseAppContainer.java:574) 
at org.eclipse.equinox.internal.app.EclipseAppHandle.run(EclipseAppHandle.java:195) 
at org.eclipse.core.runtime.internal.adaptor.EclipseAppLauncher.runApplication(EclipseAppLauncher.java:110) 
at org.eclipse.core.runtime.internal.adaptor.EclipseAppLauncher.start(EclipseAppLauncher.java:79) 
at org.eclipse.core.runtime.adaptor.EclipseStarter.run(EclipseStarter.java:382) 
at org.eclipse.core.runtime.adaptor.EclipseStarter.run(EclipseStarter.java:179) 
at org.eclipse.equinox.launcher.Main.invokeFramework(Main.java:549) 
at org.eclipse.equinox.launcher.Main.basicRun(Main.java:504) 
at org.eclipse.equinox.launcher.Main.run(Main.java:1236) 
at org.eclipse.equinox.launcher.Main.main(Main.java:1212)
Test:  testSetNonJtaDataSource
Class:  JptEclipseLinkCoreTests
java.lang.RuntimeException: missing Java system property: "org.eclipse.jpt.jpa.jar" 
at org.eclipse.jpt.core.tests.internal.projects.TestJpaProject.jarName(TestJpaProject.java:65) 
at org.eclipse.jpt.core.tests.internal.projects.TestJpaProject.<init>(TestJpaProject.java:57) 
at org.eclipse.jpt.core.tests.internal.projects.TestJpaProject.buildJpaProject(TestJpaProject.java:35) 
at org.eclipse.jpt.core.tests.internal.context.ContextModelTestCase.buildJpaProject(ContextModelTestCase.java:90) 
at org.eclipse.jpt.core.tests.internal.context.ContextModelTestCase.buildJavaProject(ContextModelTestCase.java:85) 
at org.eclipse.jpt.core.tests.internal.utility.jdt.AnnotationTestCase.setUp(AnnotationTestCase.java:76) 
at org.eclipse.jpt.core.tests.internal.context.ContextModelTestCase.setUp(ContextModelTestCase.java:57) 
at org.eclipse.jpt.eclipselink.core.tests.internal.PersistenceUnitTestCase.setUp(PersistenceUnitTestCase.java:54) 
at org.eclipse.jpt.eclipselink.core.tests.internal.connection.ConnectionAdapterTests.setUp(ConnectionAdapterTests.java:105) 
at org.eclipse.test.EclipseTestRunner.run(EclipseTestRunner.java:354) 
at org.eclipse.test.EclipseTestRunner.run(EclipseTestRunner.java:206) 
at org.eclipse.test.CoreTestApplication.runTests(CoreTestApplication.java:35) 
at org.eclipse.test.CoreTestApplication.run(CoreTestApplication.java:31) 
at org.eclipse.equinox.internal.app.EclipseAppContainer.callMethodWithException(EclipseAppContainer.java:574) 
at org.eclipse.equinox.internal.app.EclipseAppHandle.run(EclipseAppHandle.java:195) 
at org.eclipse.core.runtime.internal.adaptor.EclipseAppLauncher.runApplication(EclipseAppLauncher.java:110) 
at org.eclipse.core.runtime.internal.adaptor.EclipseAppLauncher.start(EclipseAppLauncher.java:79) 
at org.eclipse.core.runtime.adaptor.EclipseStarter.run(EclipseStarter.java:382) 
at org.eclipse.core.runtime.adaptor.EclipseStarter.run(EclipseStarter.java:179) 
at org.eclipse.equinox.launcher.Main.invokeFramework(Main.java:549) 
at org.eclipse.equinox.launcher.Main.basicRun(Main.java:504) 
at org.eclipse.equinox.launcher.Main.run(Main.java:1236) 
at org.eclipse.equinox.launcher.Main.main(Main.java:1212)
Test:  testSetNativeSql
Class:  JptEclipseLinkCoreTests
java.lang.RuntimeException: missing Java system property: "org.eclipse.jpt.jpa.jar" 
at org.eclipse.jpt.core.tests.internal.projects.TestJpaProject.jarName(TestJpaProject.java:65) 
at org.eclipse.jpt.core.tests.internal.projects.TestJpaProject.<init>(TestJpaProject.java:57) 
at org.eclipse.jpt.core.tests.internal.projects.TestJpaProject.buildJpaProject(TestJpaProject.java:35) 
at org.eclipse.jpt.core.tests.internal.context.ContextModelTestCase.buildJpaProject(ContextModelTestCase.java:90) 
at org.eclipse.jpt.core.tests.internal.context.ContextModelTestCase.buildJavaProject(ContextModelTestCase.java:85) 
at org.eclipse.jpt.core.tests.internal.utility.jdt.AnnotationTestCase.setUp(AnnotationTestCase.java:76) 
at org.eclipse.jpt.core.tests.internal.context.ContextModelTestCase.setUp(ContextModelTestCase.java:57) 
at org.eclipse.jpt.eclipselink.core.tests.internal.PersistenceUnitTestCase.setUp(PersistenceUnitTestCase.java:54) 
at org.eclipse.jpt.eclipselink.core.tests.internal.connection.ConnectionAdapterTests.setUp(ConnectionAdapterTests.java:105) 
at org.eclipse.test.EclipseTestRunner.run(EclipseTestRunner.java:354) 
at org.eclipse.test.EclipseTestRunner.run(EclipseTestRunner.java:206) 
at org.eclipse.test.CoreTestApplication.runTests(CoreTestApplication.java:35) 
at org.eclipse.test.CoreTestApplication.run(CoreTestApplication.java:31) 
at org.eclipse.equinox.internal.app.EclipseAppContainer.callMethodWithException(EclipseAppContainer.java:574) 
at org.eclipse.equinox.internal.app.EclipseAppHandle.run(EclipseAppHandle.java:195) 
at org.eclipse.core.runtime.internal.adaptor.EclipseAppLauncher.runApplication(EclipseAppLauncher.java:110) 
at org.eclipse.core.runtime.internal.adaptor.EclipseAppLauncher.start(EclipseAppLauncher.java:79) 
at org.eclipse.core.runtime.adaptor.EclipseStarter.run(EclipseStarter.java:382) 
at org.eclipse.core.runtime.adaptor.EclipseStarter.run(EclipseStarter.java:179) 
at org.eclipse.equinox.launcher.Main.invokeFramework(Main.java:549) 
at org.eclipse.equinox.launcher.Main.basicRun(Main.java:504) 
at org.eclipse.equinox.launcher.Main.run(Main.java:1236) 
at org.eclipse.equinox.launcher.Main.main(Main.java:1212)
Test:  testAddRemoveNativeSql
Class:  JptEclipseLinkCoreTests
java.lang.RuntimeException: missing Java system property: "org.eclipse.jpt.jpa.jar" 
at org.eclipse.jpt.core.tests.internal.projects.TestJpaProject.jarName(TestJpaProject.java:65) 
at org.eclipse.jpt.core.tests.internal.projects.TestJpaProject.<init>(TestJpaProject.java:57) 
at org.eclipse.jpt.core.tests.internal.projects.TestJpaProject.buildJpaProject(TestJpaProject.java:35) 
at org.eclipse.jpt.core.tests.internal.context.ContextModelTestCase.buildJpaProject(ContextModelTestCase.java:90) 
at org.eclipse.jpt.core.tests.internal.context.ContextModelTestCase.buildJavaProject(ContextModelTestCase.java:85) 
at org.eclipse.jpt.core.tests.internal.utility.jdt.AnnotationTestCase.setUp(AnnotationTestCase.java:76) 
at org.eclipse.jpt.core.tests.internal.context.ContextModelTestCase.setUp(ContextModelTestCase.java:57) 
at org.eclipse.jpt.eclipselink.core.tests.internal.PersistenceUnitTestCase.setUp(PersistenceUnitTestCase.java:54) 
at org.eclipse.jpt.eclipselink.core.tests.internal.connection.ConnectionAdapterTests.setUp(ConnectionAdapterTests.java:105) 
at org.eclipse.test.EclipseTestRunner.run(EclipseTestRunner.java:354) 
at org.eclipse.test.EclipseTestRunner.run(EclipseTestRunner.java:206) 
at org.eclipse.test.CoreTestApplication.runTests(CoreTestApplication.java:35) 
at org.eclipse.test.CoreTestApplication.run(CoreTestApplication.java:31) 
at org.eclipse.equinox.internal.app.EclipseAppContainer.callMethodWithException(EclipseAppContainer.java:574) 
at org.eclipse.equinox.internal.app.EclipseAppHandle.run(EclipseAppHandle.java:195) 
at org.eclipse.core.runtime.internal.adaptor.EclipseAppLauncher.runApplication(EclipseAppLauncher.java:110) 
at org.eclipse.core.runtime.internal.adaptor.EclipseAppLauncher.start(EclipseAppLauncher.java:79) 
at org.eclipse.core.runtime.adaptor.EclipseStarter.run(EclipseStarter.java:382) 
at org.eclipse.core.runtime.adaptor.EclipseStarter.run(EclipseStarter.java:179) 
at org.eclipse.equinox.launcher.Main.invokeFramework(Main.java:549) 
at org.eclipse.equinox.launcher.Main.basicRun(Main.java:504) 
at org.eclipse.equinox.launcher.Main.run(Main.java:1236) 
at org.eclipse.equinox.launcher.Main.main(Main.java:1212)
Test:  testSetBatchWriting
Class:  JptEclipseLinkCoreTests
java.lang.RuntimeException: missing Java system property: "org.eclipse.jpt.jpa.jar" 
at org.eclipse.jpt.core.tests.internal.projects.TestJpaProject.jarName(TestJpaProject.java:65) 
at org.eclipse.jpt.core.tests.internal.projects.TestJpaProject.<init>(TestJpaProject.java:57) 
at org.eclipse.jpt.core.tests.internal.projects.TestJpaProject.buildJpaProject(TestJpaProject.java:35) 
at org.eclipse.jpt.core.tests.internal.context.ContextModelTestCase.buildJpaProject(ContextModelTestCase.java:90) 
at org.eclipse.jpt.core.tests.internal.context.ContextModelTestCase.buildJavaProject(ContextModelTestCase.java:85) 
at org.eclipse.jpt.core.tests.internal.utility.jdt.AnnotationTestCase.setUp(AnnotationTestCase.java:76) 
at org.eclipse.jpt.core.tests.internal.context.ContextModelTestCase.setUp(ContextModelTestCase.java:57) 
at org.eclipse.jpt.eclipselink.core.tests.internal.PersistenceUnitTestCase.setUp(PersistenceUnitTestCase.java:54) 
at org.eclipse.jpt.eclipselink.core.tests.internal.connection.ConnectionAdapterTests.setUp(ConnectionAdapterTests.java:105) 
at org.eclipse.test.EclipseTestRunner.run(EclipseTestRunner.java:354) 
at org.eclipse.test.EclipseTestRunner.run(EclipseTestRunner.java:206) 
at org.eclipse.test.CoreTestApplication.runTests(CoreTestApplication.java:35) 
at org.eclipse.test.CoreTestApplication.run(CoreTestApplication.java:31) 
at org.eclipse.equinox.internal.app.EclipseAppContainer.callMethodWithException(EclipseAppContainer.java:574) 
at org.eclipse.equinox.internal.app.EclipseAppHandle.run(EclipseAppHandle.java:195) 
at org.eclipse.core.runtime.internal.adaptor.EclipseAppLauncher.runApplication(EclipseAppLauncher.java:110) 
at org.eclipse.core.runtime.internal.adaptor.EclipseAppLauncher.start(EclipseAppLauncher.java:79) 
at org.eclipse.core.runtime.adaptor.EclipseStarter.run(EclipseStarter.java:382) 
at org.eclipse.core.runtime.adaptor.EclipseStarter.run(EclipseStarter.java:179) 
at org.eclipse.equinox.launcher.Main.invokeFramework(Main.java:549) 
at org.eclipse.equinox.launcher.Main.basicRun(Main.java:504) 
at org.eclipse.equinox.launcher.Main.run(Main.java:1236) 
at org.eclipse.equinox.launcher.Main.main(Main.java:1212)
Test:  testAddRemoveBatchWriting
Class:  JptEclipseLinkCoreTests
java.lang.RuntimeException: missing Java system property: "org.eclipse.jpt.jpa.jar" 
at org.eclipse.jpt.core.tests.internal.projects.TestJpaProject.jarName(TestJpaProject.java:65) 
at org.eclipse.jpt.core.tests.internal.projects.TestJpaProject.<init>(TestJpaProject.java:57) 
at org.eclipse.jpt.core.tests.internal.projects.TestJpaProject.buildJpaProject(TestJpaProject.java:35) 
at org.eclipse.jpt.core.tests.internal.context.ContextModelTestCase.buildJpaProject(ContextModelTestCase.java:90) 
at org.eclipse.jpt.core.tests.internal.context.ContextModelTestCase.buildJavaProject(ContextModelTestCase.java:85) 
at org.eclipse.jpt.core.tests.internal.utility.jdt.AnnotationTestCase.setUp(AnnotationTestCase.java:76) 
at org.eclipse.jpt.core.tests.internal.context.ContextModelTestCase.setUp(ContextModelTestCase.java:57) 
at org.eclipse.jpt.eclipselink.core.tests.internal.PersistenceUnitTestCase.setUp(PersistenceUnitTestCase.java:54) 
at org.eclipse.jpt.eclipselink.core.tests.internal.connection.ConnectionAdapterTests.setUp(ConnectionAdapterTests.java:105) 
at org.eclipse.test.EclipseTestRunner.run(EclipseTestRunner.java:354) 
at org.eclipse.test.EclipseTestRunner.run(EclipseTestRunner.java:206) 
at org.eclipse.test.CoreTestApplication.runTests(CoreTestApplication.java:35) 
at org.eclipse.test.CoreTestApplication.run(CoreTestApplication.java:31) 
at org.eclipse.equinox.internal.app.EclipseAppContainer.callMethodWithException(EclipseAppContainer.java:574) 
at org.eclipse.equinox.internal.app.EclipseAppHandle.run(EclipseAppHandle.java:195) 
at org.eclipse.core.runtime.internal.adaptor.EclipseAppLauncher.runApplication(EclipseAppLauncher.java:110) 
at org.eclipse.core.runtime.internal.adaptor.EclipseAppLauncher.start(EclipseAppLauncher.java:79) 
at org.eclipse.core.runtime.adaptor.EclipseStarter.run(EclipseStarter.java:382) 
at org.eclipse.core.runtime.adaptor.EclipseStarter.run(EclipseStarter.java:179) 
at org.eclipse.equinox.launcher.Main.invokeFramework(Main.java:549) 
at org.eclipse.equinox.launcher.Main.basicRun(Main.java:504) 
at org.eclipse.equinox.launcher.Main.run(Main.java:1236) 
at org.eclipse.equinox.launcher.Main.main(Main.java:1212)
Test:  testSetCacheStatements
Class:  JptEclipseLinkCoreTests
java.lang.RuntimeException: missing Java system property: "org.eclipse.jpt.jpa.jar" 
at org.eclipse.jpt.core.tests.internal.projects.TestJpaProject.jarName(TestJpaProject.java:65) 
at org.eclipse.jpt.core.tests.internal.projects.TestJpaProject.<init>(TestJpaProject.java:57) 
at org.eclipse.jpt.core.tests.internal.projects.TestJpaProject.buildJpaProject(TestJpaProject.java:35) 
at org.eclipse.jpt.core.tests.internal.context.ContextModelTestCase.buildJpaProject(ContextModelTestCase.java:90) 
at org.eclipse.jpt.core.tests.internal.context.ContextModelTestCase.buildJavaProject(ContextModelTestCase.java:85) 
at org.eclipse.jpt.core.tests.internal.utility.jdt.AnnotationTestCase.setUp(AnnotationTestCase.java:76) 
at org.eclipse.jpt.core.tests.internal.context.ContextModelTestCase.setUp(ContextModelTestCase.java:57) 
at org.eclipse.jpt.eclipselink.core.tests.internal.PersistenceUnitTestCase.setUp(PersistenceUnitTestCase.java:54) 
at org.eclipse.jpt.eclipselink.core.tests.internal.connection.ConnectionAdapterTests.setUp(ConnectionAdapterTests.java:105) 
at org.eclipse.test.EclipseTestRunner.run(EclipseTestRunner.java:354) 
at org.eclipse.test.EclipseTestRunner.run(EclipseTestRunner.java:206) 
at org.eclipse.test.CoreTestApplication.runTests(CoreTestApplication.java:35) 
at org.eclipse.test.CoreTestApplication.run(CoreTestApplication.java:31) 
at org.eclipse.equinox.internal.app.EclipseAppContainer.callMethodWithException(EclipseAppContainer.java:574) 
at org.eclipse.equinox.internal.app.EclipseAppHandle.run(EclipseAppHandle.java:195) 
at org.eclipse.core.runtime.internal.adaptor.EclipseAppLauncher.runApplication(EclipseAppLauncher.java:110) 
at org.eclipse.core.runtime.internal.adaptor.EclipseAppLauncher.start(EclipseAppLauncher.java:79) 
at org.eclipse.core.runtime.adaptor.EclipseStarter.run(EclipseStarter.java:382) 
at org.eclipse.core.runtime.adaptor.EclipseStarter.run(EclipseStarter.java:179) 
at org.eclipse.equinox.launcher.Main.invokeFramework(Main.java:549) 
at org.eclipse.equinox.launcher.Main.basicRun(Main.java:504) 
at org.eclipse.equinox.launcher.Main.run(Main.java:1236) 
at org.eclipse.equinox.launcher.Main.main(Main.java:1212)
Test:  testAddRemoveCacheStatements
Class:  JptEclipseLinkCoreTests
java.lang.RuntimeException: missing Java system property: "org.eclipse.jpt.jpa.jar" 
at org.eclipse.jpt.core.tests.internal.projects.TestJpaProject.jarName(TestJpaProject.java:65) 
at org.eclipse.jpt.core.tests.internal.projects.TestJpaProject.<init>(TestJpaProject.java:57) 
at org.eclipse.jpt.core.tests.internal.projects.TestJpaProject.buildJpaProject(TestJpaProject.java:35) 
at org.eclipse.jpt.core.tests.internal.context.ContextModelTestCase.buildJpaProject(ContextModelTestCase.java:90) 
at org.eclipse.jpt.core.tests.internal.context.ContextModelTestCase.buildJavaProject(ContextModelTestCase.java:85) 
at org.eclipse.jpt.core.tests.internal.utility.jdt.AnnotationTestCase.setUp(AnnotationTestCase.java:76) 
at org.eclipse.jpt.core.tests.internal.context.ContextModelTestCase.setUp(ContextModelTestCase.java:57) 
at org.eclipse.jpt.eclipselink.core.tests.internal.PersistenceUnitTestCase.setUp(PersistenceUnitTestCase.java:54) 
at org.eclipse.jpt.eclipselink.core.tests.internal.connection.ConnectionAdapterTests.setUp(ConnectionAdapterTests.java:105) 
at org.eclipse.test.EclipseTestRunner.run(EclipseTestRunner.java:354) 
at org.eclipse.test.EclipseTestRunner.run(EclipseTestRunner.java:206) 
at org.eclipse.test.CoreTestApplication.runTests(CoreTestApplication.java:35) 
at org.eclipse.test.CoreTestApplication.run(CoreTestApplication.java:31) 
at org.eclipse.equinox.internal.app.EclipseAppContainer.callMethodWithException(EclipseAppContainer.java:574) 
at org.eclipse.equinox.internal.app.EclipseAppHandle.run(EclipseAppHandle.java:195) 
at org.eclipse.core.runtime.internal.adaptor.EclipseAppLauncher.runApplication(EclipseAppLauncher.java:110) 
at org.eclipse.core.runtime.internal.adaptor.EclipseAppLauncher.start(EclipseAppLauncher.java:79) 
at org.eclipse.core.runtime.adaptor.EclipseStarter.run(EclipseStarter.java:382) 
at org.eclipse.core.runtime.adaptor.EclipseStarter.run(EclipseStarter.java:179) 
at org.eclipse.equinox.launcher.Main.invokeFramework(Main.java:549) 
at org.eclipse.equinox.launcher.Main.basicRun(Main.java:504) 
at org.eclipse.equinox.launcher.Main.run(Main.java:1236) 
at org.eclipse.equinox.launcher.Main.main(Main.java:1212)
Test:  testSetCacheStatementsSize
Class:  JptEclipseLinkCoreTests
java.lang.RuntimeException: missing Java system property: "org.eclipse.jpt.jpa.jar" 
at org.eclipse.jpt.core.tests.internal.projects.TestJpaProject.jarName(TestJpaProject.java:65) 
at org.eclipse.jpt.core.tests.internal.projects.TestJpaProject.<init>(TestJpaProject.java:57) 
at org.eclipse.jpt.core.tests.internal.projects.TestJpaProject.buildJpaProject(TestJpaProject.java:35) 
at org.eclipse.jpt.core.tests.internal.context.ContextModelTestCase.buildJpaProject(ContextModelTestCase.java:90) 
at org.eclipse.jpt.core.tests.internal.context.ContextModelTestCase.buildJavaProject(ContextModelTestCase.java:85) 
at org.eclipse.jpt.core.tests.internal.utility.jdt.AnnotationTestCase.setUp(AnnotationTestCase.java:76) 
at org.eclipse.jpt.core.tests.internal.context.ContextModelTestCase.setUp(ContextModelTestCase.java:57) 
at org.eclipse.jpt.eclipselink.core.tests.internal.PersistenceUnitTestCase.setUp(PersistenceUnitTestCase.java:54) 
at org.eclipse.jpt.eclipselink.core.tests.internal.connection.ConnectionAdapterTests.setUp(ConnectionAdapterTests.java:105) 
at org.eclipse.test.EclipseTestRunner.run(EclipseTestRunner.java:354) 
at org.eclipse.test.EclipseTestRunner.run(EclipseTestRunner.java:206) 
at org.eclipse.test.CoreTestApplication.runTests(CoreTestApplication.java:35) 
at org.eclipse.test.CoreTestApplication.run(CoreTestApplication.java:31) 
at org.eclipse.equinox.internal.app.EclipseAppContainer.callMethodWithException(EclipseAppContainer.java:574) 
at org.eclipse.equinox.internal.app.EclipseAppHandle.run(EclipseAppHandle.java:195) 
at org.eclipse.core.runtime.internal.adaptor.EclipseAppLauncher.runApplication(EclipseAppLauncher.java:110) 
at org.eclipse.core.runtime.internal.adaptor.EclipseAppLauncher.start(EclipseAppLauncher.java:79) 
at org.eclipse.core.runtime.adaptor.EclipseStarter.run(EclipseStarter.java:382) 
at org.eclipse.core.runtime.adaptor.EclipseStarter.run(EclipseStarter.java:179) 
at org.eclipse.equinox.launcher.Main.invokeFramework(Main.java:549) 
at org.eclipse.equinox.launcher.Main.basicRun(Main.java:504) 
at org.eclipse.equinox.launcher.Main.run(Main.java:1236) 
at org.eclipse.equinox.launcher.Main.main(Main.java:1212)
Test:  testAddRemoveCacheStatementsSize
Class:  JptEclipseLinkCoreTests
java.lang.RuntimeException: missing Java system property: "org.eclipse.jpt.jpa.jar" 
at org.eclipse.jpt.core.tests.internal.projects.TestJpaProject.jarName(TestJpaProject.java:65) 
at org.eclipse.jpt.core.tests.internal.projects.TestJpaProject.<init>(TestJpaProject.java:57) 
at org.eclipse.jpt.core.tests.internal.projects.TestJpaProject.buildJpaProject(TestJpaProject.java:35) 
at org.eclipse.jpt.core.tests.internal.context.ContextModelTestCase.buildJpaProject(ContextModelTestCase.java:90) 
at org.eclipse.jpt.core.tests.internal.context.ContextModelTestCase.buildJavaProject(ContextModelTestCase.java:85) 
at org.eclipse.jpt.core.tests.internal.utility.jdt.AnnotationTestCase.setUp(AnnotationTestCase.java:76) 
at org.eclipse.jpt.core.tests.internal.context.ContextModelTestCase.setUp(ContextModelTestCase.java:57) 
at org.eclipse.jpt.eclipselink.core.tests.internal.PersistenceUnitTestCase.setUp(PersistenceUnitTestCase.java:54) 
at org.eclipse.jpt.eclipselink.core.tests.internal.connection.ConnectionAdapterTests.setUp(ConnectionAdapterTests.java:105) 
at org.eclipse.test.EclipseTestRunner.run(EclipseTestRunner.java:354) 
at org.eclipse.test.EclipseTestRunner.run(EclipseTestRunner.java:206) 
at org.eclipse.test.CoreTestApplication.runTests(CoreTestApplication.java:35) 
at org.eclipse.test.CoreTestApplication.run(CoreTestApplication.java:31) 
at org.eclipse.equinox.internal.app.EclipseAppContainer.callMethodWithException(EclipseAppContainer.java:574) 
at org.eclipse.equinox.internal.app.EclipseAppHandle.run(EclipseAppHandle.java:195) 
at org.eclipse.core.runtime.internal.adaptor.EclipseAppLauncher.runApplication(EclipseAppLauncher.java:110) 
at org.eclipse.core.runtime.internal.adaptor.EclipseAppLauncher.start(EclipseAppLauncher.java:79) 
at org.eclipse.core.runtime.adaptor.EclipseStarter.run(EclipseStarter.java:382) 
at org.eclipse.core.runtime.adaptor.EclipseStarter.run(EclipseStarter.java:179) 
at org.eclipse.equinox.launcher.Main.invokeFramework(Main.java:549) 
at org.eclipse.equinox.launcher.Main.basicRun(Main.java:504) 
at org.eclipse.equinox.launcher.Main.run(Main.java:1236) 
at org.eclipse.equinox.launcher.Main.main(Main.java:1212)
Test:  testSetDriver
Class:  JptEclipseLinkCoreTests
java.lang.RuntimeException: missing Java system property: "org.eclipse.jpt.jpa.jar" 
at org.eclipse.jpt.core.tests.internal.projects.TestJpaProject.jarName(TestJpaProject.java:65) 
at org.eclipse.jpt.core.tests.internal.projects.TestJpaProject.<init>(TestJpaProject.java:57) 
at org.eclipse.jpt.core.tests.internal.projects.TestJpaProject.buildJpaProject(TestJpaProject.java:35) 
at org.eclipse.jpt.core.tests.internal.context.ContextModelTestCase.buildJpaProject(ContextModelTestCase.java:90) 
at org.eclipse.jpt.core.tests.internal.context.ContextModelTestCase.buildJavaProject(ContextModelTestCase.java:85) 
at org.eclipse.jpt.core.tests.internal.utility.jdt.AnnotationTestCase.setUp(AnnotationTestCase.java:76) 
at org.eclipse.jpt.core.tests.internal.context.ContextModelTestCase.setUp(ContextModelTestCase.java:57) 
at org.eclipse.jpt.eclipselink.core.tests.internal.PersistenceUnitTestCase.setUp(PersistenceUnitTestCase.java:54) 
at org.eclipse.jpt.eclipselink.core.tests.internal.connection.ConnectionAdapterTests.setUp(ConnectionAdapterTests.java:105) 
at org.eclipse.test.EclipseTestRunner.run(EclipseTestRunner.java:354) 
at org.eclipse.test.EclipseTestRunner.run(EclipseTestRunner.java:206) 
at org.eclipse.test.CoreTestApplication.runTests(CoreTestApplication.java:35) 
at org.eclipse.test.CoreTestApplication.run(CoreTestApplication.java:31) 
at org.eclipse.equinox.internal.app.EclipseAppContainer.callMethodWithException(EclipseAppContainer.java:574) 
at org.eclipse.equinox.internal.app.EclipseAppHandle.run(EclipseAppHandle.java:195) 
at org.eclipse.core.runtime.internal.adaptor.EclipseAppLauncher.runApplication(EclipseAppLauncher.java:110) 
at org.eclipse.core.runtime.internal.adaptor.EclipseAppLauncher.start(EclipseAppLauncher.java:79) 
at org.eclipse.core.runtime.adaptor.EclipseStarter.run(EclipseStarter.java:382) 
at org.eclipse.core.runtime.adaptor.EclipseStarter.run(EclipseStarter.java:179) 
at org.eclipse.equinox.launcher.Main.invokeFramework(Main.java:549) 
at org.eclipse.equinox.launcher.Main.basicRun(Main.java:504) 
at org.eclipse.equinox.launcher.Main.run(Main.java:1236) 
at org.eclipse.equinox.launcher.Main.main(Main.java:1212)
Test:  testAddRemoveDriver
Class:  JptEclipseLinkCoreTests
java.lang.RuntimeException: missing Java system property: "org.eclipse.jpt.jpa.jar" 
at org.eclipse.jpt.core.tests.internal.projects.TestJpaProject.jarName(TestJpaProject.java:65) 
at org.eclipse.jpt.core.tests.internal.projects.TestJpaProject.<init>(TestJpaProject.java:57) 
at org.eclipse.jpt.core.tests.internal.projects.TestJpaProject.buildJpaProject(TestJpaProject.java:35) 
at org.eclipse.jpt.core.tests.internal.context.ContextModelTestCase.buildJpaProject(ContextModelTestCase.java:90) 
at org.eclipse.jpt.core.tests.internal.context.ContextModelTestCase.buildJavaProject(ContextModelTestCase.java:85) 
at org.eclipse.jpt.core.tests.internal.utility.jdt.AnnotationTestCase.setUp(AnnotationTestCase.java:76) 
at org.eclipse.jpt.core.tests.internal.context.ContextModelTestCase.setUp(ContextModelTestCase.java:57) 
at org.eclipse.jpt.eclipselink.core.tests.internal.PersistenceUnitTestCase.setUp(PersistenceUnitTestCase.java:54) 
at org.eclipse.jpt.eclipselink.core.tests.internal.connection.ConnectionAdapterTests.setUp(ConnectionAdapterTests.java:105) 
at org.eclipse.test.EclipseTestRunner.run(EclipseTestRunner.java:354) 
at org.eclipse.test.EclipseTestRunner.run(EclipseTestRunner.java:206) 
at org.eclipse.test.CoreTestApplication.runTests(CoreTestApplication.java:35) 
at org.eclipse.test.CoreTestApplication.run(CoreTestApplication.java:31) 
at org.eclipse.equinox.internal.app.EclipseAppContainer.callMethodWithException(EclipseAppContainer.java:574) 
at org.eclipse.equinox.internal.app.EclipseAppHandle.run(EclipseAppHandle.java:195) 
at org.eclipse.core.runtime.internal.adaptor.EclipseAppLauncher.runApplication(EclipseAppLauncher.java:110) 
at org.eclipse.core.runtime.internal.adaptor.EclipseAppLauncher.start(EclipseAppLauncher.java:79) 
at org.eclipse.core.runtime.adaptor.EclipseStarter.run(EclipseStarter.java:382) 
at org.eclipse.core.runtime.adaptor.EclipseStarter.run(EclipseStarter.java:179) 
at org.eclipse.equinox.launcher.Main.invokeFramework(Main.java:549) 
at org.eclipse.equinox.launcher.Main.basicRun(Main.java:504) 
at org.eclipse.equinox.launcher.Main.run(Main.java:1236) 
at org.eclipse.equinox.launcher.Main.main(Main.java:1212)
Test:  testSetUrl
Class:  JptEclipseLinkCoreTests
java.lang.RuntimeException: missing Java system property: "org.eclipse.jpt.jpa.jar" 
at org.eclipse.jpt.core.tests.internal.projects.TestJpaProject.jarName(TestJpaProject.java:65) 
at org.eclipse.jpt.core.tests.internal.projects.TestJpaProject.<init>(TestJpaProject.java:57) 
at org.eclipse.jpt.core.tests.internal.projects.TestJpaProject.buildJpaProject(TestJpaProject.java:35) 
at org.eclipse.jpt.core.tests.internal.context.ContextModelTestCase.buildJpaProject(ContextModelTestCase.java:90) 
at org.eclipse.jpt.core.tests.internal.context.ContextModelTestCase.buildJavaProject(ContextModelTestCase.java:85) 
at org.eclipse.jpt.core.tests.internal.utility.jdt.AnnotationTestCase.setUp(AnnotationTestCase.java:76) 
at org.eclipse.jpt.core.tests.internal.context.ContextModelTestCase.setUp(ContextModelTestCase.java:57) 
at org.eclipse.jpt.eclipselink.core.tests.internal.PersistenceUnitTestCase.setUp(PersistenceUnitTestCase.java:54) 
at org.eclipse.jpt.eclipselink.core.tests.internal.connection.ConnectionAdapterTests.setUp(ConnectionAdapterTests.java:105) 
at org.eclipse.test.EclipseTestRunner.run(EclipseTestRunner.java:354) 
at org.eclipse.test.EclipseTestRunner.run(EclipseTestRunner.java:206) 
at org.eclipse.test.CoreTestApplication.runTests(CoreTestApplication.java:35) 
at org.eclipse.test.CoreTestApplication.run(CoreTestApplication.java:31) 
at org.eclipse.equinox.internal.app.EclipseAppContainer.callMethodWithException(EclipseAppContainer.java:574) 
at org.eclipse.equinox.internal.app.EclipseAppHandle.run(EclipseAppHandle.java:195) 
at org.eclipse.core.runtime.internal.adaptor.EclipseAppLauncher.runApplication(EclipseAppLauncher.java:110) 
at org.eclipse.core.runtime.internal.adaptor.EclipseAppLauncher.start(EclipseAppLauncher.java:79) 
at org.eclipse.core.runtime.adaptor.EclipseStarter.run(EclipseStarter.java:382) 
at org.eclipse.core.runtime.adaptor.EclipseStarter.run(EclipseStarter.java:179) 
at org.eclipse.equinox.launcher.Main.invokeFramework(Main.java:549) 
at org.eclipse.equinox.launcher.Main.basicRun(Main.java:504) 
at org.eclipse.equinox.launcher.Main.run(Main.java:1236) 
at org.eclipse.equinox.launcher.Main.main(Main.java:1212)
Test:  testAddRemoveUrl
Class:  JptEclipseLinkCoreTests
java.lang.RuntimeException: missing Java system property: "org.eclipse.jpt.jpa.jar" 
at org.eclipse.jpt.core.tests.internal.projects.TestJpaProject.jarName(TestJpaProject.java:65) 
at org.eclipse.jpt.core.tests.internal.projects.TestJpaProject.<init>(TestJpaProject.java:57) 
at org.eclipse.jpt.core.tests.internal.projects.TestJpaProject.buildJpaProject(TestJpaProject.java:35) 
at org.eclipse.jpt.core.tests.internal.context.ContextModelTestCase.buildJpaProject(ContextModelTestCase.java:90) 
at org.eclipse.jpt.core.tests.internal.context.ContextModelTestCase.buildJavaProject(ContextModelTestCase.java:85) 
at org.eclipse.jpt.core.tests.internal.utility.jdt.AnnotationTestCase.setUp(AnnotationTestCase.java:76) 
at org.eclipse.jpt.core.tests.internal.context.ContextModelTestCase.setUp(ContextModelTestCase.java:57) 
at org.eclipse.jpt.eclipselink.core.tests.internal.PersistenceUnitTestCase.setUp(PersistenceUnitTestCase.java:54) 
at org.eclipse.jpt.eclipselink.core.tests.internal.connection.ConnectionAdapterTests.setUp(ConnectionAdapterTests.java:105) 
at org.eclipse.test.EclipseTestRunner.run(EclipseTestRunner.java:354) 
at org.eclipse.test.EclipseTestRunner.run(EclipseTestRunner.java:206) 
at org.eclipse.test.CoreTestApplication.runTests(CoreTestApplication.java:35) 
at org.eclipse.test.CoreTestApplication.run(CoreTestApplication.java:31) 
at org.eclipse.equinox.internal.app.EclipseAppContainer.callMethodWithException(EclipseAppContainer.java:574) 
at org.eclipse.equinox.internal.app.EclipseAppHandle.run(EclipseAppHandle.java:195) 
at org.eclipse.core.runtime.internal.adaptor.EclipseAppLauncher.runApplication(EclipseAppLauncher.java:110) 
at org.eclipse.core.runtime.internal.adaptor.EclipseAppLauncher.start(EclipseAppLauncher.java:79) 
at org.eclipse.core.runtime.adaptor.EclipseStarter.run(EclipseStarter.java:382) 
at org.eclipse.core.runtime.adaptor.EclipseStarter.run(EclipseStarter.java:179) 
at org.eclipse.equinox.launcher.Main.invokeFramework(Main.java:549) 
at org.eclipse.equinox.launcher.Main.basicRun(Main.java:504) 
at org.eclipse.equinox.launcher.Main.run(Main.java:1236) 
at org.eclipse.equinox.launcher.Main.main(Main.java:1212)
Test:  testSetUser
Class:  JptEclipseLinkCoreTests
java.lang.RuntimeException: missing Java system property: "org.eclipse.jpt.jpa.jar" 
at org.eclipse.jpt.core.tests.internal.projects.TestJpaProject.jarName(TestJpaProject.java:65) 
at org.eclipse.jpt.core.tests.internal.projects.TestJpaProject.<init>(TestJpaProject.java:57) 
at org.eclipse.jpt.core.tests.internal.projects.TestJpaProject.buildJpaProject(TestJpaProject.java:35) 
at org.eclipse.jpt.core.tests.internal.context.ContextModelTestCase.buildJpaProject(ContextModelTestCase.java:90) 
at org.eclipse.jpt.core.tests.internal.context.ContextModelTestCase.buildJavaProject(ContextModelTestCase.java:85) 
at org.eclipse.jpt.core.tests.internal.utility.jdt.AnnotationTestCase.setUp(AnnotationTestCase.java:76) 
at org.eclipse.jpt.core.tests.internal.context.ContextModelTestCase.setUp(ContextModelTestCase.java:57) 
at org.eclipse.jpt.eclipselink.core.tests.internal.PersistenceUnitTestCase.setUp(PersistenceUnitTestCase.java:54) 
at org.eclipse.jpt.eclipselink.core.tests.internal.connection.ConnectionAdapterTests.setUp(ConnectionAdapterTests.java:105) 
at org.eclipse.test.EclipseTestRunner.run(EclipseTestRunner.java:354) 
at org.eclipse.test.EclipseTestRunner.run(EclipseTestRunner.java:206) 
at org.eclipse.test.CoreTestApplication.runTests(CoreTestApplication.java:35) 
at org.eclipse.test.CoreTestApplication.run(CoreTestApplication.java:31) 
at org.eclipse.equinox.internal.app.EclipseAppContainer.callMethodWithException(EclipseAppContainer.java:574) 
at org.eclipse.equinox.internal.app.EclipseAppHandle.run(EclipseAppHandle.java:195) 
at org.eclipse.core.runtime.internal.adaptor.EclipseAppLauncher.runApplication(EclipseAppLauncher.java:110) 
at org.eclipse.core.runtime.internal.adaptor.EclipseAppLauncher.start(EclipseAppLauncher.java:79) 
at org.eclipse.core.runtime.adaptor.EclipseStarter.run(EclipseStarter.java:382) 
at org.eclipse.core.runtime.adaptor.EclipseStarter.run(EclipseStarter.java:179) 
at org.eclipse.equinox.launcher.Main.invokeFramework(Main.java:549) 
at org.eclipse.equinox.launcher.Main.basicRun(Main.java:504) 
at org.eclipse.equinox.launcher.Main.run(Main.java:1236) 
at org.eclipse.equinox.launcher.Main.main(Main.java:1212)
Test:  testAddRemoveUser
Class:  JptEclipseLinkCoreTests
java.lang.RuntimeException: missing Java system property: "org.eclipse.jpt.jpa.jar" 
at org.eclipse.jpt.core.tests.internal.projects.TestJpaProject.jarName(TestJpaProject.java:65) 
at org.eclipse.jpt.core.tests.internal.projects.TestJpaProject.<init>(TestJpaProject.java:57) 
at org.eclipse.jpt.core.tests.internal.projects.TestJpaProject.buildJpaProject(TestJpaProject.java:35) 
at org.eclipse.jpt.core.tests.internal.context.ContextModelTestCase.buildJpaProject(ContextModelTestCase.java:90) 
at org.eclipse.jpt.core.tests.internal.context.ContextModelTestCase.buildJavaProject(ContextModelTestCase.java:85) 
at org.eclipse.jpt.core.tests.internal.utility.jdt.AnnotationTestCase.setUp(AnnotationTestCase.java:76) 
at org.eclipse.jpt.core.tests.internal.context.ContextModelTestCase.setUp(ContextModelTestCase.java:57) 
at org.eclipse.jpt.eclipselink.core.tests.internal.PersistenceUnitTestCase.setUp(PersistenceUnitTestCase.java:54) 
at org.eclipse.jpt.eclipselink.core.tests.internal.connection.ConnectionAdapterTests.setUp(ConnectionAdapterTests.java:105) 
at org.eclipse.test.EclipseTestRunner.run(EclipseTestRunner.java:354) 
at org.eclipse.test.EclipseTestRunner.run(EclipseTestRunner.java:206) 
at org.eclipse.test.CoreTestApplication.runTests(CoreTestApplication.java:35) 
at org.eclipse.test.CoreTestApplication.run(CoreTestApplication.java:31) 
at org.eclipse.equinox.internal.app.EclipseAppContainer.callMethodWithException(EclipseAppContainer.java:574) 
at org.eclipse.equinox.internal.app.EclipseAppHandle.run(EclipseAppHandle.java:195) 
at org.eclipse.core.runtime.internal.adaptor.EclipseAppLauncher.runApplication(EclipseAppLauncher.java:110) 
at org.eclipse.core.runtime.internal.adaptor.EclipseAppLauncher.start(EclipseAppLauncher.java:79) 
at org.eclipse.core.runtime.adaptor.EclipseStarter.run(EclipseStarter.java:382) 
at org.eclipse.core.runtime.adaptor.EclipseStarter.run(EclipseStarter.java:179) 
at org.eclipse.equinox.launcher.Main.invokeFramework(Main.java:549) 
at org.eclipse.equinox.launcher.Main.basicRun(Main.java:504) 
at org.eclipse.equinox.launcher.Main.run(Main.java:1236) 
at org.eclipse.equinox.launcher.Main.main(Main.java:1212)
Test:  testSetPassword
Class:  JptEclipseLinkCoreTests
java.lang.RuntimeException: missing Java system property: "org.eclipse.jpt.jpa.jar" 
at org.eclipse.jpt.core.tests.internal.projects.TestJpaProject.jarName(TestJpaProject.java:65) 
at org.eclipse.jpt.core.tests.internal.projects.TestJpaProject.<init>(TestJpaProject.java:57) 
at org.eclipse.jpt.core.tests.internal.projects.TestJpaProject.buildJpaProject(TestJpaProject.java:35) 
at org.eclipse.jpt.core.tests.internal.context.ContextModelTestCase.buildJpaProject(ContextModelTestCase.java:90) 
at org.eclipse.jpt.core.tests.internal.context.ContextModelTestCase.buildJavaProject(ContextModelTestCase.java:85) 
at org.eclipse.jpt.core.tests.internal.utility.jdt.AnnotationTestCase.setUp(AnnotationTestCase.java:76) 
at org.eclipse.jpt.core.tests.internal.context.ContextModelTestCase.setUp(ContextModelTestCase.java:57) 
at org.eclipse.jpt.eclipselink.core.tests.internal.PersistenceUnitTestCase.setUp(PersistenceUnitTestCase.java:54) 
at org.eclipse.jpt.eclipselink.core.tests.internal.connection.ConnectionAdapterTests.setUp(ConnectionAdapterTests.java:105) 
at org.eclipse.test.EclipseTestRunner.run(EclipseTestRunner.java:354) 
at org.eclipse.test.EclipseTestRunner.run(EclipseTestRunner.java:206) 
at org.eclipse.test.CoreTestApplication.runTests(CoreTestApplication.java:35) 
at org.eclipse.test.CoreTestApplication.run(CoreTestApplication.java:31) 
at org.eclipse.equinox.internal.app.EclipseAppContainer.callMethodWithException(EclipseAppContainer.java:574) 
at org.eclipse.equinox.internal.app.EclipseAppHandle.run(EclipseAppHandle.java:195) 
at org.eclipse.core.runtime.internal.adaptor.EclipseAppLauncher.runApplication(EclipseAppLauncher.java:110) 
at org.eclipse.core.runtime.internal.adaptor.EclipseAppLauncher.start(EclipseAppLauncher.java:79) 
at org.eclipse.core.runtime.adaptor.EclipseStarter.run(EclipseStarter.java:382) 
at org.eclipse.core.runtime.adaptor.EclipseStarter.run(EclipseStarter.java:179) 
at org.eclipse.equinox.launcher.Main.invokeFramework(Main.java:549) 
at org.eclipse.equinox.launcher.Main.basicRun(Main.java:504) 
at org.eclipse.equinox.launcher.Main.run(Main.java:1236) 
at org.eclipse.equinox.launcher.Main.main(Main.java:1212)
Test:  testAddRemovePassword
Class:  JptEclipseLinkCoreTests
java.lang.RuntimeException: missing Java system property: "org.eclipse.jpt.jpa.jar" 
at org.eclipse.jpt.core.tests.internal.projects.TestJpaProject.jarName(TestJpaProject.java:65) 
at org.eclipse.jpt.core.tests.internal.projects.TestJpaProject.<init>(TestJpaProject.java:57) 
at org.eclipse.jpt.core.tests.internal.projects.TestJpaProject.buildJpaProject(TestJpaProject.java:35) 
at org.eclipse.jpt.core.tests.internal.context.ContextModelTestCase.buildJpaProject(ContextModelTestCase.java:90) 
at org.eclipse.jpt.core.tests.internal.context.ContextModelTestCase.buildJavaProject(ContextModelTestCase.java:85) 
at org.eclipse.jpt.core.tests.internal.utility.jdt.AnnotationTestCase.setUp(AnnotationTestCase.java:76) 
at org.eclipse.jpt.core.tests.internal.context.ContextModelTestCase.setUp(ContextModelTestCase.java:57) 
at org.eclipse.jpt.eclipselink.core.tests.internal.PersistenceUnitTestCase.setUp(PersistenceUnitTestCase.java:54) 
at org.eclipse.jpt.eclipselink.core.tests.internal.connection.ConnectionAdapterTests.setUp(ConnectionAdapterTests.java:105) 
at org.eclipse.test.EclipseTestRunner.run(EclipseTestRunner.java:354) 
at org.eclipse.test.EclipseTestRunner.run(EclipseTestRunner.java:206) 
at org.eclipse.test.CoreTestApplication.runTests(CoreTestApplication.java:35) 
at org.eclipse.test.CoreTestApplication.run(CoreTestApplication.java:31) 
at org.eclipse.equinox.internal.app.EclipseAppContainer.callMethodWithException(EclipseAppContainer.java:574) 
at org.eclipse.equinox.internal.app.EclipseAppHandle.run(EclipseAppHandle.java:195) 
at org.eclipse.core.runtime.internal.adaptor.EclipseAppLauncher.runApplication(EclipseAppLauncher.java:110) 
at org.eclipse.core.runtime.internal.adaptor.EclipseAppLauncher.start(EclipseAppLauncher.java:79) 
at org.eclipse.core.runtime.adaptor.EclipseStarter.run(EclipseStarter.java:382) 
at org.eclipse.core.runtime.adaptor.EclipseStarter.run(EclipseStarter.java:179) 
at org.eclipse.equinox.launcher.Main.invokeFramework(Main.java:549) 
at org.eclipse.equinox.launcher.Main.basicRun(Main.java:504) 
at org.eclipse.equinox.launcher.Main.run(Main.java:1236) 
at org.eclipse.equinox.launcher.Main.main(Main.java:1212)
Test:  testSetBindParameters
Class:  JptEclipseLinkCoreTests
java.lang.RuntimeException: missing Java system property: "org.eclipse.jpt.jpa.jar" 
at org.eclipse.jpt.core.tests.internal.projects.TestJpaProject.jarName(TestJpaProject.java:65) 
at org.eclipse.jpt.core.tests.internal.projects.TestJpaProject.<init>(TestJpaProject.java:57) 
at org.eclipse.jpt.core.tests.internal.projects.TestJpaProject.buildJpaProject(TestJpaProject.java:35) 
at org.eclipse.jpt.core.tests.internal.context.ContextModelTestCase.buildJpaProject(ContextModelTestCase.java:90) 
at org.eclipse.jpt.core.tests.internal.context.ContextModelTestCase.buildJavaProject(ContextModelTestCase.java:85) 
at org.eclipse.jpt.core.tests.internal.utility.jdt.AnnotationTestCase.setUp(AnnotationTestCase.java:76) 
at org.eclipse.jpt.core.tests.internal.context.ContextModelTestCase.setUp(ContextModelTestCase.java:57) 
at org.eclipse.jpt.eclipselink.core.tests.internal.PersistenceUnitTestCase.setUp(PersistenceUnitTestCase.java:54) 
at org.eclipse.jpt.eclipselink.core.tests.internal.connection.ConnectionAdapterTests.setUp(ConnectionAdapterTests.java:105) 
at org.eclipse.test.EclipseTestRunner.run(EclipseTestRunner.java:354) 
at org.eclipse.test.EclipseTestRunner.run(EclipseTestRunner.java:206) 
at org.eclipse.test.CoreTestApplication.runTests(CoreTestApplication.java:35) 
at org.eclipse.test.CoreTestApplication.run(CoreTestApplication.java:31) 
at org.eclipse.equinox.internal.app.EclipseAppContainer.callMethodWithException(EclipseAppContainer.java:574) 
at org.eclipse.equinox.internal.app.EclipseAppHandle.run(EclipseAppHandle.java:195) 
at org.eclipse.core.runtime.internal.adaptor.EclipseAppLauncher.runApplication(EclipseAppLauncher.java:110) 
at org.eclipse.core.runtime.internal.adaptor.EclipseAppLauncher.start(EclipseAppLauncher.java:79) 
at org.eclipse.core.runtime.adaptor.EclipseStarter.run(EclipseStarter.java:382) 
at org.eclipse.core.runtime.adaptor.EclipseStarter.run(EclipseStarter.java:179) 
at org.eclipse.equinox.launcher.Main.invokeFramework(Main.java:549) 
at org.eclipse.equinox.launcher.Main.basicRun(Main.java:504) 
at org.eclipse.equinox.launcher.Main.run(Main.java:1236) 
at org.eclipse.equinox.launcher.Main.main(Main.java:1212)
Test:  testAddRemoveBindParameters
Class:  JptEclipseLinkCoreTests
java.lang.RuntimeException: missing Java system property: "org.eclipse.jpt.jpa.jar" 
at org.eclipse.jpt.core.tests.internal.projects.TestJpaProject.jarName(TestJpaProject.java:65) 
at org.eclipse.jpt.core.tests.internal.projects.TestJpaProject.<init>(TestJpaProject.java:57) 
at org.eclipse.jpt.core.tests.internal.projects.TestJpaProject.buildJpaProject(TestJpaProject.java:35) 
at org.eclipse.jpt.core.tests.internal.context.ContextModelTestCase.buildJpaProject(ContextModelTestCase.java:90) 
at org.eclipse.jpt.core.tests.internal.context.ContextModelTestCase.buildJavaProject(ContextModelTestCase.java:85) 
at org.eclipse.jpt.core.tests.internal.utility.jdt.AnnotationTestCase.setUp(AnnotationTestCase.java:76) 
at org.eclipse.jpt.core.tests.internal.context.ContextModelTestCase.setUp(ContextModelTestCase.java:57) 
at org.eclipse.jpt.eclipselink.core.tests.internal.PersistenceUnitTestCase.setUp(PersistenceUnitTestCase.java:54) 
at org.eclipse.jpt.eclipselink.core.tests.internal.connection.ConnectionAdapterTests.setUp(ConnectionAdapterTests.java:105) 
at org.eclipse.test.EclipseTestRunner.run(EclipseTestRunner.java:354) 
at org.eclipse.test.EclipseTestRunner.run(EclipseTestRunner.java:206) 
at org.eclipse.test.CoreTestApplication.runTests(CoreTestApplication.java:35) 
at org.eclipse.test.CoreTestApplication.run(CoreTestApplication.java:31) 
at org.eclipse.equinox.internal.app.EclipseAppContainer.callMethodWithException(EclipseAppContainer.java:574) 
at org.eclipse.equinox.internal.app.EclipseAppHandle.run(EclipseAppHandle.java:195) 
at org.eclipse.core.runtime.internal.adaptor.EclipseAppLauncher.runApplication(EclipseAppLauncher.java:110) 
at org.eclipse.core.runtime.internal.adaptor.EclipseAppLauncher.start(EclipseAppLauncher.java:79) 
at org.eclipse.core.runtime.adaptor.EclipseStarter.run(EclipseStarter.java:382) 
at org.eclipse.core.runtime.adaptor.EclipseStarter.run(EclipseStarter.java:179) 
at org.eclipse.equinox.launcher.Main.invokeFramework(Main.java:549) 
at org.eclipse.equinox.launcher.Main.basicRun(Main.java:504) 
at org.eclipse.equinox.launcher.Main.run(Main.java:1236) 
at org.eclipse.equinox.launcher.Main.main(Main.java:1212)
Test:  testSetReadConnectionsShared
Class:  JptEclipseLinkCoreTests
java.lang.RuntimeException: missing Java system property: "org.eclipse.jpt.jpa.jar" 
at org.eclipse.jpt.core.tests.internal.projects.TestJpaProject.jarName(TestJpaProject.java:65) 
at org.eclipse.jpt.core.tests.internal.projects.TestJpaProject.<init>(TestJpaProject.java:57) 
at org.eclipse.jpt.core.tests.internal.projects.TestJpaProject.buildJpaProject(TestJpaProject.java:35) 
at org.eclipse.jpt.core.tests.internal.context.ContextModelTestCase.buildJpaProject(ContextModelTestCase.java:90) 
at org.eclipse.jpt.core.tests.internal.context.ContextModelTestCase.buildJavaProject(ContextModelTestCase.java:85) 
at org.eclipse.jpt.core.tests.internal.utility.jdt.AnnotationTestCase.setUp(AnnotationTestCase.java:76) 
at org.eclipse.jpt.core.tests.internal.context.ContextModelTestCase.setUp(ContextModelTestCase.java:57) 
at org.eclipse.jpt.eclipselink.core.tests.internal.PersistenceUnitTestCase.setUp(PersistenceUnitTestCase.java:54) 
at org.eclipse.jpt.eclipselink.core.tests.internal.connection.ConnectionAdapterTests.setUp(ConnectionAdapterTests.java:105) 
at org.eclipse.test.EclipseTestRunner.run(EclipseTestRunner.java:354) 
at org.eclipse.test.EclipseTestRunner.run(EclipseTestRunner.java:206) 
at org.eclipse.test.CoreTestApplication.runTests(CoreTestApplication.java:35) 
at org.eclipse.test.CoreTestApplication.run(CoreTestApplication.java:31) 
at org.eclipse.equinox.internal.app.EclipseAppContainer.callMethodWithException(EclipseAppContainer.java:574) 
at org.eclipse.equinox.internal.app.EclipseAppHandle.run(EclipseAppHandle.java:195) 
at org.eclipse.core.runtime.internal.adaptor.EclipseAppLauncher.runApplication(EclipseAppLauncher.java:110) 
at org.eclipse.core.runtime.internal.adaptor.EclipseAppLauncher.start(EclipseAppLauncher.java:79) 
at org.eclipse.core.runtime.adaptor.EclipseStarter.run(EclipseStarter.java:382) 
at org.eclipse.core.runtime.adaptor.EclipseStarter.run(EclipseStarter.java:179) 
at org.eclipse.equinox.launcher.Main.invokeFramework(Main.java:549) 
at org.eclipse.equinox.launcher.Main.basicRun(Main.java:504) 
at org.eclipse.equinox.launcher.Main.run(Main.java:1236) 
at org.eclipse.equinox.launcher.Main.main(Main.java:1212)
Test:  testAddRemoveReadConnectionsShared
Class:  JptEclipseLinkCoreTests
java.lang.RuntimeException: missing Java system property: "org.eclipse.jpt.jpa.jar" 
at org.eclipse.jpt.core.tests.internal.projects.TestJpaProject.jarName(TestJpaProject.java:65) 
at org.eclipse.jpt.core.tests.internal.projects.TestJpaProject.<init>(TestJpaProject.java:57) 
at org.eclipse.jpt.core.tests.internal.projects.TestJpaProject.buildJpaProject(TestJpaProject.java:35) 
at org.eclipse.jpt.core.tests.internal.context.ContextModelTestCase.buildJpaProject(ContextModelTestCase.java:90) 
at org.eclipse.jpt.core.tests.internal.context.ContextModelTestCase.buildJavaProject(ContextModelTestCase.java:85) 
at org.eclipse.jpt.core.tests.internal.utility.jdt.AnnotationTestCase.setUp(AnnotationTestCase.java:76) 
at org.eclipse.jpt.core.tests.internal.context.ContextModelTestCase.setUp(ContextModelTestCase.java:57) 
at org.eclipse.jpt.eclipselink.core.tests.internal.PersistenceUnitTestCase.setUp(PersistenceUnitTestCase.java:54) 
at org.eclipse.jpt.eclipselink.core.tests.internal.connection.ConnectionAdapterTests.setUp(ConnectionAdapterTests.java:105) 
at org.eclipse.test.EclipseTestRunner.run(EclipseTestRunner.java:354) 
at org.eclipse.test.EclipseTestRunner.run(EclipseTestRunner.java:206) 
at org.eclipse.test.CoreTestApplication.runTests(CoreTestApplication.java:35) 
at org.eclipse.test.CoreTestApplication.run(CoreTestApplication.java:31) 
at org.eclipse.equinox.internal.app.EclipseAppContainer.callMethodWithException(EclipseAppContainer.java:574) 
at org.eclipse.equinox.internal.app.EclipseAppHandle.run(EclipseAppHandle.java:195) 
at org.eclipse.core.runtime.internal.adaptor.EclipseAppLauncher.runApplication(EclipseAppLauncher.java:110) 
at org.eclipse.core.runtime.internal.adaptor.EclipseAppLauncher.start(EclipseAppLauncher.java:79) 
at org.eclipse.core.runtime.adaptor.EclipseStarter.run(EclipseStarter.java:382) 
at org.eclipse.core.runtime.adaptor.EclipseStarter.run(EclipseStarter.java:179) 
at org.eclipse.equinox.launcher.Main.invokeFramework(Main.java:549) 
at org.eclipse.equinox.launcher.Main.basicRun(Main.java:504) 
at org.eclipse.equinox.launcher.Main.run(Main.java:1236) 
at org.eclipse.equinox.launcher.Main.main(Main.java:1212)
Test:  testSetReadConnectionsMin
Class:  JptEclipseLinkCoreTests
java.lang.RuntimeException: missing Java system property: "org.eclipse.jpt.jpa.jar" 
at org.eclipse.jpt.core.tests.internal.projects.TestJpaProject.jarName(TestJpaProject.java:65) 
at org.eclipse.jpt.core.tests.internal.projects.TestJpaProject.<init>(TestJpaProject.java:57) 
at org.eclipse.jpt.core.tests.internal.projects.TestJpaProject.buildJpaProject(TestJpaProject.java:35) 
at org.eclipse.jpt.core.tests.internal.context.ContextModelTestCase.buildJpaProject(ContextModelTestCase.java:90) 
at org.eclipse.jpt.core.tests.internal.context.ContextModelTestCase.buildJavaProject(ContextModelTestCase.java:85) 
at org.eclipse.jpt.core.tests.internal.utility.jdt.AnnotationTestCase.setUp(AnnotationTestCase.java:76) 
at org.eclipse.jpt.core.tests.internal.context.ContextModelTestCase.setUp(ContextModelTestCase.java:57) 
at org.eclipse.jpt.eclipselink.core.tests.internal.PersistenceUnitTestCase.setUp(PersistenceUnitTestCase.java:54) 
at org.eclipse.jpt.eclipselink.core.tests.internal.connection.ConnectionAdapterTests.setUp(ConnectionAdapterTests.java:105) 
at org.eclipse.test.EclipseTestRunner.run(EclipseTestRunner.java:354) 
at org.eclipse.test.EclipseTestRunner.run(EclipseTestRunner.java:206) 
at org.eclipse.test.CoreTestApplication.runTests(CoreTestApplication.java:35) 
at org.eclipse.test.CoreTestApplication.run(CoreTestApplication.java:31) 
at org.eclipse.equinox.internal.app.EclipseAppContainer.callMethodWithException(EclipseAppContainer.java:574) 
at org.eclipse.equinox.internal.app.EclipseAppHandle.run(EclipseAppHandle.java:195) 
at org.eclipse.core.runtime.internal.adaptor.EclipseAppLauncher.runApplication(EclipseAppLauncher.java:110) 
at org.eclipse.core.runtime.internal.adaptor.EclipseAppLauncher.start(EclipseAppLauncher.java:79) 
at org.eclipse.core.runtime.adaptor.EclipseStarter.run(EclipseStarter.java:382) 
at org.eclipse.core.runtime.adaptor.EclipseStarter.run(EclipseStarter.java:179) 
at org.eclipse.equinox.launcher.Main.invokeFramework(Main.java:549) 
at org.eclipse.equinox.launcher.Main.basicRun(Main.java:504) 
at org.eclipse.equinox.launcher.Main.run(Main.java:1236) 
at org.eclipse.equinox.launcher.Main.main(Main.java:1212)
Test:  testAddRemoveReadConnectionsMin
Class:  JptEclipseLinkCoreTests
java.lang.RuntimeException: missing Java system property: "org.eclipse.jpt.jpa.jar" 
at org.eclipse.jpt.core.tests.internal.projects.TestJpaProject.jarName(TestJpaProject.java:65) 
at org.eclipse.jpt.core.tests.internal.projects.TestJpaProject.<init>(TestJpaProject.java:57) 
at org.eclipse.jpt.core.tests.internal.projects.TestJpaProject.buildJpaProject(TestJpaProject.java:35) 
at org.eclipse.jpt.core.tests.internal.context.ContextModelTestCase.buildJpaProject(ContextModelTestCase.java:90) 
at org.eclipse.jpt.core.tests.internal.context.ContextModelTestCase.buildJavaProject(ContextModelTestCase.java:85) 
at org.eclipse.jpt.core.tests.internal.utility.jdt.AnnotationTestCase.setUp(AnnotationTestCase.java:76) 
at org.eclipse.jpt.core.tests.internal.context.ContextModelTestCase.setUp(ContextModelTestCase.java:57) 
at org.eclipse.jpt.eclipselink.core.tests.internal.PersistenceUnitTestCase.setUp(PersistenceUnitTestCase.java:54) 
at org.eclipse.jpt.eclipselink.core.tests.internal.connection.ConnectionAdapterTests.setUp(ConnectionAdapterTests.java:105) 
at org.eclipse.test.EclipseTestRunner.run(EclipseTestRunner.java:354) 
at org.eclipse.test.EclipseTestRunner.run(EclipseTestRunner.java:206) 
at org.eclipse.test.CoreTestApplication.runTests(CoreTestApplication.java:35) 
at org.eclipse.test.CoreTestApplication.run(CoreTestApplication.java:31) 
at org.eclipse.equinox.internal.app.EclipseAppContainer.callMethodWithException(EclipseAppContainer.java:574) 
at org.eclipse.equinox.internal.app.EclipseAppHandle.run(EclipseAppHandle.java:195) 
at org.eclipse.core.runtime.internal.adaptor.EclipseAppLauncher.runApplication(EclipseAppLauncher.java:110) 
at org.eclipse.core.runtime.internal.adaptor.EclipseAppLauncher.start(EclipseAppLauncher.java:79) 
at org.eclipse.core.runtime.adaptor.EclipseStarter.run(EclipseStarter.java:382) 
at org.eclipse.core.runtime.adaptor.EclipseStarter.run(EclipseStarter.java:179) 
at org.eclipse.equinox.launcher.Main.invokeFramework(Main.java:549) 
at org.eclipse.equinox.launcher.Main.basicRun(Main.java:504) 
at org.eclipse.equinox.launcher.Main.run(Main.java:1236) 
at org.eclipse.equinox.launcher.Main.main(Main.java:1212)
Test:  testSetReadConnectionsMax
Class:  JptEclipseLinkCoreTests
java.lang.RuntimeException: missing Java system property: "org.eclipse.jpt.jpa.jar" 
at org.eclipse.jpt.core.tests.internal.projects.TestJpaProject.jarName(TestJpaProject.java:65) 
at org.eclipse.jpt.core.tests.internal.projects.TestJpaProject.<init>(TestJpaProject.java:57) 
at org.eclipse.jpt.core.tests.internal.projects.TestJpaProject.buildJpaProject(TestJpaProject.java:35) 
at org.eclipse.jpt.core.tests.internal.context.ContextModelTestCase.buildJpaProject(ContextModelTestCase.java:90) 
at org.eclipse.jpt.core.tests.internal.context.ContextModelTestCase.buildJavaProject(ContextModelTestCase.java:85) 
at org.eclipse.jpt.core.tests.internal.utility.jdt.AnnotationTestCase.setUp(AnnotationTestCase.java:76) 
at org.eclipse.jpt.core.tests.internal.context.ContextModelTestCase.setUp(ContextModelTestCase.java:57) 
at org.eclipse.jpt.eclipselink.core.tests.internal.PersistenceUnitTestCase.setUp(PersistenceUnitTestCase.java:54) 
at org.eclipse.jpt.eclipselink.core.tests.internal.connection.ConnectionAdapterTests.setUp(ConnectionAdapterTests.java:105) 
at org.eclipse.test.EclipseTestRunner.run(EclipseTestRunner.java:354) 
at org.eclipse.test.EclipseTestRunner.run(EclipseTestRunner.java:206) 
at org.eclipse.test.CoreTestApplication.runTests(CoreTestApplication.java:35) 
at org.eclipse.test.CoreTestApplication.run(CoreTestApplication.java:31) 
at org.eclipse.equinox.internal.app.EclipseAppContainer.callMethodWithException(EclipseAppContainer.java:574) 
at org.eclipse.equinox.internal.app.EclipseAppHandle.run(EclipseAppHandle.java:195) 
at org.eclipse.core.runtime.internal.adaptor.EclipseAppLauncher.runApplication(EclipseAppLauncher.java:110) 
at org.eclipse.core.runtime.internal.adaptor.EclipseAppLauncher.start(EclipseAppLauncher.java:79) 
at org.eclipse.core.runtime.adaptor.EclipseStarter.run(EclipseStarter.java:382) 
at org.eclipse.core.runtime.adaptor.EclipseStarter.run(EclipseStarter.java:179) 
at org.eclipse.equinox.launcher.Main.invokeFramework(Main.java:549) 
at org.eclipse.equinox.launcher.Main.basicRun(Main.java:504) 
at org.eclipse.equinox.launcher.Main.run(Main.java:1236) 
at org.eclipse.equinox.launcher.Main.main(Main.java:1212)
Test:  testAddRemoveReadConnectionsMax
Class:  JptEclipseLinkCoreTests
java.lang.RuntimeException: missing Java system property: "org.eclipse.jpt.jpa.jar" 
at org.eclipse.jpt.core.tests.internal.projects.TestJpaProject.jarName(TestJpaProject.java:65) 
at org.eclipse.jpt.core.tests.internal.projects.TestJpaProject.<init>(TestJpaProject.java:57) 
at org.eclipse.jpt.core.tests.internal.projects.TestJpaProject.buildJpaProject(TestJpaProject.java:35) 
at org.eclipse.jpt.core.tests.internal.context.ContextModelTestCase.buildJpaProject(ContextModelTestCase.java:90) 
at org.eclipse.jpt.core.tests.internal.context.ContextModelTestCase.buildJavaProject(ContextModelTestCase.java:85) 
at org.eclipse.jpt.core.tests.internal.utility.jdt.AnnotationTestCase.setUp(AnnotationTestCase.java:76) 
at org.eclipse.jpt.core.tests.internal.context.ContextModelTestCase.setUp(ContextModelTestCase.java:57) 
at org.eclipse.jpt.eclipselink.core.tests.internal.PersistenceUnitTestCase.setUp(PersistenceUnitTestCase.java:54) 
at org.eclipse.jpt.eclipselink.core.tests.internal.connection.ConnectionAdapterTests.setUp(ConnectionAdapterTests.java:105) 
at org.eclipse.test.EclipseTestRunner.run(EclipseTestRunner.java:354) 
at org.eclipse.test.EclipseTestRunner.run(EclipseTestRunner.java:206) 
at org.eclipse.test.CoreTestApplication.runTests(CoreTestApplication.java:35) 
at org.eclipse.test.CoreTestApplication.run(CoreTestApplication.java:31) 
at org.eclipse.equinox.internal.app.EclipseAppContainer.callMethodWithException(EclipseAppContainer.java:574) 
at org.eclipse.equinox.internal.app.EclipseAppHandle.run(EclipseAppHandle.java:195) 
at org.eclipse.core.runtime.internal.adaptor.EclipseAppLauncher.runApplication(EclipseAppLauncher.java:110) 
at org.eclipse.core.runtime.internal.adaptor.EclipseAppLauncher.start(EclipseAppLauncher.java:79) 
at org.eclipse.core.runtime.adaptor.EclipseStarter.run(EclipseStarter.java:382) 
at org.eclipse.core.runtime.adaptor.EclipseStarter.run(EclipseStarter.java:179) 
at org.eclipse.equinox.launcher.Main.invokeFramework(Main.java:549) 
at org.eclipse.equinox.launcher.Main.basicRun(Main.java:504) 
at org.eclipse.equinox.launcher.Main.run(Main.java:1236) 
at org.eclipse.equinox.launcher.Main.main(Main.java:1212)
Test:  testSetWriteConnectionsMin
Class:  JptEclipseLinkCoreTests
java.lang.RuntimeException: missing Java system property: "org.eclipse.jpt.jpa.jar" 
at org.eclipse.jpt.core.tests.internal.projects.TestJpaProject.jarName(TestJpaProject.java:65) 
at org.eclipse.jpt.core.tests.internal.projects.TestJpaProject.<init>(TestJpaProject.java:57) 
at org.eclipse.jpt.core.tests.internal.projects.TestJpaProject.buildJpaProject(TestJpaProject.java:35) 
at org.eclipse.jpt.core.tests.internal.context.ContextModelTestCase.buildJpaProject(ContextModelTestCase.java:90) 
at org.eclipse.jpt.core.tests.internal.context.ContextModelTestCase.buildJavaProject(ContextModelTestCase.java:85) 
at org.eclipse.jpt.core.tests.internal.utility.jdt.AnnotationTestCase.setUp(AnnotationTestCase.java:76) 
at org.eclipse.jpt.core.tests.internal.context.ContextModelTestCase.setUp(ContextModelTestCase.java:57) 
at org.eclipse.jpt.eclipselink.core.tests.internal.PersistenceUnitTestCase.setUp(PersistenceUnitTestCase.java:54) 
at org.eclipse.jpt.eclipselink.core.tests.internal.connection.ConnectionAdapterTests.setUp(ConnectionAdapterTests.java:105) 
at org.eclipse.test.EclipseTestRunner.run(EclipseTestRunner.java:354) 
at org.eclipse.test.EclipseTestRunner.run(EclipseTestRunner.java:206) 
at org.eclipse.test.CoreTestApplication.runTests(CoreTestApplication.java:35) 
at org.eclipse.test.CoreTestApplication.run(CoreTestApplication.java:31) 
at org.eclipse.equinox.internal.app.EclipseAppContainer.callMethodWithException(EclipseAppContainer.java:574) 
at org.eclipse.equinox.internal.app.EclipseAppHandle.run(EclipseAppHandle.java:195) 
at org.eclipse.core.runtime.internal.adaptor.EclipseAppLauncher.runApplication(EclipseAppLauncher.java:110) 
at org.eclipse.core.runtime.internal.adaptor.EclipseAppLauncher.start(EclipseAppLauncher.java:79) 
at org.eclipse.core.runtime.adaptor.EclipseStarter.run(EclipseStarter.java:382) 
at org.eclipse.core.runtime.adaptor.EclipseStarter.run(EclipseStarter.java:179) 
at org.eclipse.equinox.launcher.Main.invokeFramework(Main.java:549) 
at org.eclipse.equinox.launcher.Main.basicRun(Main.java:504) 
at org.eclipse.equinox.launcher.Main.run(Main.java:1236) 
at org.eclipse.equinox.launcher.Main.main(Main.java:1212)
Test:  testAddRemoveWriteConnectionsMin
Class:  JptEclipseLinkCoreTests
java.lang.RuntimeException: missing Java system property: "org.eclipse.jpt.jpa.jar" 
at org.eclipse.jpt.core.tests.internal.projects.TestJpaProject.jarName(TestJpaProject.java:65) 
at org.eclipse.jpt.core.tests.internal.projects.TestJpaProject.<init>(TestJpaProject.java:57) 
at org.eclipse.jpt.core.tests.internal.projects.TestJpaProject.buildJpaProject(TestJpaProject.java:35) 
at org.eclipse.jpt.core.tests.internal.context.ContextModelTestCase.buildJpaProject(ContextModelTestCase.java:90) 
at org.eclipse.jpt.core.tests.internal.context.ContextModelTestCase.buildJavaProject(ContextModelTestCase.java:85) 
at org.eclipse.jpt.core.tests.internal.utility.jdt.AnnotationTestCase.setUp(AnnotationTestCase.java:76) 
at org.eclipse.jpt.core.tests.internal.context.ContextModelTestCase.setUp(ContextModelTestCase.java:57) 
at org.eclipse.jpt.eclipselink.core.tests.internal.PersistenceUnitTestCase.setUp(PersistenceUnitTestCase.java:54) 
at org.eclipse.jpt.eclipselink.core.tests.internal.connection.ConnectionAdapterTests.setUp(ConnectionAdapterTests.java:105) 
at org.eclipse.test.EclipseTestRunner.run(EclipseTestRunner.java:354) 
at org.eclipse.test.EclipseTestRunner.run(EclipseTestRunner.java:206) 
at org.eclipse.test.CoreTestApplication.runTests(CoreTestApplication.java:35) 
at org.eclipse.test.CoreTestApplication.run(CoreTestApplication.java:31) 
at org.eclipse.equinox.internal.app.EclipseAppContainer.callMethodWithException(EclipseAppContainer.java:574) 
at org.eclipse.equinox.internal.app.EclipseAppHandle.run(EclipseAppHandle.java:195) 
at org.eclipse.core.runtime.internal.adaptor.EclipseAppLauncher.runApplication(EclipseAppLauncher.java:110) 
at org.eclipse.core.runtime.internal.adaptor.EclipseAppLauncher.start(EclipseAppLauncher.java:79) 
at org.eclipse.core.runtime.adaptor.EclipseStarter.run(EclipseStarter.java:382) 
at org.eclipse.core.runtime.adaptor.EclipseStarter.run(EclipseStarter.java:179) 
at org.eclipse.equinox.launcher.Main.invokeFramework(Main.java:549) 
at org.eclipse.equinox.launcher.Main.basicRun(Main.java:504) 
at org.eclipse.equinox.launcher.Main.run(Main.java:1236) 
at org.eclipse.equinox.launcher.Main.main(Main.java:1212)
Test:  testSetWriteConnectionsMax
Class:  JptEclipseLinkCoreTests
java.lang.RuntimeException: missing Java system property: "org.eclipse.jpt.jpa.jar" 
at org.eclipse.jpt.core.tests.internal.projects.TestJpaProject.jarName(TestJpaProject.java:65) 
at org.eclipse.jpt.core.tests.internal.projects.TestJpaProject.<init>(TestJpaProject.java:57) 
at org.eclipse.jpt.core.tests.internal.projects.TestJpaProject.buildJpaProject(TestJpaProject.java:35) 
at org.eclipse.jpt.core.tests.internal.context.ContextModelTestCase.buildJpaProject(ContextModelTestCase.java:90) 
at org.eclipse.jpt.core.tests.internal.context.ContextModelTestCase.buildJavaProject(ContextModelTestCase.java:85) 
at org.eclipse.jpt.core.tests.internal.utility.jdt.AnnotationTestCase.setUp(AnnotationTestCase.java:76) 
at org.eclipse.jpt.core.tests.internal.context.ContextModelTestCase.setUp(ContextModelTestCase.java:57) 
at org.eclipse.jpt.eclipselink.core.tests.internal.PersistenceUnitTestCase.setUp(PersistenceUnitTestCase.java:54) 
at org.eclipse.jpt.eclipselink.core.tests.internal.connection.ConnectionAdapterTests.setUp(ConnectionAdapterTests.java:105) 
at org.eclipse.test.EclipseTestRunner.run(EclipseTestRunner.java:354) 
at org.eclipse.test.EclipseTestRunner.run(EclipseTestRunner.java:206) 
at org.eclipse.test.CoreTestApplication.runTests(CoreTestApplication.java:35) 
at org.eclipse.test.CoreTestApplication.run(CoreTestApplication.java:31) 
at org.eclipse.equinox.internal.app.EclipseAppContainer.callMethodWithException(EclipseAppContainer.java:574) 
at org.eclipse.equinox.internal.app.EclipseAppHandle.run(EclipseAppHandle.java:195) 
at org.eclipse.core.runtime.internal.adaptor.EclipseAppLauncher.runApplication(EclipseAppLauncher.java:110) 
at org.eclipse.core.runtime.internal.adaptor.EclipseAppLauncher.start(EclipseAppLauncher.java:79) 
at org.eclipse.core.runtime.adaptor.EclipseStarter.run(EclipseStarter.java:382) 
at org.eclipse.core.runtime.adaptor.EclipseStarter.run(EclipseStarter.java:179) 
at org.eclipse.equinox.launcher.Main.invokeFramework(Main.java:549) 
at org.eclipse.equinox.launcher.Main.basicRun(Main.java:504) 
at org.eclipse.equinox.launcher.Main.run(Main.java:1236) 
at org.eclipse.equinox.launcher.Main.main(Main.java:1212)
Test:  testAddRemoveWriteConnectionsMax
Class:  JptEclipseLinkCoreTests
java.lang.RuntimeException: missing Java system property: "org.eclipse.jpt.jpa.jar" 
at org.eclipse.jpt.core.tests.internal.projects.TestJpaProject.jarName(TestJpaProject.java:65) 
at org.eclipse.jpt.core.tests.internal.projects.TestJpaProject.<init>(TestJpaProject.java:57) 
at org.eclipse.jpt.core.tests.internal.projects.TestJpaProject.buildJpaProject(TestJpaProject.java:35) 
at org.eclipse.jpt.core.tests.internal.context.ContextModelTestCase.buildJpaProject(ContextModelTestCase.java:90) 
at org.eclipse.jpt.core.tests.internal.context.ContextModelTestCase.buildJavaProject(ContextModelTestCase.java:85) 
at org.eclipse.jpt.core.tests.internal.utility.jdt.AnnotationTestCase.setUp(AnnotationTestCase.java:76) 
at org.eclipse.jpt.core.tests.internal.context.ContextModelTestCase.setUp(ContextModelTestCase.java:57) 
at org.eclipse.jpt.eclipselink.core.tests.internal.PersistenceUnitTestCase.setUp(PersistenceUnitTestCase.java:54) 
at org.eclipse.jpt.eclipselink.core.tests.internal.connection.ConnectionAdapterTests.setUp(ConnectionAdapterTests.java:105) 
at org.eclipse.test.EclipseTestRunner.run(EclipseTestRunner.java:354) 
at org.eclipse.test.EclipseTestRunner.run(EclipseTestRunner.java:206) 
at org.eclipse.test.CoreTestApplication.runTests(CoreTestApplication.java:35) 
at org.eclipse.test.CoreTestApplication.run(CoreTestApplication.java:31) 
at org.eclipse.equinox.internal.app.EclipseAppContainer.callMethodWithException(EclipseAppContainer.java:574) 
at org.eclipse.equinox.internal.app.EclipseAppHandle.run(EclipseAppHandle.java:195) 
at org.eclipse.core.runtime.internal.adaptor.EclipseAppLauncher.runApplication(EclipseAppLauncher.java:110) 
at org.eclipse.core.runtime.internal.adaptor.EclipseAppLauncher.start(EclipseAppLauncher.java:79) 
at org.eclipse.core.runtime.adaptor.EclipseStarter.run(EclipseStarter.java:382) 
at org.eclipse.core.runtime.adaptor.EclipseStarter.run(EclipseStarter.java:179) 
at org.eclipse.equinox.launcher.Main.invokeFramework(Main.java:549) 
at org.eclipse.equinox.launcher.Main.basicRun(Main.java:504) 
at org.eclipse.equinox.launcher.Main.run(Main.java:1236) 
at org.eclipse.equinox.launcher.Main.main(Main.java:1212)
Test:  testHasListeners
Class:  JptEclipseLinkCoreTests
java.lang.RuntimeException: missing Java system property: "org.eclipse.jpt.jpa.jar" 
at org.eclipse.jpt.core.tests.internal.projects.TestJpaProject.jarName(TestJpaProject.java:65) 
at org.eclipse.jpt.core.tests.internal.projects.TestJpaProject.<init>(TestJpaProject.java:57) 
at org.eclipse.jpt.core.tests.internal.projects.TestJpaProject.buildJpaProject(TestJpaProject.java:35) 
at org.eclipse.jpt.core.tests.internal.context.ContextModelTestCase.buildJpaProject(ContextModelTestCase.java:90) 
at org.eclipse.jpt.core.tests.internal.context.ContextModelTestCase.buildJavaProject(ContextModelTestCase.java:85) 
at org.eclipse.jpt.core.tests.internal.utility.jdt.AnnotationTestCase.setUp(AnnotationTestCase.java:76) 
at org.eclipse.jpt.core.tests.internal.context.ContextModelTestCase.setUp(ContextModelTestCase.java:57) 
at org.eclipse.jpt.eclipselink.core.tests.internal.PersistenceUnitTestCase.setUp(PersistenceUnitTestCase.java:54) 
at org.eclipse.jpt.eclipselink.core.tests.internal.options.OptionsValueModelTests.setUp(OptionsValueModelTests.java:42) 
at org.eclipse.test.EclipseTestRunner.run(EclipseTestRunner.java:354) 
at org.eclipse.test.EclipseTestRunner.run(EclipseTestRunner.java:206) 
at org.eclipse.test.CoreTestApplication.runTests(CoreTestApplication.java:35) 
at org.eclipse.test.CoreTestApplication.run(CoreTestApplication.java:31) 
at org.eclipse.equinox.internal.app.EclipseAppContainer.callMethodWithException(EclipseAppContainer.java:574) 
at org.eclipse.equinox.internal.app.EclipseAppHandle.run(EclipseAppHandle.java:195) 
at org.eclipse.core.runtime.internal.adaptor.EclipseAppLauncher.runApplication(EclipseAppLauncher.java:110) 
at org.eclipse.core.runtime.internal.adaptor.EclipseAppLauncher.start(EclipseAppLauncher.java:79) 
at org.eclipse.core.runtime.adaptor.EclipseStarter.run(EclipseStarter.java:382) 
at org.eclipse.core.runtime.adaptor.EclipseStarter.run(EclipseStarter.java:179) 
at org.eclipse.equinox.launcher.Main.invokeFramework(Main.java:549) 
at org.eclipse.equinox.launcher.Main.basicRun(Main.java:504) 
at org.eclipse.equinox.launcher.Main.run(Main.java:1236) 
at org.eclipse.equinox.launcher.Main.main(Main.java:1212)
Test:  testValue
Class:  JptEclipseLinkCoreTests
java.lang.RuntimeException: missing Java system property: "org.eclipse.jpt.jpa.jar" 
at org.eclipse.jpt.core.tests.internal.projects.TestJpaProject.jarName(TestJpaProject.java:65) 
at org.eclipse.jpt.core.tests.internal.projects.TestJpaProject.<init>(TestJpaProject.java:57) 
at org.eclipse.jpt.core.tests.internal.projects.TestJpaProject.buildJpaProject(TestJpaProject.java:35) 
at org.eclipse.jpt.core.tests.internal.context.ContextModelTestCase.buildJpaProject(ContextModelTestCase.java:90) 
at org.eclipse.jpt.core.tests.internal.context.ContextModelTestCase.buildJavaProject(ContextModelTestCase.java:85) 
at org.eclipse.jpt.core.tests.internal.utility.jdt.AnnotationTestCase.setUp(AnnotationTestCase.java:76) 
at org.eclipse.jpt.core.tests.internal.context.ContextModelTestCase.setUp(ContextModelTestCase.java:57) 
at org.eclipse.jpt.eclipselink.core.tests.internal.PersistenceUnitTestCase.setUp(PersistenceUnitTestCase.java:54) 
at org.eclipse.jpt.eclipselink.core.tests.internal.options.OptionsValueModelTests.setUp(OptionsValueModelTests.java:42) 
at org.eclipse.test.EclipseTestRunner.run(EclipseTestRunner.java:354) 
at org.eclipse.test.EclipseTestRunner.run(EclipseTestRunner.java:206) 
at org.eclipse.test.CoreTestApplication.runTests(CoreTestApplication.java:35) 
at org.eclipse.test.CoreTestApplication.run(CoreTestApplication.java:31) 
at org.eclipse.equinox.internal.app.EclipseAppContainer.callMethodWithException(EclipseAppContainer.java:574) 
at org.eclipse.equinox.internal.app.EclipseAppHandle.run(EclipseAppHandle.java:195) 
at org.eclipse.core.runtime.internal.adaptor.EclipseAppLauncher.runApplication(EclipseAppLauncher.java:110) 
at org.eclipse.core.runtime.internal.adaptor.EclipseAppLauncher.start(EclipseAppLauncher.java:79) 
at org.eclipse.core.runtime.adaptor.EclipseStarter.run(EclipseStarter.java:382) 
at org.eclipse.core.runtime.adaptor.EclipseStarter.run(EclipseStarter.java:179) 
at org.eclipse.equinox.launcher.Main.invokeFramework(Main.java:549) 
at org.eclipse.equinox.launcher.Main.basicRun(Main.java:504) 
at org.eclipse.equinox.launcher.Main.run(Main.java:1236) 
at org.eclipse.equinox.launcher.Main.main(Main.java:1212)
Test:  testSetValue
Class:  JptEclipseLinkCoreTests
java.lang.RuntimeException: missing Java system property: "org.eclipse.jpt.jpa.jar" 
at org.eclipse.jpt.core.tests.internal.projects.TestJpaProject.jarName(TestJpaProject.java:65) 
at org.eclipse.jpt.core.tests.internal.projects.TestJpaProject.<init>(TestJpaProject.java:57) 
at org.eclipse.jpt.core.tests.internal.projects.TestJpaProject.buildJpaProject(TestJpaProject.java:35) 
at org.eclipse.jpt.core.tests.internal.context.ContextModelTestCase.buildJpaProject(ContextModelTestCase.java:90) 
at org.eclipse.jpt.core.tests.internal.context.ContextModelTestCase.buildJavaProject(ContextModelTestCase.java:85) 
at org.eclipse.jpt.core.tests.internal.utility.jdt.AnnotationTestCase.setUp(AnnotationTestCase.java:76) 
at org.eclipse.jpt.core.tests.internal.context.ContextModelTestCase.setUp(ContextModelTestCase.java:57) 
at org.eclipse.jpt.eclipselink.core.tests.internal.PersistenceUnitTestCase.setUp(PersistenceUnitTestCase.java:54) 
at org.eclipse.jpt.eclipselink.core.tests.internal.options.OptionsValueModelTests.setUp(OptionsValueModelTests.java:42) 
at org.eclipse.test.EclipseTestRunner.run(EclipseTestRunner.java:354) 
at org.eclipse.test.EclipseTestRunner.run(EclipseTestRunner.java:206) 
at org.eclipse.test.CoreTestApplication.runTests(CoreTestApplication.java:35) 
at org.eclipse.test.CoreTestApplication.run(CoreTestApplication.java:31) 
at org.eclipse.equinox.internal.app.EclipseAppContainer.callMethodWithException(EclipseAppContainer.java:574) 
at org.eclipse.equinox.internal.app.EclipseAppHandle.run(EclipseAppHandle.java:195) 
at org.eclipse.core.runtime.internal.adaptor.EclipseAppLauncher.runApplication(EclipseAppLauncher.java:110) 
at org.eclipse.core.runtime.internal.adaptor.EclipseAppLauncher.start(EclipseAppLauncher.java:79) 
at org.eclipse.core.runtime.adaptor.EclipseStarter.run(EclipseStarter.java:382) 
at org.eclipse.core.runtime.adaptor.EclipseStarter.run(EclipseStarter.java:179) 
at org.eclipse.equinox.launcher.Main.invokeFramework(Main.java:549) 
at org.eclipse.equinox.launcher.Main.basicRun(Main.java:504) 
at org.eclipse.equinox.launcher.Main.run(Main.java:1236) 
at org.eclipse.equinox.launcher.Main.main(Main.java:1212)
Test:  testSetNullValue
Class:  JptEclipseLinkCoreTests
java.lang.RuntimeException: missing Java system property: "org.eclipse.jpt.jpa.jar" 
at org.eclipse.jpt.core.tests.internal.projects.TestJpaProject.jarName(TestJpaProject.java:65) 
at org.eclipse.jpt.core.tests.internal.projects.TestJpaProject.<init>(TestJpaProject.java:57) 
at org.eclipse.jpt.core.tests.internal.projects.TestJpaProject.buildJpaProject(TestJpaProject.java:35) 
at org.eclipse.jpt.core.tests.internal.context.ContextModelTestCase.buildJpaProject(ContextModelTestCase.java:90) 
at org.eclipse.jpt.core.tests.internal.context.ContextModelTestCase.buildJavaProject(ContextModelTestCase.java:85) 
at org.eclipse.jpt.core.tests.internal.utility.jdt.AnnotationTestCase.setUp(AnnotationTestCase.java:76) 
at org.eclipse.jpt.core.tests.internal.context.ContextModelTestCase.setUp(ContextModelTestCase.java:57) 
at org.eclipse.jpt.eclipselink.core.tests.internal.PersistenceUnitTestCase.setUp(PersistenceUnitTestCase.java:54) 
at org.eclipse.jpt.eclipselink.core.tests.internal.options.OptionsValueModelTests.setUp(OptionsValueModelTests.java:42) 
at org.eclipse.test.EclipseTestRunner.run(EclipseTestRunner.java:354) 
at org.eclipse.test.EclipseTestRunner.run(EclipseTestRunner.java:206) 
at org.eclipse.test.CoreTestApplication.runTests(CoreTestApplication.java:35) 
at org.eclipse.test.CoreTestApplication.run(CoreTestApplication.java:31) 
at org.eclipse.equinox.internal.app.EclipseAppContainer.callMethodWithException(EclipseAppContainer.java:574) 
at org.eclipse.equinox.internal.app.EclipseAppHandle.run(EclipseAppHandle.java:195) 
at org.eclipse.core.runtime.internal.adaptor.EclipseAppLauncher.runApplication(EclipseAppLauncher.java:110) 
at org.eclipse.core.runtime.internal.adaptor.EclipseAppLauncher.start(EclipseAppLauncher.java:79) 
at org.eclipse.core.runtime.adaptor.EclipseStarter.run(EclipseStarter.java:382) 
at org.eclipse.core.runtime.adaptor.EclipseStarter.run(EclipseStarter.java:179) 
at org.eclipse.equinox.launcher.Main.invokeFramework(Main.java:549) 
at org.eclipse.equinox.launcher.Main.basicRun(Main.java:504) 
at org.eclipse.equinox.launcher.Main.run(Main.java:1236) 
at org.eclipse.equinox.launcher.Main.main(Main.java:1212)
Test:  testHasListeners
Class:  JptEclipseLinkCoreTests
java.lang.RuntimeException: missing Java system property: "org.eclipse.jpt.jpa.jar" 
at org.eclipse.jpt.core.tests.internal.projects.TestJpaProject.jarName(TestJpaProject.java:65) 
at org.eclipse.jpt.core.tests.internal.projects.TestJpaProject.<init>(TestJpaProject.java:57) 
at org.eclipse.jpt.core.tests.internal.projects.TestJpaProject.buildJpaProject(TestJpaProject.java:35) 
at org.eclipse.jpt.core.tests.internal.context.ContextModelTestCase.buildJpaProject(ContextModelTestCase.java:90) 
at org.eclipse.jpt.core.tests.internal.context.ContextModelTestCase.buildJavaProject(ContextModelTestCase.java:85) 
at org.eclipse.jpt.core.tests.internal.utility.jdt.AnnotationTestCase.setUp(AnnotationTestCase.java:76) 
at org.eclipse.jpt.core.tests.internal.context.ContextModelTestCase.setUp(ContextModelTestCase.java:57) 
at org.eclipse.jpt.eclipselink.core.tests.internal.PersistenceUnitTestCase.setUp(PersistenceUnitTestCase.java:54) 
at org.eclipse.jpt.eclipselink.core.tests.internal.options.OptionsAdapterTests.setUp(OptionsAdapterTests.java:60) 
at org.eclipse.test.EclipseTestRunner.run(EclipseTestRunner.java:354) 
at org.eclipse.test.EclipseTestRunner.run(EclipseTestRunner.java:206) 
at org.eclipse.test.CoreTestApplication.runTests(CoreTestApplication.java:35) 
at org.eclipse.test.CoreTestApplication.run(CoreTestApplication.java:31) 
at org.eclipse.equinox.internal.app.EclipseAppContainer.callMethodWithException(EclipseAppContainer.java:574) 
at org.eclipse.equinox.internal.app.EclipseAppHandle.run(EclipseAppHandle.java:195) 
at org.eclipse.core.runtime.internal.adaptor.EclipseAppLauncher.runApplication(EclipseAppLauncher.java:110) 
at org.eclipse.core.runtime.internal.adaptor.EclipseAppLauncher.start(EclipseAppLauncher.java:79) 
at org.eclipse.core.runtime.adaptor.EclipseStarter.run(EclipseStarter.java:382) 
at org.eclipse.core.runtime.adaptor.EclipseStarter.run(EclipseStarter.java:179) 
at org.eclipse.equinox.launcher.Main.invokeFramework(Main.java:549) 
at org.eclipse.equinox.launcher.Main.basicRun(Main.java:504) 
at org.eclipse.equinox.launcher.Main.run(Main.java:1236) 
at org.eclipse.equinox.launcher.Main.main(Main.java:1212)
Test:  testSetSessionName
Class:  JptEclipseLinkCoreTests
java.lang.RuntimeException: missing Java system property: "org.eclipse.jpt.jpa.jar" 
at org.eclipse.jpt.core.tests.internal.projects.TestJpaProject.jarName(TestJpaProject.java:65) 
at org.eclipse.jpt.core.tests.internal.projects.TestJpaProject.<init>(TestJpaProject.java:57) 
at org.eclipse.jpt.core.tests.internal.projects.TestJpaProject.buildJpaProject(TestJpaProject.java:35) 
at org.eclipse.jpt.core.tests.internal.context.ContextModelTestCase.buildJpaProject(ContextModelTestCase.java:90) 
at org.eclipse.jpt.core.tests.internal.context.ContextModelTestCase.buildJavaProject(ContextModelTestCase.java:85) 
at org.eclipse.jpt.core.tests.internal.utility.jdt.AnnotationTestCase.setUp(AnnotationTestCase.java:76) 
at org.eclipse.jpt.core.tests.internal.context.ContextModelTestCase.setUp(ContextModelTestCase.java:57) 
at org.eclipse.jpt.eclipselink.core.tests.internal.PersistenceUnitTestCase.setUp(PersistenceUnitTestCase.java:54) 
at org.eclipse.jpt.eclipselink.core.tests.internal.options.OptionsAdapterTests.setUp(OptionsAdapterTests.java:60) 
at org.eclipse.test.EclipseTestRunner.run(EclipseTestRunner.java:354) 
at org.eclipse.test.EclipseTestRunner.run(EclipseTestRunner.java:206) 
at org.eclipse.test.CoreTestApplication.runTests(CoreTestApplication.java:35) 
at org.eclipse.test.CoreTestApplication.run(CoreTestApplication.java:31) 
at org.eclipse.equinox.internal.app.EclipseAppContainer.callMethodWithException(EclipseAppContainer.java:574) 
at org.eclipse.equinox.internal.app.EclipseAppHandle.run(EclipseAppHandle.java:195) 
at org.eclipse.core.runtime.internal.adaptor.EclipseAppLauncher.runApplication(EclipseAppLauncher.java:110) 
at org.eclipse.core.runtime.internal.adaptor.EclipseAppLauncher.start(EclipseAppLauncher.java:79) 
at org.eclipse.core.runtime.adaptor.EclipseStarter.run(EclipseStarter.java:382) 
at org.eclipse.core.runtime.adaptor.EclipseStarter.run(EclipseStarter.java:179) 
at org.eclipse.equinox.launcher.Main.invokeFramework(Main.java:549) 
at org.eclipse.equinox.launcher.Main.basicRun(Main.java:504) 
at org.eclipse.equinox.launcher.Main.run(Main.java:1236) 
at org.eclipse.equinox.launcher.Main.main(Main.java:1212)
Test:  testAddRemoveSessionName
Class:  JptEclipseLinkCoreTests
java.lang.RuntimeException: missing Java system property: "org.eclipse.jpt.jpa.jar" 
at org.eclipse.jpt.core.tests.internal.projects.TestJpaProject.jarName(TestJpaProject.java:65) 
at org.eclipse.jpt.core.tests.internal.projects.TestJpaProject.<init>(TestJpaProject.java:57) 
at org.eclipse.jpt.core.tests.internal.projects.TestJpaProject.buildJpaProject(TestJpaProject.java:35) 
at org.eclipse.jpt.core.tests.internal.context.ContextModelTestCase.buildJpaProject(ContextModelTestCase.java:90) 
at org.eclipse.jpt.core.tests.internal.context.ContextModelTestCase.buildJavaProject(ContextModelTestCase.java:85) 
at org.eclipse.jpt.core.tests.internal.utility.jdt.AnnotationTestCase.setUp(AnnotationTestCase.java:76) 
at org.eclipse.jpt.core.tests.internal.context.ContextModelTestCase.setUp(ContextModelTestCase.java:57) 
at org.eclipse.jpt.eclipselink.core.tests.internal.PersistenceUnitTestCase.setUp(PersistenceUnitTestCase.java:54) 
at org.eclipse.jpt.eclipselink.core.tests.internal.options.OptionsAdapterTests.setUp(OptionsAdapterTests.java:60) 
at org.eclipse.test.EclipseTestRunner.run(EclipseTestRunner.java:354) 
at org.eclipse.test.EclipseTestRunner.run(EclipseTestRunner.java:206) 
at org.eclipse.test.CoreTestApplication.runTests(CoreTestApplication.java:35) 
at org.eclipse.test.CoreTestApplication.run(CoreTestApplication.java:31) 
at org.eclipse.equinox.internal.app.EclipseAppContainer.callMethodWithException(EclipseAppContainer.java:574) 
at org.eclipse.equinox.internal.app.EclipseAppHandle.run(EclipseAppHandle.java:195) 
at org.eclipse.core.runtime.internal.adaptor.EclipseAppLauncher.runApplication(EclipseAppLauncher.java:110) 
at org.eclipse.core.runtime.internal.adaptor.EclipseAppLauncher.start(EclipseAppLauncher.java:79) 
at org.eclipse.core.runtime.adaptor.EclipseStarter.run(EclipseStarter.java:382) 
at org.eclipse.core.runtime.adaptor.EclipseStarter.run(EclipseStarter.java:179) 
at org.eclipse.equinox.launcher.Main.invokeFramework(Main.java:549) 
at org.eclipse.equinox.launcher.Main.basicRun(Main.java:504) 
at org.eclipse.equinox.launcher.Main.run(Main.java:1236) 
at org.eclipse.equinox.launcher.Main.main(Main.java:1212)
Test:  testSetSessionsXml
Class:  JptEclipseLinkCoreTests
java.lang.RuntimeException: missing Java system property: "org.eclipse.jpt.jpa.jar" 
at org.eclipse.jpt.core.tests.internal.projects.TestJpaProject.jarName(TestJpaProject.java:65) 
at org.eclipse.jpt.core.tests.internal.projects.TestJpaProject.<init>(TestJpaProject.java:57) 
at org.eclipse.jpt.core.tests.internal.projects.TestJpaProject.buildJpaProject(TestJpaProject.java:35) 
at org.eclipse.jpt.core.tests.internal.context.ContextModelTestCase.buildJpaProject(ContextModelTestCase.java:90) 
at org.eclipse.jpt.core.tests.internal.context.ContextModelTestCase.buildJavaProject(ContextModelTestCase.java:85) 
at org.eclipse.jpt.core.tests.internal.utility.jdt.AnnotationTestCase.setUp(AnnotationTestCase.java:76) 
at org.eclipse.jpt.core.tests.internal.context.ContextModelTestCase.setUp(ContextModelTestCase.java:57) 
at org.eclipse.jpt.eclipselink.core.tests.internal.PersistenceUnitTestCase.setUp(PersistenceUnitTestCase.java:54) 
at org.eclipse.jpt.eclipselink.core.tests.internal.options.OptionsAdapterTests.setUp(OptionsAdapterTests.java:60) 
at org.eclipse.test.EclipseTestRunner.run(EclipseTestRunner.java:354) 
at org.eclipse.test.EclipseTestRunner.run(EclipseTestRunner.java:206) 
at org.eclipse.test.CoreTestApplication.runTests(CoreTestApplication.java:35) 
at org.eclipse.test.CoreTestApplication.run(CoreTestApplication.java:31) 
at org.eclipse.equinox.internal.app.EclipseAppContainer.callMethodWithException(EclipseAppContainer.java:574) 
at org.eclipse.equinox.internal.app.EclipseAppHandle.run(EclipseAppHandle.java:195) 
at org.eclipse.core.runtime.internal.adaptor.EclipseAppLauncher.runApplication(EclipseAppLauncher.java:110) 
at org.eclipse.core.runtime.internal.adaptor.EclipseAppLauncher.start(EclipseAppLauncher.java:79) 
at org.eclipse.core.runtime.adaptor.EclipseStarter.run(EclipseStarter.java:382) 
at org.eclipse.core.runtime.adaptor.EclipseStarter.run(EclipseStarter.java:179) 
at org.eclipse.equinox.launcher.Main.invokeFramework(Main.java:549) 
at org.eclipse.equinox.launcher.Main.basicRun(Main.java:504) 
at org.eclipse.equinox.launcher.Main.run(Main.java:1236) 
at org.eclipse.equinox.launcher.Main.main(Main.java:1212)
Test:  testAddRemoveSessionsXml
Class:  JptEclipseLinkCoreTests
java.lang.RuntimeException: missing Java system property: "org.eclipse.jpt.jpa.jar" 
at org.eclipse.jpt.core.tests.internal.projects.TestJpaProject.jarName(TestJpaProject.java:65) 
at org.eclipse.jpt.core.tests.internal.projects.TestJpaProject.<init>(TestJpaProject.java:57) 
at org.eclipse.jpt.core.tests.internal.projects.TestJpaProject.buildJpaProject(TestJpaProject.java:35) 
at org.eclipse.jpt.core.tests.internal.context.ContextModelTestCase.buildJpaProject(ContextModelTestCase.java:90) 
at org.eclipse.jpt.core.tests.internal.context.ContextModelTestCase.buildJavaProject(ContextModelTestCase.java:85) 
at org.eclipse.jpt.core.tests.internal.utility.jdt.AnnotationTestCase.setUp(AnnotationTestCase.java:76) 
at org.eclipse.jpt.core.tests.internal.context.ContextModelTestCase.setUp(ContextModelTestCase.java:57) 
at org.eclipse.jpt.eclipselink.core.tests.internal.PersistenceUnitTestCase.setUp(PersistenceUnitTestCase.java:54) 
at org.eclipse.jpt.eclipselink.core.tests.internal.options.OptionsAdapterTests.setUp(OptionsAdapterTests.java:60) 
at org.eclipse.test.EclipseTestRunner.run(EclipseTestRunner.java:354) 
at org.eclipse.test.EclipseTestRunner.run(EclipseTestRunner.java:206) 
at org.eclipse.test.CoreTestApplication.runTests(CoreTestApplication.java:35) 
at org.eclipse.test.CoreTestApplication.run(CoreTestApplication.java:31) 
at org.eclipse.equinox.internal.app.EclipseAppContainer.callMethodWithException(EclipseAppContainer.java:574) 
at org.eclipse.equinox.internal.app.EclipseAppHandle.run(EclipseAppHandle.java:195) 
at org.eclipse.core.runtime.internal.adaptor.EclipseAppLauncher.runApplication(EclipseAppLauncher.java:110) 
at org.eclipse.core.runtime.internal.adaptor.EclipseAppLauncher.start(EclipseAppLauncher.java:79) 
at org.eclipse.core.runtime.adaptor.EclipseStarter.run(EclipseStarter.java:382) 
at org.eclipse.core.runtime.adaptor.EclipseStarter.run(EclipseStarter.java:179) 
at org.eclipse.equinox.launcher.Main.invokeFramework(Main.java:549) 
at org.eclipse.equinox.launcher.Main.basicRun(Main.java:504) 
at org.eclipse.equinox.launcher.Main.run(Main.java:1236) 
at org.eclipse.equinox.launcher.Main.main(Main.java:1212)
Test:  testSetIncludeDescriptorQueries
Class:  JptEclipseLinkCoreTests
java.lang.RuntimeException: missing Java system property: "org.eclipse.jpt.jpa.jar" 
at org.eclipse.jpt.core.tests.internal.projects.TestJpaProject.jarName(TestJpaProject.java:65) 
at org.eclipse.jpt.core.tests.internal.projects.TestJpaProject.<init>(TestJpaProject.java:57) 
at org.eclipse.jpt.core.tests.internal.projects.TestJpaProject.buildJpaProject(TestJpaProject.java:35) 
at org.eclipse.jpt.core.tests.internal.context.ContextModelTestCase.buildJpaProject(ContextModelTestCase.java:90) 
at org.eclipse.jpt.core.tests.internal.context.ContextModelTestCase.buildJavaProject(ContextModelTestCase.java:85) 
at org.eclipse.jpt.core.tests.internal.utility.jdt.AnnotationTestCase.setUp(AnnotationTestCase.java:76) 
at org.eclipse.jpt.core.tests.internal.context.ContextModelTestCase.setUp(ContextModelTestCase.java:57) 
at org.eclipse.jpt.eclipselink.core.tests.internal.PersistenceUnitTestCase.setUp(PersistenceUnitTestCase.java:54) 
at org.eclipse.jpt.eclipselink.core.tests.internal.options.OptionsAdapterTests.setUp(OptionsAdapterTests.java:60) 
at org.eclipse.test.EclipseTestRunner.run(EclipseTestRunner.java:354) 
at org.eclipse.test.EclipseTestRunner.run(EclipseTestRunner.java:206) 
at org.eclipse.test.CoreTestApplication.runTests(CoreTestApplication.java:35) 
at org.eclipse.test.CoreTestApplication.run(CoreTestApplication.java:31) 
at org.eclipse.equinox.internal.app.EclipseAppContainer.callMethodWithException(EclipseAppContainer.java:574) 
at org.eclipse.equinox.internal.app.EclipseAppHandle.run(EclipseAppHandle.java:195) 
at org.eclipse.core.runtime.internal.adaptor.EclipseAppLauncher.runApplication(EclipseAppLauncher.java:110) 
at org.eclipse.core.runtime.internal.adaptor.EclipseAppLauncher.start(EclipseAppLauncher.java:79) 
at org.eclipse.core.runtime.adaptor.EclipseStarter.run(EclipseStarter.java:382) 
at org.eclipse.core.runtime.adaptor.EclipseStarter.run(EclipseStarter.java:179) 
at org.eclipse.equinox.launcher.Main.invokeFramework(Main.java:549) 
at org.eclipse.equinox.launcher.Main.basicRun(Main.java:504) 
at org.eclipse.equinox.launcher.Main.run(Main.java:1236) 
at org.eclipse.equinox.launcher.Main.main(Main.java:1212)
Test:  testAddRemoveIncludeDescriptorQueries
Class:  JptEclipseLinkCoreTests
java.lang.RuntimeException: missing Java system property: "org.eclipse.jpt.jpa.jar" 
at org.eclipse.jpt.core.tests.internal.projects.TestJpaProject.jarName(TestJpaProject.java:65) 
at org.eclipse.jpt.core.tests.internal.projects.TestJpaProject.<init>(TestJpaProject.java:57) 
at org.eclipse.jpt.core.tests.internal.projects.TestJpaProject.buildJpaProject(TestJpaProject.java:35) 
at org.eclipse.jpt.core.tests.internal.context.ContextModelTestCase.buildJpaProject(ContextModelTestCase.java:90) 
at org.eclipse.jpt.core.tests.internal.context.ContextModelTestCase.buildJavaProject(ContextModelTestCase.java:85) 
at org.eclipse.jpt.core.tests.internal.utility.jdt.AnnotationTestCase.setUp(AnnotationTestCase.java:76) 
at org.eclipse.jpt.core.tests.internal.context.ContextModelTestCase.setUp(ContextModelTestCase.java:57) 
at org.eclipse.jpt.eclipselink.core.tests.internal.PersistenceUnitTestCase.setUp(PersistenceUnitTestCase.java:54) 
at org.eclipse.jpt.eclipselink.core.tests.internal.options.OptionsAdapterTests.setUp(OptionsAdapterTests.java:60) 
at org.eclipse.test.EclipseTestRunner.run(EclipseTestRunner.java:354) 
at org.eclipse.test.EclipseTestRunner.run(EclipseTestRunner.java:206) 
at org.eclipse.test.CoreTestApplication.runTests(CoreTestApplication.java:35) 
at org.eclipse.test.CoreTestApplication.run(CoreTestApplication.java:31) 
at org.eclipse.equinox.internal.app.EclipseAppContainer.callMethodWithException(EclipseAppContainer.java:574) 
at org.eclipse.equinox.internal.app.EclipseAppHandle.run(EclipseAppHandle.java:195) 
at org.eclipse.core.runtime.internal.adaptor.EclipseAppLauncher.runApplication(EclipseAppLauncher.java:110) 
at org.eclipse.core.runtime.internal.adaptor.EclipseAppLauncher.start(EclipseAppLauncher.java:79) 
at org.eclipse.core.runtime.adaptor.EclipseStarter.run(EclipseStarter.java:382) 
at org.eclipse.core.runtime.adaptor.EclipseStarter.run(EclipseStarter.java:179) 
at org.eclipse.equinox.launcher.Main.invokeFramework(Main.java:549) 
at org.eclipse.equinox.launcher.Main.basicRun(Main.java:504) 
at org.eclipse.equinox.launcher.Main.run(Main.java:1236) 
at org.eclipse.equinox.launcher.Main.main(Main.java:1212)
Test:  testSetTargetDatabase
Class:  JptEclipseLinkCoreTests
java.lang.RuntimeException: missing Java system property: "org.eclipse.jpt.jpa.jar" 
at org.eclipse.jpt.core.tests.internal.projects.TestJpaProject.jarName(TestJpaProject.java:65) 
at org.eclipse.jpt.core.tests.internal.projects.TestJpaProject.<init>(TestJpaProject.java:57) 
at org.eclipse.jpt.core.tests.internal.projects.TestJpaProject.buildJpaProject(TestJpaProject.java:35) 
at org.eclipse.jpt.core.tests.internal.context.ContextModelTestCase.buildJpaProject(ContextModelTestCase.java:90) 
at org.eclipse.jpt.core.tests.internal.context.ContextModelTestCase.buildJavaProject(ContextModelTestCase.java:85) 
at org.eclipse.jpt.core.tests.internal.utility.jdt.AnnotationTestCase.setUp(AnnotationTestCase.java:76) 
at org.eclipse.jpt.core.tests.internal.context.ContextModelTestCase.setUp(ContextModelTestCase.java:57) 
at org.eclipse.jpt.eclipselink.core.tests.internal.PersistenceUnitTestCase.setUp(PersistenceUnitTestCase.java:54) 
at org.eclipse.jpt.eclipselink.core.tests.internal.options.OptionsAdapterTests.setUp(OptionsAdapterTests.java:60) 
at org.eclipse.test.EclipseTestRunner.run(EclipseTestRunner.java:354) 
at org.eclipse.test.EclipseTestRunner.run(EclipseTestRunner.java:206) 
at org.eclipse.test.CoreTestApplication.runTests(CoreTestApplication.java:35) 
at org.eclipse.test.CoreTestApplication.run(CoreTestApplication.java:31) 
at org.eclipse.equinox.internal.app.EclipseAppContainer.callMethodWithException(EclipseAppContainer.java:574) 
at org.eclipse.equinox.internal.app.EclipseAppHandle.run(EclipseAppHandle.java:195) 
at org.eclipse.core.runtime.internal.adaptor.EclipseAppLauncher.runApplication(EclipseAppLauncher.java:110) 
at org.eclipse.core.runtime.internal.adaptor.EclipseAppLauncher.start(EclipseAppLauncher.java:79) 
at org.eclipse.core.runtime.adaptor.EclipseStarter.run(EclipseStarter.java:382) 
at org.eclipse.core.runtime.adaptor.EclipseStarter.run(EclipseStarter.java:179) 
at org.eclipse.equinox.launcher.Main.invokeFramework(Main.java:549) 
at org.eclipse.equinox.launcher.Main.basicRun(Main.java:504) 
at org.eclipse.equinox.launcher.Main.run(Main.java:1236) 
at org.eclipse.equinox.launcher.Main.main(Main.java:1212)
Test:  testAddRemoveTargetDatabase
Class:  JptEclipseLinkCoreTests
java.lang.RuntimeException: missing Java system property: "org.eclipse.jpt.jpa.jar" 
at org.eclipse.jpt.core.tests.internal.projects.TestJpaProject.jarName(TestJpaProject.java:65) 
at org.eclipse.jpt.core.tests.internal.projects.TestJpaProject.<init>(TestJpaProject.java:57) 
at org.eclipse.jpt.core.tests.internal.projects.TestJpaProject.buildJpaProject(TestJpaProject.java:35) 
at org.eclipse.jpt.core.tests.internal.context.ContextModelTestCase.buildJpaProject(ContextModelTestCase.java:90) 
at org.eclipse.jpt.core.tests.internal.context.ContextModelTestCase.buildJavaProject(ContextModelTestCase.java:85) 
at org.eclipse.jpt.core.tests.internal.utility.jdt.AnnotationTestCase.setUp(AnnotationTestCase.java:76) 
at org.eclipse.jpt.core.tests.internal.context.ContextModelTestCase.setUp(ContextModelTestCase.java:57) 
at org.eclipse.jpt.eclipselink.core.tests.internal.PersistenceUnitTestCase.setUp(PersistenceUnitTestCase.java:54) 
at org.eclipse.jpt.eclipselink.core.tests.internal.options.OptionsAdapterTests.setUp(OptionsAdapterTests.java:60) 
at org.eclipse.test.EclipseTestRunner.run(EclipseTestRunner.java:354) 
at org.eclipse.test.EclipseTestRunner.run(EclipseTestRunner.java:206) 
at org.eclipse.test.CoreTestApplication.runTests(CoreTestApplication.java:35) 
at org.eclipse.test.CoreTestApplication.run(CoreTestApplication.java:31) 
at org.eclipse.equinox.internal.app.EclipseAppContainer.callMethodWithException(EclipseAppContainer.java:574) 
at org.eclipse.equinox.internal.app.EclipseAppHandle.run(EclipseAppHandle.java:195) 
at org.eclipse.core.runtime.internal.adaptor.EclipseAppLauncher.runApplication(EclipseAppLauncher.java:110) 
at org.eclipse.core.runtime.internal.adaptor.EclipseAppLauncher.start(EclipseAppLauncher.java:79) 
at org.eclipse.core.runtime.adaptor.EclipseStarter.run(EclipseStarter.java:382) 
at org.eclipse.core.runtime.adaptor.EclipseStarter.run(EclipseStarter.java:179) 
at org.eclipse.equinox.launcher.Main.invokeFramework(Main.java:549) 
at org.eclipse.equinox.launcher.Main.basicRun(Main.java:504) 
at org.eclipse.equinox.launcher.Main.run(Main.java:1236) 
at org.eclipse.equinox.launcher.Main.main(Main.java:1212)
Test:  testSetEventListener
Class:  JptEclipseLinkCoreTests
java.lang.RuntimeException: missing Java system property: "org.eclipse.jpt.jpa.jar" 
at org.eclipse.jpt.core.tests.internal.projects.TestJpaProject.jarName(TestJpaProject.java:65) 
at org.eclipse.jpt.core.tests.internal.projects.TestJpaProject.<init>(TestJpaProject.java:57) 
at org.eclipse.jpt.core.tests.internal.projects.TestJpaProject.buildJpaProject(TestJpaProject.java:35) 
at org.eclipse.jpt.core.tests.internal.context.ContextModelTestCase.buildJpaProject(ContextModelTestCase.java:90) 
at org.eclipse.jpt.core.tests.internal.context.ContextModelTestCase.buildJavaProject(ContextModelTestCase.java:85) 
at org.eclipse.jpt.core.tests.internal.utility.jdt.AnnotationTestCase.setUp(AnnotationTestCase.java:76) 
at org.eclipse.jpt.core.tests.internal.context.ContextModelTestCase.setUp(ContextModelTestCase.java:57) 
at org.eclipse.jpt.eclipselink.core.tests.internal.PersistenceUnitTestCase.setUp(PersistenceUnitTestCase.java:54) 
at org.eclipse.jpt.eclipselink.core.tests.internal.options.OptionsAdapterTests.setUp(OptionsAdapterTests.java:60) 
at org.eclipse.test.EclipseTestRunner.run(EclipseTestRunner.java:354) 
at org.eclipse.test.EclipseTestRunner.run(EclipseTestRunner.java:206) 
at org.eclipse.test.CoreTestApplication.runTests(CoreTestApplication.java:35) 
at org.eclipse.test.CoreTestApplication.run(CoreTestApplication.java:31) 
at org.eclipse.equinox.internal.app.EclipseAppContainer.callMethodWithException(EclipseAppContainer.java:574) 
at org.eclipse.equinox.internal.app.EclipseAppHandle.run(EclipseAppHandle.java:195) 
at org.eclipse.core.runtime.internal.adaptor.EclipseAppLauncher.runApplication(EclipseAppLauncher.java:110) 
at org.eclipse.core.runtime.internal.adaptor.EclipseAppLauncher.start(EclipseAppLauncher.java:79) 
at org.eclipse.core.runtime.adaptor.EclipseStarter.run(EclipseStarter.java:382) 
at org.eclipse.core.runtime.adaptor.EclipseStarter.run(EclipseStarter.java:179) 
at org.eclipse.equinox.launcher.Main.invokeFramework(Main.java:549) 
at org.eclipse.equinox.launcher.Main.basicRun(Main.java:504) 
at org.eclipse.equinox.launcher.Main.run(Main.java:1236) 
at org.eclipse.equinox.launcher.Main.main(Main.java:1212)
Test:  testAddRemoveEventListener
Class:  JptEclipseLinkCoreTests
java.lang.RuntimeException: missing Java system property: "org.eclipse.jpt.jpa.jar" 
at org.eclipse.jpt.core.tests.internal.projects.TestJpaProject.jarName(TestJpaProject.java:65) 
at org.eclipse.jpt.core.tests.internal.projects.TestJpaProject.<init>(TestJpaProject.java:57) 
at org.eclipse.jpt.core.tests.internal.projects.TestJpaProject.buildJpaProject(TestJpaProject.java:35) 
at org.eclipse.jpt.core.tests.internal.context.ContextModelTestCase.buildJpaProject(ContextModelTestCase.java:90) 
at org.eclipse.jpt.core.tests.internal.context.ContextModelTestCase.buildJavaProject(ContextModelTestCase.java:85) 
at org.eclipse.jpt.core.tests.internal.utility.jdt.AnnotationTestCase.setUp(AnnotationTestCase.java:76) 
at org.eclipse.jpt.core.tests.internal.context.ContextModelTestCase.setUp(ContextModelTestCase.java:57) 
at org.eclipse.jpt.eclipselink.core.tests.internal.PersistenceUnitTestCase.setUp(PersistenceUnitTestCase.java:54) 
at org.eclipse.jpt.eclipselink.core.tests.internal.options.OptionsAdapterTests.setUp(OptionsAdapterTests.java:60) 
at org.eclipse.test.EclipseTestRunner.run(EclipseTestRunner.java:354) 
at org.eclipse.test.EclipseTestRunner.run(EclipseTestRunner.java:206) 
at org.eclipse.test.CoreTestApplication.runTests(CoreTestApplication.java:35) 
at org.eclipse.test.CoreTestApplication.run(CoreTestApplication.java:31) 
at org.eclipse.equinox.internal.app.EclipseAppContainer.callMethodWithException(EclipseAppContainer.java:574) 
at org.eclipse.equinox.internal.app.EclipseAppHandle.run(EclipseAppHandle.java:195) 
at org.eclipse.core.runtime.internal.adaptor.EclipseAppLauncher.runApplication(EclipseAppLauncher.java:110) 
at org.eclipse.core.runtime.internal.adaptor.EclipseAppLauncher.start(EclipseAppLauncher.java:79) 
at org.eclipse.core.runtime.adaptor.EclipseStarter.run(EclipseStarter.java:382) 
at org.eclipse.core.runtime.adaptor.EclipseStarter.run(EclipseStarter.java:179) 
at org.eclipse.equinox.launcher.Main.invokeFramework(Main.java:549) 
at org.eclipse.equinox.launcher.Main.basicRun(Main.java:504) 
at org.eclipse.equinox.launcher.Main.run(Main.java:1236) 
at org.eclipse.equinox.launcher.Main.main(Main.java:1212)
Test:  testHasListeners
Class:  JptEclipseLinkCoreTests
java.lang.RuntimeException: missing Java system property: "org.eclipse.jpt.jpa.jar" 
at org.eclipse.jpt.core.tests.internal.projects.TestJpaProject.jarName(TestJpaProject.java:65) 
at org.eclipse.jpt.core.tests.internal.projects.TestJpaProject.<init>(TestJpaProject.java:57) 
at org.eclipse.jpt.core.tests.internal.projects.TestJpaProject.buildJpaProject(TestJpaProject.java:35) 
at org.eclipse.jpt.core.tests.internal.context.ContextModelTestCase.buildJpaProject(ContextModelTestCase.java:90) 
at org.eclipse.jpt.core.tests.internal.context.ContextModelTestCase.buildJavaProject(ContextModelTestCase.java:85) 
at org.eclipse.jpt.core.tests.internal.utility.jdt.AnnotationTestCase.setUp(AnnotationTestCase.java:76) 
at org.eclipse.jpt.core.tests.internal.context.ContextModelTestCase.setUp(ContextModelTestCase.java:57) 
at org.eclipse.jpt.eclipselink.core.tests.internal.PersistenceUnitTestCase.setUp(PersistenceUnitTestCase.java:54) 
at org.eclipse.jpt.eclipselink.core.tests.internal.logging.LoggingValueModelTests.setUp(LoggingValueModelTests.java:42) 
at org.eclipse.test.EclipseTestRunner.run(EclipseTestRunner.java:354) 
at org.eclipse.test.EclipseTestRunner.run(EclipseTestRunner.java:206) 
at org.eclipse.test.CoreTestApplication.runTests(CoreTestApplication.java:35) 
at org.eclipse.test.CoreTestApplication.run(CoreTestApplication.java:31) 
at org.eclipse.equinox.internal.app.EclipseAppContainer.callMethodWithException(EclipseAppContainer.java:574) 
at org.eclipse.equinox.internal.app.EclipseAppHandle.run(EclipseAppHandle.java:195) 
at org.eclipse.core.runtime.internal.adaptor.EclipseAppLauncher.runApplication(EclipseAppLauncher.java:110) 
at org.eclipse.core.runtime.internal.adaptor.EclipseAppLauncher.start(EclipseAppLauncher.java:79) 
at org.eclipse.core.runtime.adaptor.EclipseStarter.run(EclipseStarter.java:382) 
at org.eclipse.core.runtime.adaptor.EclipseStarter.run(EclipseStarter.java:179) 
at org.eclipse.equinox.launcher.Main.invokeFramework(Main.java:549) 
at org.eclipse.equinox.launcher.Main.basicRun(Main.java:504) 
at org.eclipse.equinox.launcher.Main.run(Main.java:1236) 
at org.eclipse.equinox.launcher.Main.main(Main.java:1212)
Test:  testValue
Class:  JptEclipseLinkCoreTests
java.lang.RuntimeException: missing Java system property: "org.eclipse.jpt.jpa.jar" 
at org.eclipse.jpt.core.tests.internal.projects.TestJpaProject.jarName(TestJpaProject.java:65) 
at org.eclipse.jpt.core.tests.internal.projects.TestJpaProject.<init>(TestJpaProject.java:57) 
at org.eclipse.jpt.core.tests.internal.projects.TestJpaProject.buildJpaProject(TestJpaProject.java:35) 
at org.eclipse.jpt.core.tests.internal.context.ContextModelTestCase.buildJpaProject(ContextModelTestCase.java:90) 
at org.eclipse.jpt.core.tests.internal.context.ContextModelTestCase.buildJavaProject(ContextModelTestCase.java:85) 
at org.eclipse.jpt.core.tests.internal.utility.jdt.AnnotationTestCase.setUp(AnnotationTestCase.java:76) 
at org.eclipse.jpt.core.tests.internal.context.ContextModelTestCase.setUp(ContextModelTestCase.java:57) 
at org.eclipse.jpt.eclipselink.core.tests.internal.PersistenceUnitTestCase.setUp(PersistenceUnitTestCase.java:54) 
at org.eclipse.jpt.eclipselink.core.tests.internal.logging.LoggingValueModelTests.setUp(LoggingValueModelTests.java:42) 
at org.eclipse.test.EclipseTestRunner.run(EclipseTestRunner.java:354) 
at org.eclipse.test.EclipseTestRunner.run(EclipseTestRunner.java:206) 
at org.eclipse.test.CoreTestApplication.runTests(CoreTestApplication.java:35) 
at org.eclipse.test.CoreTestApplication.run(CoreTestApplication.java:31) 
at org.eclipse.equinox.internal.app.EclipseAppContainer.callMethodWithException(EclipseAppContainer.java:574) 
at org.eclipse.equinox.internal.app.EclipseAppHandle.run(EclipseAppHandle.java:195) 
at org.eclipse.core.runtime.internal.adaptor.EclipseAppLauncher.runApplication(EclipseAppLauncher.java:110) 
at org.eclipse.core.runtime.internal.adaptor.EclipseAppLauncher.start(EclipseAppLauncher.java:79) 
at org.eclipse.core.runtime.adaptor.EclipseStarter.run(EclipseStarter.java:382) 
at org.eclipse.core.runtime.adaptor.EclipseStarter.run(EclipseStarter.java:179) 
at org.eclipse.equinox.launcher.Main.invokeFramework(Main.java:549) 
at org.eclipse.equinox.launcher.Main.basicRun(Main.java:504) 
at org.eclipse.equinox.launcher.Main.run(Main.java:1236) 
at org.eclipse.equinox.launcher.Main.main(Main.java:1212)
Test:  testSetValue
Class:  JptEclipseLinkCoreTests
java.lang.RuntimeException: missing Java system property: "org.eclipse.jpt.jpa.jar" 
at org.eclipse.jpt.core.tests.internal.projects.TestJpaProject.jarName(TestJpaProject.java:65) 
at org.eclipse.jpt.core.tests.internal.projects.TestJpaProject.<init>(TestJpaProject.java:57) 
at org.eclipse.jpt.core.tests.internal.projects.TestJpaProject.buildJpaProject(TestJpaProject.java:35) 
at org.eclipse.jpt.core.tests.internal.context.ContextModelTestCase.buildJpaProject(ContextModelTestCase.java:90) 
at org.eclipse.jpt.core.tests.internal.context.ContextModelTestCase.buildJavaProject(ContextModelTestCase.java:85) 
at org.eclipse.jpt.core.tests.internal.utility.jdt.AnnotationTestCase.setUp(AnnotationTestCase.java:76) 
at org.eclipse.jpt.core.tests.internal.context.ContextModelTestCase.setUp(ContextModelTestCase.java:57) 
at org.eclipse.jpt.eclipselink.core.tests.internal.PersistenceUnitTestCase.setUp(PersistenceUnitTestCase.java:54) 
at org.eclipse.jpt.eclipselink.core.tests.internal.logging.LoggingValueModelTests.setUp(LoggingValueModelTests.java:42) 
at org.eclipse.test.EclipseTestRunner.run(EclipseTestRunner.java:354) 
at org.eclipse.test.EclipseTestRunner.run(EclipseTestRunner.java:206) 
at org.eclipse.test.CoreTestApplication.runTests(CoreTestApplication.java:35) 
at org.eclipse.test.CoreTestApplication.run(CoreTestApplication.java:31) 
at org.eclipse.equinox.internal.app.EclipseAppContainer.callMethodWithException(EclipseAppContainer.java:574) 
at org.eclipse.equinox.internal.app.EclipseAppHandle.run(EclipseAppHandle.java:195) 
at org.eclipse.core.runtime.internal.adaptor.EclipseAppLauncher.runApplication(EclipseAppLauncher.java:110) 
at org.eclipse.core.runtime.internal.adaptor.EclipseAppLauncher.start(EclipseAppLauncher.java:79) 
at org.eclipse.core.runtime.adaptor.EclipseStarter.run(EclipseStarter.java:382) 
at org.eclipse.core.runtime.adaptor.EclipseStarter.run(EclipseStarter.java:179) 
at org.eclipse.equinox.launcher.Main.invokeFramework(Main.java:549) 
at org.eclipse.equinox.launcher.Main.basicRun(Main.java:504) 
at org.eclipse.equinox.launcher.Main.run(Main.java:1236) 
at org.eclipse.equinox.launcher.Main.main(Main.java:1212)
Test:  testSetNullValue
Class:  JptEclipseLinkCoreTests
java.lang.RuntimeException: missing Java system property: "org.eclipse.jpt.jpa.jar" 
at org.eclipse.jpt.core.tests.internal.projects.TestJpaProject.jarName(TestJpaProject.java:65) 
at org.eclipse.jpt.core.tests.internal.projects.TestJpaProject.<init>(TestJpaProject.java:57) 
at org.eclipse.jpt.core.tests.internal.projects.TestJpaProject.buildJpaProject(TestJpaProject.java:35) 
at org.eclipse.jpt.core.tests.internal.context.ContextModelTestCase.buildJpaProject(ContextModelTestCase.java:90) 
at org.eclipse.jpt.core.tests.internal.context.ContextModelTestCase.buildJavaProject(ContextModelTestCase.java:85) 
at org.eclipse.jpt.core.tests.internal.utility.jdt.AnnotationTestCase.setUp(AnnotationTestCase.java:76) 
at org.eclipse.jpt.core.tests.internal.context.ContextModelTestCase.setUp(ContextModelTestCase.java:57) 
at org.eclipse.jpt.eclipselink.core.tests.internal.PersistenceUnitTestCase.setUp(PersistenceUnitTestCase.java:54) 
at org.eclipse.jpt.eclipselink.core.tests.internal.logging.LoggingValueModelTests.setUp(LoggingValueModelTests.java:42) 
at org.eclipse.test.EclipseTestRunner.run(EclipseTestRunner.java:354) 
at org.eclipse.test.EclipseTestRunner.run(EclipseTestRunner.java:206) 
at org.eclipse.test.CoreTestApplication.runTests(CoreTestApplication.java:35) 
at org.eclipse.test.CoreTestApplication.run(CoreTestApplication.java:31) 
at org.eclipse.equinox.internal.app.EclipseAppContainer.callMethodWithException(EclipseAppContainer.java:574) 
at org.eclipse.equinox.internal.app.EclipseAppHandle.run(EclipseAppHandle.java:195) 
at org.eclipse.core.runtime.internal.adaptor.EclipseAppLauncher.runApplication(EclipseAppLauncher.java:110) 
at org.eclipse.core.runtime.internal.adaptor.EclipseAppLauncher.start(EclipseAppLauncher.java:79) 
at org.eclipse.core.runtime.adaptor.EclipseStarter.run(EclipseStarter.java:382) 
at org.eclipse.core.runtime.adaptor.EclipseStarter.run(EclipseStarter.java:179) 
at org.eclipse.equinox.launcher.Main.invokeFramework(Main.java:549) 
at org.eclipse.equinox.launcher.Main.basicRun(Main.java:504) 
at org.eclipse.equinox.launcher.Main.run(Main.java:1236) 
at org.eclipse.equinox.launcher.Main.main(Main.java:1212)
Test:  testHasListeners
Class:  JptEclipseLinkCoreTests
java.lang.RuntimeException: missing Java system property: "org.eclipse.jpt.jpa.jar" 
at org.eclipse.jpt.core.tests.internal.projects.TestJpaProject.jarName(TestJpaProject.java:65) 
at org.eclipse.jpt.core.tests.internal.projects.TestJpaProject.<init>(TestJpaProject.java:57) 
at org.eclipse.jpt.core.tests.internal.projects.TestJpaProject.buildJpaProject(TestJpaProject.java:35) 
at org.eclipse.jpt.core.tests.internal.context.ContextModelTestCase.buildJpaProject(ContextModelTestCase.java:90) 
at org.eclipse.jpt.core.tests.internal.context.ContextModelTestCase.buildJavaProject(ContextModelTestCase.java:85) 
at org.eclipse.jpt.core.tests.internal.utility.jdt.AnnotationTestCase.setUp(AnnotationTestCase.java:76) 
at org.eclipse.jpt.core.tests.internal.context.ContextModelTestCase.setUp(ContextModelTestCase.java:57) 
at org.eclipse.jpt.eclipselink.core.tests.internal.PersistenceUnitTestCase.setUp(PersistenceUnitTestCase.java:54) 
at org.eclipse.jpt.eclipselink.core.tests.internal.logging.LoggingAdapterTests.setUp(LoggingAdapterTests.java:69) 
at org.eclipse.test.EclipseTestRunner.run(EclipseTestRunner.java:354) 
at org.eclipse.test.EclipseTestRunner.run(EclipseTestRunner.java:206) 
at org.eclipse.test.CoreTestApplication.runTests(CoreTestApplication.java:35) 
at org.eclipse.test.CoreTestApplication.run(CoreTestApplication.java:31) 
at org.eclipse.equinox.internal.app.EclipseAppContainer.callMethodWithException(EclipseAppContainer.java:574) 
at org.eclipse.equinox.internal.app.EclipseAppHandle.run(EclipseAppHandle.java:195) 
at org.eclipse.core.runtime.internal.adaptor.EclipseAppLauncher.runApplication(EclipseAppLauncher.java:110) 
at org.eclipse.core.runtime.internal.adaptor.EclipseAppLauncher.start(EclipseAppLauncher.java:79) 
at org.eclipse.core.runtime.adaptor.EclipseStarter.run(EclipseStarter.java:382) 
at org.eclipse.core.runtime.adaptor.EclipseStarter.run(EclipseStarter.java:179) 
at org.eclipse.equinox.launcher.Main.invokeFramework(Main.java:549) 
at org.eclipse.equinox.launcher.Main.basicRun(Main.java:504) 
at org.eclipse.equinox.launcher.Main.run(Main.java:1236) 
at org.eclipse.equinox.launcher.Main.main(Main.java:1212)
Test:  testSetLevel
Class:  JptEclipseLinkCoreTests
java.lang.RuntimeException: missing Java system property: "org.eclipse.jpt.jpa.jar" 
at org.eclipse.jpt.core.tests.internal.projects.TestJpaProject.jarName(TestJpaProject.java:65) 
at org.eclipse.jpt.core.tests.internal.projects.TestJpaProject.<init>(TestJpaProject.java:57) 
at org.eclipse.jpt.core.tests.internal.projects.TestJpaProject.buildJpaProject(TestJpaProject.java:35) 
at org.eclipse.jpt.core.tests.internal.context.ContextModelTestCase.buildJpaProject(ContextModelTestCase.java:90) 
at org.eclipse.jpt.core.tests.internal.context.ContextModelTestCase.buildJavaProject(ContextModelTestCase.java:85) 
at org.eclipse.jpt.core.tests.internal.utility.jdt.AnnotationTestCase.setUp(AnnotationTestCase.java:76) 
at org.eclipse.jpt.core.tests.internal.context.ContextModelTestCase.setUp(ContextModelTestCase.java:57) 
at org.eclipse.jpt.eclipselink.core.tests.internal.PersistenceUnitTestCase.setUp(PersistenceUnitTestCase.java:54) 
at org.eclipse.jpt.eclipselink.core.tests.internal.logging.LoggingAdapterTests.setUp(LoggingAdapterTests.java:69) 
at org.eclipse.test.EclipseTestRunner.run(EclipseTestRunner.java:354) 
at org.eclipse.test.EclipseTestRunner.run(EclipseTestRunner.java:206) 
at org.eclipse.test.CoreTestApplication.runTests(CoreTestApplication.java:35) 
at org.eclipse.test.CoreTestApplication.run(CoreTestApplication.java:31) 
at org.eclipse.equinox.internal.app.EclipseAppContainer.callMethodWithException(EclipseAppContainer.java:574) 
at org.eclipse.equinox.internal.app.EclipseAppHandle.run(EclipseAppHandle.java:195) 
at org.eclipse.core.runtime.internal.adaptor.EclipseAppLauncher.runApplication(EclipseAppLauncher.java:110) 
at org.eclipse.core.runtime.internal.adaptor.EclipseAppLauncher.start(EclipseAppLauncher.java:79) 
at org.eclipse.core.runtime.adaptor.EclipseStarter.run(EclipseStarter.java:382) 
at org.eclipse.core.runtime.adaptor.EclipseStarter.run(EclipseStarter.java:179) 
at org.eclipse.equinox.launcher.Main.invokeFramework(Main.java:549) 
at org.eclipse.equinox.launcher.Main.basicRun(Main.java:504) 
at org.eclipse.equinox.launcher.Main.run(Main.java:1236) 
at org.eclipse.equinox.launcher.Main.main(Main.java:1212)
Test:  testAddRemoveLevel
Class:  JptEclipseLinkCoreTests
java.lang.RuntimeException: missing Java system property: "org.eclipse.jpt.jpa.jar" 
at org.eclipse.jpt.core.tests.internal.projects.TestJpaProject.jarName(TestJpaProject.java:65) 
at org.eclipse.jpt.core.tests.internal.projects.TestJpaProject.<init>(TestJpaProject.java:57) 
at org.eclipse.jpt.core.tests.internal.projects.TestJpaProject.buildJpaProject(TestJpaProject.java:35) 
at org.eclipse.jpt.core.tests.internal.context.ContextModelTestCase.buildJpaProject(ContextModelTestCase.java:90) 
at org.eclipse.jpt.core.tests.internal.context.ContextModelTestCase.buildJavaProject(ContextModelTestCase.java:85) 
at org.eclipse.jpt.core.tests.internal.utility.jdt.AnnotationTestCase.setUp(AnnotationTestCase.java:76) 
at org.eclipse.jpt.core.tests.internal.context.ContextModelTestCase.setUp(ContextModelTestCase.java:57) 
at org.eclipse.jpt.eclipselink.core.tests.internal.PersistenceUnitTestCase.setUp(PersistenceUnitTestCase.java:54) 
at org.eclipse.jpt.eclipselink.core.tests.internal.logging.LoggingAdapterTests.setUp(LoggingAdapterTests.java:69) 
at org.eclipse.test.EclipseTestRunner.run(EclipseTestRunner.java:354) 
at org.eclipse.test.EclipseTestRunner.run(EclipseTestRunner.java:206) 
at org.eclipse.test.CoreTestApplication.runTests(CoreTestApplication.java:35) 
at org.eclipse.test.CoreTestApplication.run(CoreTestApplication.java:31) 
at org.eclipse.equinox.internal.app.EclipseAppContainer.callMethodWithException(EclipseAppContainer.java:574) 
at org.eclipse.equinox.internal.app.EclipseAppHandle.run(EclipseAppHandle.java:195) 
at org.eclipse.core.runtime.internal.adaptor.EclipseAppLauncher.runApplication(EclipseAppLauncher.java:110) 
at org.eclipse.core.runtime.internal.adaptor.EclipseAppLauncher.start(EclipseAppLauncher.java:79) 
at org.eclipse.core.runtime.adaptor.EclipseStarter.run(EclipseStarter.java:382) 
at org.eclipse.core.runtime.adaptor.EclipseStarter.run(EclipseStarter.java:179) 
at org.eclipse.equinox.launcher.Main.invokeFramework(Main.java:549) 
at org.eclipse.equinox.launcher.Main.basicRun(Main.java:504) 
at org.eclipse.equinox.launcher.Main.run(Main.java:1236) 
at org.eclipse.equinox.launcher.Main.main(Main.java:1212)
Test:  testSetThrowExceptions
Class:  JptEclipseLinkCoreTests
java.lang.RuntimeException: missing Java system property: "org.eclipse.jpt.jpa.jar" 
at org.eclipse.jpt.core.tests.internal.projects.TestJpaProject.jarName(TestJpaProject.java:65) 
at org.eclipse.jpt.core.tests.internal.projects.TestJpaProject.<init>(TestJpaProject.java:57) 
at org.eclipse.jpt.core.tests.internal.projects.TestJpaProject.buildJpaProject(TestJpaProject.java:35) 
at org.eclipse.jpt.core.tests.internal.context.ContextModelTestCase.buildJpaProject(ContextModelTestCase.java:90) 
at org.eclipse.jpt.core.tests.internal.context.ContextModelTestCase.buildJavaProject(ContextModelTestCase.java:85) 
at org.eclipse.jpt.core.tests.internal.utility.jdt.AnnotationTestCase.setUp(AnnotationTestCase.java:76) 
at org.eclipse.jpt.core.tests.internal.context.ContextModelTestCase.setUp(ContextModelTestCase.java:57) 
at org.eclipse.jpt.eclipselink.core.tests.internal.PersistenceUnitTestCase.setUp(PersistenceUnitTestCase.java:54) 
at org.eclipse.jpt.eclipselink.core.tests.internal.logging.LoggingAdapterTests.setUp(LoggingAdapterTests.java:69) 
at org.eclipse.test.EclipseTestRunner.run(EclipseTestRunner.java:354) 
at org.eclipse.test.EclipseTestRunner.run(EclipseTestRunner.java:206) 
at org.eclipse.test.CoreTestApplication.runTests(CoreTestApplication.java:35) 
at org.eclipse.test.CoreTestApplication.run(CoreTestApplication.java:31) 
at org.eclipse.equinox.internal.app.EclipseAppContainer.callMethodWithException(EclipseAppContainer.java:574) 
at org.eclipse.equinox.internal.app.EclipseAppHandle.run(EclipseAppHandle.java:195) 
at org.eclipse.core.runtime.internal.adaptor.EclipseAppLauncher.runApplication(EclipseAppLauncher.java:110) 
at org.eclipse.core.runtime.internal.adaptor.EclipseAppLauncher.start(EclipseAppLauncher.java:79) 
at org.eclipse.core.runtime.adaptor.EclipseStarter.run(EclipseStarter.java:382) 
at org.eclipse.core.runtime.adaptor.EclipseStarter.run(EclipseStarter.java:179) 
at org.eclipse.equinox.launcher.Main.invokeFramework(Main.java:549) 
at org.eclipse.equinox.launcher.Main.basicRun(Main.java:504) 
at org.eclipse.equinox.launcher.Main.run(Main.java:1236) 
at org.eclipse.equinox.launcher.Main.main(Main.java:1212)
Test:  testAddRemoveThrowExceptions
Class:  JptEclipseLinkCoreTests
java.lang.RuntimeException: missing Java system property: "org.eclipse.jpt.jpa.jar" 
at org.eclipse.jpt.core.tests.internal.projects.TestJpaProject.jarName(TestJpaProject.java:65) 
at org.eclipse.jpt.core.tests.internal.projects.TestJpaProject.<init>(TestJpaProject.java:57) 
at org.eclipse.jpt.core.tests.internal.projects.TestJpaProject.buildJpaProject(TestJpaProject.java:35) 
at org.eclipse.jpt.core.tests.internal.context.ContextModelTestCase.buildJpaProject(ContextModelTestCase.java:90) 
at org.eclipse.jpt.core.tests.internal.context.ContextModelTestCase.buildJavaProject(ContextModelTestCase.java:85) 
at org.eclipse.jpt.core.tests.internal.utility.jdt.AnnotationTestCase.setUp(AnnotationTestCase.java:76) 
at org.eclipse.jpt.core.tests.internal.context.ContextModelTestCase.setUp(ContextModelTestCase.java:57) 
at org.eclipse.jpt.eclipselink.core.tests.internal.PersistenceUnitTestCase.setUp(PersistenceUnitTestCase.java:54) 
at org.eclipse.jpt.eclipselink.core.tests.internal.logging.LoggingAdapterTests.setUp(LoggingAdapterTests.java:69) 
at org.eclipse.test.EclipseTestRunner.run(EclipseTestRunner.java:354) 
at org.eclipse.test.EclipseTestRunner.run(EclipseTestRunner.java:206) 
at org.eclipse.test.CoreTestApplication.runTests(CoreTestApplication.java:35) 
at org.eclipse.test.CoreTestApplication.run(CoreTestApplication.java:31) 
at org.eclipse.equinox.internal.app.EclipseAppContainer.callMethodWithException(EclipseAppContainer.java:574) 
at org.eclipse.equinox.internal.app.EclipseAppHandle.run(EclipseAppHandle.java:195) 
at org.eclipse.core.runtime.internal.adaptor.EclipseAppLauncher.runApplication(EclipseAppLauncher.java:110) 
at org.eclipse.core.runtime.internal.adaptor.EclipseAppLauncher.start(EclipseAppLauncher.java:79) 
at org.eclipse.core.runtime.adaptor.EclipseStarter.run(EclipseStarter.java:382) 
at org.eclipse.core.runtime.adaptor.EclipseStarter.run(EclipseStarter.java:179) 
at org.eclipse.equinox.launcher.Main.invokeFramework(Main.java:549) 
at org.eclipse.equinox.launcher.Main.basicRun(Main.java:504) 
at org.eclipse.equinox.launcher.Main.run(Main.java:1236) 
at org.eclipse.equinox.launcher.Main.main(Main.java:1212)
Test:  testSetThread
Class:  JptEclipseLinkCoreTests
java.lang.RuntimeException: missing Java system property: "org.eclipse.jpt.jpa.jar" 
at org.eclipse.jpt.core.tests.internal.projects.TestJpaProject.jarName(TestJpaProject.java:65) 
at org.eclipse.jpt.core.tests.internal.projects.TestJpaProject.<init>(TestJpaProject.java:57) 
at org.eclipse.jpt.core.tests.internal.projects.TestJpaProject.buildJpaProject(TestJpaProject.java:35) 
at org.eclipse.jpt.core.tests.internal.context.ContextModelTestCase.buildJpaProject(ContextModelTestCase.java:90) 
at org.eclipse.jpt.core.tests.internal.context.ContextModelTestCase.buildJavaProject(ContextModelTestCase.java:85) 
at org.eclipse.jpt.core.tests.internal.utility.jdt.AnnotationTestCase.setUp(AnnotationTestCase.java:76) 
at org.eclipse.jpt.core.tests.internal.context.ContextModelTestCase.setUp(ContextModelTestCase.java:57) 
at org.eclipse.jpt.eclipselink.core.tests.internal.PersistenceUnitTestCase.setUp(PersistenceUnitTestCase.java:54) 
at org.eclipse.jpt.eclipselink.core.tests.internal.logging.LoggingAdapterTests.setUp(LoggingAdapterTests.java:69) 
at org.eclipse.test.EclipseTestRunner.run(EclipseTestRunner.java:354) 
at org.eclipse.test.EclipseTestRunner.run(EclipseTestRunner.java:206) 
at org.eclipse.test.CoreTestApplication.runTests(CoreTestApplication.java:35) 
at org.eclipse.test.CoreTestApplication.run(CoreTestApplication.java:31) 
at org.eclipse.equinox.internal.app.EclipseAppContainer.callMethodWithException(EclipseAppContainer.java:574) 
at org.eclipse.equinox.internal.app.EclipseAppHandle.run(EclipseAppHandle.java:195) 
at org.eclipse.core.runtime.internal.adaptor.EclipseAppLauncher.runApplication(EclipseAppLauncher.java:110) 
at org.eclipse.core.runtime.internal.adaptor.EclipseAppLauncher.start(EclipseAppLauncher.java:79) 
at org.eclipse.core.runtime.adaptor.EclipseStarter.run(EclipseStarter.java:382) 
at org.eclipse.core.runtime.adaptor.EclipseStarter.run(EclipseStarter.java:179) 
at org.eclipse.equinox.launcher.Main.invokeFramework(Main.java:549) 
at org.eclipse.equinox.launcher.Main.basicRun(Main.java:504) 
at org.eclipse.equinox.launcher.Main.run(Main.java:1236) 
at org.eclipse.equinox.launcher.Main.main(Main.java:1212)
Test:  testAddRemoveThread
Class:  JptEclipseLinkCoreTests
java.lang.RuntimeException: missing Java system property: "org.eclipse.jpt.jpa.jar" 
at org.eclipse.jpt.core.tests.internal.projects.TestJpaProject.jarName(TestJpaProject.java:65) 
at org.eclipse.jpt.core.tests.internal.projects.TestJpaProject.<init>(TestJpaProject.java:57) 
at org.eclipse.jpt.core.tests.internal.projects.TestJpaProject.buildJpaProject(TestJpaProject.java:35) 
at org.eclipse.jpt.core.tests.internal.context.ContextModelTestCase.buildJpaProject(ContextModelTestCase.java:90) 
at org.eclipse.jpt.core.tests.internal.context.ContextModelTestCase.buildJavaProject(ContextModelTestCase.java:85) 
at org.eclipse.jpt.core.tests.internal.utility.jdt.AnnotationTestCase.setUp(AnnotationTestCase.java:76) 
at org.eclipse.jpt.core.tests.internal.context.ContextModelTestCase.setUp(ContextModelTestCase.java:57) 
at org.eclipse.jpt.eclipselink.core.tests.internal.PersistenceUnitTestCase.setUp(PersistenceUnitTestCase.java:54) 
at org.eclipse.jpt.eclipselink.core.tests.internal.logging.LoggingAdapterTests.setUp(LoggingAdapterTests.java:69) 
at org.eclipse.test.EclipseTestRunner.run(EclipseTestRunner.java:354) 
at org.eclipse.test.EclipseTestRunner.run(EclipseTestRunner.java:206) 
at org.eclipse.test.CoreTestApplication.runTests(CoreTestApplication.java:35) 
at org.eclipse.test.CoreTestApplication.run(CoreTestApplication.java:31) 
at org.eclipse.equinox.internal.app.EclipseAppContainer.callMethodWithException(EclipseAppContainer.java:574) 
at org.eclipse.equinox.internal.app.EclipseAppHandle.run(EclipseAppHandle.java:195) 
at org.eclipse.core.runtime.internal.adaptor.EclipseAppLauncher.runApplication(EclipseAppLauncher.java:110) 
at org.eclipse.core.runtime.internal.adaptor.EclipseAppLauncher.start(EclipseAppLauncher.java:79) 
at org.eclipse.core.runtime.adaptor.EclipseStarter.run(EclipseStarter.java:382) 
at org.eclipse.core.runtime.adaptor.EclipseStarter.run(EclipseStarter.java:179) 
at org.eclipse.equinox.launcher.Main.invokeFramework(Main.java:549) 
at org.eclipse.equinox.launcher.Main.basicRun(Main.java:504) 
at org.eclipse.equinox.launcher.Main.run(Main.java:1236) 
at org.eclipse.equinox.launcher.Main.main(Main.java:1212)
Test:  testSetSession
Class:  JptEclipseLinkCoreTests
java.lang.RuntimeException: missing Java system property: "org.eclipse.jpt.jpa.jar" 
at org.eclipse.jpt.core.tests.internal.projects.TestJpaProject.jarName(TestJpaProject.java:65) 
at org.eclipse.jpt.core.tests.internal.projects.TestJpaProject.<init>(TestJpaProject.java:57) 
at org.eclipse.jpt.core.tests.internal.projects.TestJpaProject.buildJpaProject(TestJpaProject.java:35) 
at org.eclipse.jpt.core.tests.internal.context.ContextModelTestCase.buildJpaProject(ContextModelTestCase.java:90) 
at org.eclipse.jpt.core.tests.internal.context.ContextModelTestCase.buildJavaProject(ContextModelTestCase.java:85) 
at org.eclipse.jpt.core.tests.internal.utility.jdt.AnnotationTestCase.setUp(AnnotationTestCase.java:76) 
at org.eclipse.jpt.core.tests.internal.context.ContextModelTestCase.setUp(ContextModelTestCase.java:57) 
at org.eclipse.jpt.eclipselink.core.tests.internal.PersistenceUnitTestCase.setUp(PersistenceUnitTestCase.java:54) 
at org.eclipse.jpt.eclipselink.core.tests.internal.logging.LoggingAdapterTests.setUp(LoggingAdapterTests.java:69) 
at org.eclipse.test.EclipseTestRunner.run(EclipseTestRunner.java:354) 
at org.eclipse.test.EclipseTestRunner.run(EclipseTestRunner.java:206) 
at org.eclipse.test.CoreTestApplication.runTests(CoreTestApplication.java:35) 
at org.eclipse.test.CoreTestApplication.run(CoreTestApplication.java:31) 
at org.eclipse.equinox.internal.app.EclipseAppContainer.callMethodWithException(EclipseAppContainer.java:574) 
at org.eclipse.equinox.internal.app.EclipseAppHandle.run(EclipseAppHandle.java:195) 
at org.eclipse.core.runtime.internal.adaptor.EclipseAppLauncher.runApplication(EclipseAppLauncher.java:110) 
at org.eclipse.core.runtime.internal.adaptor.EclipseAppLauncher.start(EclipseAppLauncher.java:79) 
at org.eclipse.core.runtime.adaptor.EclipseStarter.run(EclipseStarter.java:382) 
at org.eclipse.core.runtime.adaptor.EclipseStarter.run(EclipseStarter.java:179) 
at org.eclipse.equinox.launcher.Main.invokeFramework(Main.java:549) 
at org.eclipse.equinox.launcher.Main.basicRun(Main.java:504) 
at org.eclipse.equinox.launcher.Main.run(Main.java:1236) 
at org.eclipse.equinox.launcher.Main.main(Main.java:1212)
Test:  testAddRemoveSession
Class:  JptEclipseLinkCoreTests
java.lang.RuntimeException: missing Java system property: "org.eclipse.jpt.jpa.jar" 
at org.eclipse.jpt.core.tests.internal.projects.TestJpaProject.jarName(TestJpaProject.java:65) 
at org.eclipse.jpt.core.tests.internal.projects.TestJpaProject.<init>(TestJpaProject.java:57) 
at org.eclipse.jpt.core.tests.internal.projects.TestJpaProject.buildJpaProject(TestJpaProject.java:35) 
at org.eclipse.jpt.core.tests.internal.context.ContextModelTestCase.buildJpaProject(ContextModelTestCase.java:90) 
at org.eclipse.jpt.core.tests.internal.context.ContextModelTestCase.buildJavaProject(ContextModelTestCase.java:85) 
at org.eclipse.jpt.core.tests.internal.utility.jdt.AnnotationTestCase.setUp(AnnotationTestCase.java:76) 
at org.eclipse.jpt.core.tests.internal.context.ContextModelTestCase.setUp(ContextModelTestCase.java:57) 
at org.eclipse.jpt.eclipselink.core.tests.internal.PersistenceUnitTestCase.setUp(PersistenceUnitTestCase.java:54) 
at org.eclipse.jpt.eclipselink.core.tests.internal.logging.LoggingAdapterTests.setUp(LoggingAdapterTests.java:69) 
at org.eclipse.test.EclipseTestRunner.run(EclipseTestRunner.java:354) 
at org.eclipse.test.EclipseTestRunner.run(EclipseTestRunner.java:206) 
at org.eclipse.test.CoreTestApplication.runTests(CoreTestApplication.java:35) 
at org.eclipse.test.CoreTestApplication.run(CoreTestApplication.java:31) 
at org.eclipse.equinox.internal.app.EclipseAppContainer.callMethodWithException(EclipseAppContainer.java:574) 
at org.eclipse.equinox.internal.app.EclipseAppHandle.run(EclipseAppHandle.java:195) 
at org.eclipse.core.runtime.internal.adaptor.EclipseAppLauncher.runApplication(EclipseAppLauncher.java:110) 
at org.eclipse.core.runtime.internal.adaptor.EclipseAppLauncher.start(EclipseAppLauncher.java:79) 
at org.eclipse.core.runtime.adaptor.EclipseStarter.run(EclipseStarter.java:382) 
at org.eclipse.core.runtime.adaptor.EclipseStarter.run(EclipseStarter.java:179) 
at org.eclipse.equinox.launcher.Main.invokeFramework(Main.java:549) 
at org.eclipse.equinox.launcher.Main.basicRun(Main.java:504) 
at org.eclipse.equinox.launcher.Main.run(Main.java:1236) 
at org.eclipse.equinox.launcher.Main.main(Main.java:1212)
Test:  testSetExceptions
Class:  JptEclipseLinkCoreTests
java.lang.RuntimeException: missing Java system property: "org.eclipse.jpt.jpa.jar" 
at org.eclipse.jpt.core.tests.internal.projects.TestJpaProject.jarName(TestJpaProject.java:65) 
at org.eclipse.jpt.core.tests.internal.projects.TestJpaProject.<init>(TestJpaProject.java:57) 
at org.eclipse.jpt.core.tests.internal.projects.TestJpaProject.buildJpaProject(TestJpaProject.java:35) 
at org.eclipse.jpt.core.tests.internal.context.ContextModelTestCase.buildJpaProject(ContextModelTestCase.java:90) 
at org.eclipse.jpt.core.tests.internal.context.ContextModelTestCase.buildJavaProject(ContextModelTestCase.java:85) 
at org.eclipse.jpt.core.tests.internal.utility.jdt.AnnotationTestCase.setUp(AnnotationTestCase.java:76) 
at org.eclipse.jpt.core.tests.internal.context.ContextModelTestCase.setUp(ContextModelTestCase.java:57) 
at org.eclipse.jpt.eclipselink.core.tests.internal.PersistenceUnitTestCase.setUp(PersistenceUnitTestCase.java:54) 
at org.eclipse.jpt.eclipselink.core.tests.internal.logging.LoggingAdapterTests.setUp(LoggingAdapterTests.java:69) 
at org.eclipse.test.EclipseTestRunner.run(EclipseTestRunner.java:354) 
at org.eclipse.test.EclipseTestRunner.run(EclipseTestRunner.java:206) 
at org.eclipse.test.CoreTestApplication.runTests(CoreTestApplication.java:35) 
at org.eclipse.test.CoreTestApplication.run(CoreTestApplication.java:31) 
at org.eclipse.equinox.internal.app.EclipseAppContainer.callMethodWithException(EclipseAppContainer.java:574) 
at org.eclipse.equinox.internal.app.EclipseAppHandle.run(EclipseAppHandle.java:195) 
at org.eclipse.core.runtime.internal.adaptor.EclipseAppLauncher.runApplication(EclipseAppLauncher.java:110) 
at org.eclipse.core.runtime.internal.adaptor.EclipseAppLauncher.start(EclipseAppLauncher.java:79) 
at org.eclipse.core.runtime.adaptor.EclipseStarter.run(EclipseStarter.java:382) 
at org.eclipse.core.runtime.adaptor.EclipseStarter.run(EclipseStarter.java:179) 
at org.eclipse.equinox.launcher.Main.invokeFramework(Main.java:549) 
at org.eclipse.equinox.launcher.Main.basicRun(Main.java:504) 
at org.eclipse.equinox.launcher.Main.run(Main.java:1236) 
at org.eclipse.equinox.launcher.Main.main(Main.java:1212)
Test:  testAddRemoveExceptions
Class:  JptEclipseLinkCoreTests
java.lang.RuntimeException: missing Java system property: "org.eclipse.jpt.jpa.jar" 
at org.eclipse.jpt.core.tests.internal.projects.TestJpaProject.jarName(TestJpaProject.java:65) 
at org.eclipse.jpt.core.tests.internal.projects.TestJpaProject.<init>(TestJpaProject.java:57) 
at org.eclipse.jpt.core.tests.internal.projects.TestJpaProject.buildJpaProject(TestJpaProject.java:35) 
at org.eclipse.jpt.core.tests.internal.context.ContextModelTestCase.buildJpaProject(ContextModelTestCase.java:90) 
at org.eclipse.jpt.core.tests.internal.context.ContextModelTestCase.buildJavaProject(ContextModelTestCase.java:85) 
at org.eclipse.jpt.core.tests.internal.utility.jdt.AnnotationTestCase.setUp(AnnotationTestCase.java:76) 
at org.eclipse.jpt.core.tests.internal.context.ContextModelTestCase.setUp(ContextModelTestCase.java:57) 
at org.eclipse.jpt.eclipselink.core.tests.internal.PersistenceUnitTestCase.setUp(PersistenceUnitTestCase.java:54) 
at org.eclipse.jpt.eclipselink.core.tests.internal.logging.LoggingAdapterTests.setUp(LoggingAdapterTests.java:69) 
at org.eclipse.test.EclipseTestRunner.run(EclipseTestRunner.java:354) 
at org.eclipse.test.EclipseTestRunner.run(EclipseTestRunner.java:206) 
at org.eclipse.test.CoreTestApplication.runTests(CoreTestApplication.java:35) 
at org.eclipse.test.CoreTestApplication.run(CoreTestApplication.java:31) 
at org.eclipse.equinox.internal.app.EclipseAppContainer.callMethodWithException(EclipseAppContainer.java:574) 
at org.eclipse.equinox.internal.app.EclipseAppHandle.run(EclipseAppHandle.java:195) 
at org.eclipse.core.runtime.internal.adaptor.EclipseAppLauncher.runApplication(EclipseAppLauncher.java:110) 
at org.eclipse.core.runtime.internal.adaptor.EclipseAppLauncher.start(EclipseAppLauncher.java:79) 
at org.eclipse.core.runtime.adaptor.EclipseStarter.run(EclipseStarter.java:382) 
at org.eclipse.core.runtime.adaptor.EclipseStarter.run(EclipseStarter.java:179) 
at org.eclipse.equinox.launcher.Main.invokeFramework(Main.java:549) 
at org.eclipse.equinox.launcher.Main.basicRun(Main.java:504) 
at org.eclipse.equinox.launcher.Main.run(Main.java:1236) 
at org.eclipse.equinox.launcher.Main.main(Main.java:1212)
Test:  testSetLogFileLocation
Class:  JptEclipseLinkCoreTests
java.lang.RuntimeException: missing Java system property: "org.eclipse.jpt.jpa.jar" 
at org.eclipse.jpt.core.tests.internal.projects.TestJpaProject.jarName(TestJpaProject.java:65) 
at org.eclipse.jpt.core.tests.internal.projects.TestJpaProject.<init>(TestJpaProject.java:57) 
at org.eclipse.jpt.core.tests.internal.projects.TestJpaProject.buildJpaProject(TestJpaProject.java:35) 
at org.eclipse.jpt.core.tests.internal.context.ContextModelTestCase.buildJpaProject(ContextModelTestCase.java:90) 
at org.eclipse.jpt.core.tests.internal.context.ContextModelTestCase.buildJavaProject(ContextModelTestCase.java:85) 
at org.eclipse.jpt.core.tests.internal.utility.jdt.AnnotationTestCase.setUp(AnnotationTestCase.java:76) 
at org.eclipse.jpt.core.tests.internal.context.ContextModelTestCase.setUp(ContextModelTestCase.java:57) 
at org.eclipse.jpt.eclipselink.core.tests.internal.PersistenceUnitTestCase.setUp(PersistenceUnitTestCase.java:54) 
at org.eclipse.jpt.eclipselink.core.tests.internal.logging.LoggingAdapterTests.setUp(LoggingAdapterTests.java:69) 
at org.eclipse.test.EclipseTestRunner.run(EclipseTestRunner.java:354) 
at org.eclipse.test.EclipseTestRunner.run(EclipseTestRunner.java:206) 
at org.eclipse.test.CoreTestApplication.runTests(CoreTestApplication.java:35) 
at org.eclipse.test.CoreTestApplication.run(CoreTestApplication.java:31) 
at org.eclipse.equinox.internal.app.EclipseAppContainer.callMethodWithException(EclipseAppContainer.java:574) 
at org.eclipse.equinox.internal.app.EclipseAppHandle.run(EclipseAppHandle.java:195) 
at org.eclipse.core.runtime.internal.adaptor.EclipseAppLauncher.runApplication(EclipseAppLauncher.java:110) 
at org.eclipse.core.runtime.internal.adaptor.EclipseAppLauncher.start(EclipseAppLauncher.java:79) 
at org.eclipse.core.runtime.adaptor.EclipseStarter.run(EclipseStarter.java:382) 
at org.eclipse.core.runtime.adaptor.EclipseStarter.run(EclipseStarter.java:179) 
at org.eclipse.equinox.launcher.Main.invokeFramework(Main.java:549) 
at org.eclipse.equinox.launcher.Main.basicRun(Main.java:504) 
at org.eclipse.equinox.launcher.Main.run(Main.java:1236) 
at org.eclipse.equinox.launcher.Main.main(Main.java:1212)
Test:  testAddRemoveLogFileLocation
Class:  JptEclipseLinkCoreTests
java.lang.RuntimeException: missing Java system property: "org.eclipse.jpt.jpa.jar" 
at org.eclipse.jpt.core.tests.internal.projects.TestJpaProject.jarName(TestJpaProject.java:65) 
at org.eclipse.jpt.core.tests.internal.projects.TestJpaProject.<init>(TestJpaProject.java:57) 
at org.eclipse.jpt.core.tests.internal.projects.TestJpaProject.buildJpaProject(TestJpaProject.java:35) 
at org.eclipse.jpt.core.tests.internal.context.ContextModelTestCase.buildJpaProject(ContextModelTestCase.java:90) 
at org.eclipse.jpt.core.tests.internal.context.ContextModelTestCase.buildJavaProject(ContextModelTestCase.java:85) 
at org.eclipse.jpt.core.tests.internal.utility.jdt.AnnotationTestCase.setUp(AnnotationTestCase.java:76) 
at org.eclipse.jpt.core.tests.internal.context.ContextModelTestCase.setUp(ContextModelTestCase.java:57) 
at org.eclipse.jpt.eclipselink.core.tests.internal.PersistenceUnitTestCase.setUp(PersistenceUnitTestCase.java:54) 
at org.eclipse.jpt.eclipselink.core.tests.internal.logging.LoggingAdapterTests.setUp(LoggingAdapterTests.java:69) 
at org.eclipse.test.EclipseTestRunner.run(EclipseTestRunner.java:354) 
at org.eclipse.test.EclipseTestRunner.run(EclipseTestRunner.java:206) 
at org.eclipse.test.CoreTestApplication.runTests(CoreTestApplication.java:35) 
at org.eclipse.test.CoreTestApplication.run(CoreTestApplication.java:31) 
at org.eclipse.equinox.internal.app.EclipseAppContainer.callMethodWithException(EclipseAppContainer.java:574) 
at org.eclipse.equinox.internal.app.EclipseAppHandle.run(EclipseAppHandle.java:195) 
at org.eclipse.core.runtime.internal.adaptor.EclipseAppLauncher.runApplication(EclipseAppLauncher.java:110) 
at org.eclipse.core.runtime.internal.adaptor.EclipseAppLauncher.start(EclipseAppLauncher.java:79) 
at org.eclipse.core.runtime.adaptor.EclipseStarter.run(EclipseStarter.java:382) 
at org.eclipse.core.runtime.adaptor.EclipseStarter.run(EclipseStarter.java:179) 
at org.eclipse.equinox.launcher.Main.invokeFramework(Main.java:549) 
at org.eclipse.equinox.launcher.Main.basicRun(Main.java:504) 
at org.eclipse.equinox.launcher.Main.run(Main.java:1236) 
at org.eclipse.equinox.launcher.Main.main(Main.java:1212)
Test:  testSetLogger
Class:  JptEclipseLinkCoreTests
java.lang.RuntimeException: missing Java system property: "org.eclipse.jpt.jpa.jar" 
at org.eclipse.jpt.core.tests.internal.projects.TestJpaProject.jarName(TestJpaProject.java:65) 
at org.eclipse.jpt.core.tests.internal.projects.TestJpaProject.<init>(TestJpaProject.java:57) 
at org.eclipse.jpt.core.tests.internal.projects.TestJpaProject.buildJpaProject(TestJpaProject.java:35) 
at org.eclipse.jpt.core.tests.internal.context.ContextModelTestCase.buildJpaProject(ContextModelTestCase.java:90) 
at org.eclipse.jpt.core.tests.internal.context.ContextModelTestCase.buildJavaProject(ContextModelTestCase.java:85) 
at org.eclipse.jpt.core.tests.internal.utility.jdt.AnnotationTestCase.setUp(AnnotationTestCase.java:76) 
at org.eclipse.jpt.core.tests.internal.context.ContextModelTestCase.setUp(ContextModelTestCase.java:57) 
at org.eclipse.jpt.eclipselink.core.tests.internal.PersistenceUnitTestCase.setUp(PersistenceUnitTestCase.java:54) 
at org.eclipse.jpt.eclipselink.core.tests.internal.logging.LoggingAdapterTests.setUp(LoggingAdapterTests.java:69) 
at org.eclipse.test.EclipseTestRunner.run(EclipseTestRunner.java:354) 
at org.eclipse.test.EclipseTestRunner.run(EclipseTestRunner.java:206) 
at org.eclipse.test.CoreTestApplication.runTests(CoreTestApplication.java:35) 
at org.eclipse.test.CoreTestApplication.run(CoreTestApplication.java:31) 
at org.eclipse.equinox.internal.app.EclipseAppContainer.callMethodWithException(EclipseAppContainer.java:574) 
at org.eclipse.equinox.internal.app.EclipseAppHandle.run(EclipseAppHandle.java:195) 
at org.eclipse.core.runtime.internal.adaptor.EclipseAppLauncher.runApplication(EclipseAppLauncher.java:110) 
at org.eclipse.core.runtime.internal.adaptor.EclipseAppLauncher.start(EclipseAppLauncher.java:79) 
at org.eclipse.core.runtime.adaptor.EclipseStarter.run(EclipseStarter.java:382) 
at org.eclipse.core.runtime.adaptor.EclipseStarter.run(EclipseStarter.java:179) 
at org.eclipse.equinox.launcher.Main.invokeFramework(Main.java:549) 
at org.eclipse.equinox.launcher.Main.basicRun(Main.java:504) 
at org.eclipse.equinox.launcher.Main.run(Main.java:1236) 
at org.eclipse.equinox.launcher.Main.main(Main.java:1212)
Test:  testAddRemoveLogger
Class:  JptEclipseLinkCoreTests
java.lang.RuntimeException: missing Java system property: "org.eclipse.jpt.jpa.jar" 
at org.eclipse.jpt.core.tests.internal.projects.TestJpaProject.jarName(TestJpaProject.java:65) 
at org.eclipse.jpt.core.tests.internal.projects.TestJpaProject.<init>(TestJpaProject.java:57) 
at org.eclipse.jpt.core.tests.internal.projects.TestJpaProject.buildJpaProject(TestJpaProject.java:35) 
at org.eclipse.jpt.core.tests.internal.context.ContextModelTestCase.buildJpaProject(ContextModelTestCase.java:90) 
at org.eclipse.jpt.core.tests.internal.context.ContextModelTestCase.buildJavaProject(ContextModelTestCase.java:85) 
at org.eclipse.jpt.core.tests.internal.utility.jdt.AnnotationTestCase.setUp(AnnotationTestCase.java:76) 
at org.eclipse.jpt.core.tests.internal.context.ContextModelTestCase.setUp(ContextModelTestCase.java:57) 
at org.eclipse.jpt.eclipselink.core.tests.internal.PersistenceUnitTestCase.setUp(PersistenceUnitTestCase.java:54) 
at org.eclipse.jpt.eclipselink.core.tests.internal.logging.LoggingAdapterTests.setUp(LoggingAdapterTests.java:69) 
at org.eclipse.test.EclipseTestRunner.run(EclipseTestRunner.java:354) 
at org.eclipse.test.EclipseTestRunner.run(EclipseTestRunner.java:206) 
at org.eclipse.test.CoreTestApplication.runTests(CoreTestApplication.java:35) 
at org.eclipse.test.CoreTestApplication.run(CoreTestApplication.java:31) 
at org.eclipse.equinox.internal.app.EclipseAppContainer.callMethodWithException(EclipseAppContainer.java:574) 
at org.eclipse.equinox.internal.app.EclipseAppHandle.run(EclipseAppHandle.java:195) 
at org.eclipse.core.runtime.internal.adaptor.EclipseAppLauncher.runApplication(EclipseAppLauncher.java:110) 
at org.eclipse.core.runtime.internal.adaptor.EclipseAppLauncher.start(EclipseAppLauncher.java:79) 
at org.eclipse.core.runtime.adaptor.EclipseStarter.run(EclipseStarter.java:382) 
at org.eclipse.core.runtime.adaptor.EclipseStarter.run(EclipseStarter.java:179) 
at org.eclipse.equinox.launcher.Main.invokeFramework(Main.java:549) 
at org.eclipse.equinox.launcher.Main.basicRun(Main.java:504) 
at org.eclipse.equinox.launcher.Main.run(Main.java:1236) 
at org.eclipse.equinox.launcher.Main.main(Main.java:1212)
Test:  testHasListeners
Class:  JptEclipseLinkCoreTests
java.lang.RuntimeException: missing Java system property: "org.eclipse.jpt.jpa.jar" 
at org.eclipse.jpt.core.tests.internal.projects.TestJpaProject.jarName(TestJpaProject.java:65) 
at org.eclipse.jpt.core.tests.internal.projects.TestJpaProject.<init>(TestJpaProject.java:57) 
at org.eclipse.jpt.core.tests.internal.projects.TestJpaProject.buildJpaProject(TestJpaProject.java:35) 
at org.eclipse.jpt.core.tests.internal.context.ContextModelTestCase.buildJpaProject(ContextModelTestCase.java:90) 
at org.eclipse.jpt.core.tests.internal.context.ContextModelTestCase.buildJavaProject(ContextModelTestCase.java:85) 
at org.eclipse.jpt.core.tests.internal.utility.jdt.AnnotationTestCase.setUp(AnnotationTestCase.java:76) 
at org.eclipse.jpt.core.tests.internal.context.ContextModelTestCase.setUp(ContextModelTestCase.java:57) 
at org.eclipse.jpt.eclipselink.core.tests.internal.PersistenceUnitTestCase.setUp(PersistenceUnitTestCase.java:54) 
at org.eclipse.jpt.eclipselink.core.tests.internal.customization.CustomizationValueModelTests.setUp(CustomizationValueModelTests.java:43) 
at org.eclipse.test.EclipseTestRunner.run(EclipseTestRunner.java:354) 
at org.eclipse.test.EclipseTestRunner.run(EclipseTestRunner.java:206) 
at org.eclipse.test.CoreTestApplication.runTests(CoreTestApplication.java:35) 
at org.eclipse.test.CoreTestApplication.run(CoreTestApplication.java:31) 
at org.eclipse.equinox.internal.app.EclipseAppContainer.callMethodWithException(EclipseAppContainer.java:574) 
at org.eclipse.equinox.internal.app.EclipseAppHandle.run(EclipseAppHandle.java:195) 
at org.eclipse.core.runtime.internal.adaptor.EclipseAppLauncher.runApplication(EclipseAppLauncher.java:110) 
at org.eclipse.core.runtime.internal.adaptor.EclipseAppLauncher.start(EclipseAppLauncher.java:79) 
at org.eclipse.core.runtime.adaptor.EclipseStarter.run(EclipseStarter.java:382) 
at org.eclipse.core.runtime.adaptor.EclipseStarter.run(EclipseStarter.java:179) 
at org.eclipse.equinox.launcher.Main.invokeFramework(Main.java:549) 
at org.eclipse.equinox.launcher.Main.basicRun(Main.java:504) 
at org.eclipse.equinox.launcher.Main.run(Main.java:1236) 
at org.eclipse.equinox.launcher.Main.main(Main.java:1212)
Test:  testValue
Class:  JptEclipseLinkCoreTests
java.lang.RuntimeException: missing Java system property: "org.eclipse.jpt.jpa.jar" 
at org.eclipse.jpt.core.tests.internal.projects.TestJpaProject.jarName(TestJpaProject.java:65) 
at org.eclipse.jpt.core.tests.internal.projects.TestJpaProject.<init>(TestJpaProject.java:57) 
at org.eclipse.jpt.core.tests.internal.projects.TestJpaProject.buildJpaProject(TestJpaProject.java:35) 
at org.eclipse.jpt.core.tests.internal.context.ContextModelTestCase.buildJpaProject(ContextModelTestCase.java:90) 
at org.eclipse.jpt.core.tests.internal.context.ContextModelTestCase.buildJavaProject(ContextModelTestCase.java:85) 
at org.eclipse.jpt.core.tests.internal.utility.jdt.AnnotationTestCase.setUp(AnnotationTestCase.java:76) 
at org.eclipse.jpt.core.tests.internal.context.ContextModelTestCase.setUp(ContextModelTestCase.java:57) 
at org.eclipse.jpt.eclipselink.core.tests.internal.PersistenceUnitTestCase.setUp(PersistenceUnitTestCase.java:54) 
at org.eclipse.jpt.eclipselink.core.tests.internal.customization.CustomizationValueModelTests.setUp(CustomizationValueModelTests.java:43) 
at org.eclipse.test.EclipseTestRunner.run(EclipseTestRunner.java:354) 
at org.eclipse.test.EclipseTestRunner.run(EclipseTestRunner.java:206) 
at org.eclipse.test.CoreTestApplication.runTests(CoreTestApplication.java:35) 
at org.eclipse.test.CoreTestApplication.run(CoreTestApplication.java:31) 
at org.eclipse.equinox.internal.app.EclipseAppContainer.callMethodWithException(EclipseAppContainer.java:574) 
at org.eclipse.equinox.internal.app.EclipseAppHandle.run(EclipseAppHandle.java:195) 
at org.eclipse.core.runtime.internal.adaptor.EclipseAppLauncher.runApplication(EclipseAppLauncher.java:110) 
at org.eclipse.core.runtime.internal.adaptor.EclipseAppLauncher.start(EclipseAppLauncher.java:79) 
at org.eclipse.core.runtime.adaptor.EclipseStarter.run(EclipseStarter.java:382) 
at org.eclipse.core.runtime.adaptor.EclipseStarter.run(EclipseStarter.java:179) 
at org.eclipse.equinox.launcher.Main.invokeFramework(Main.java:549) 
at org.eclipse.equinox.launcher.Main.basicRun(Main.java:504) 
at org.eclipse.equinox.launcher.Main.run(Main.java:1236) 
at org.eclipse.equinox.launcher.Main.main(Main.java:1212)
Test:  testSetValue
Class:  JptEclipseLinkCoreTests
java.lang.RuntimeException: missing Java system property: "org.eclipse.jpt.jpa.jar" 
at org.eclipse.jpt.core.tests.internal.projects.TestJpaProject.jarName(TestJpaProject.java:65) 
at org.eclipse.jpt.core.tests.internal.projects.TestJpaProject.<init>(TestJpaProject.java:57) 
at org.eclipse.jpt.core.tests.internal.projects.TestJpaProject.buildJpaProject(TestJpaProject.java:35) 
at org.eclipse.jpt.core.tests.internal.context.ContextModelTestCase.buildJpaProject(ContextModelTestCase.java:90) 
at org.eclipse.jpt.core.tests.internal.context.ContextModelTestCase.buildJavaProject(ContextModelTestCase.java:85) 
at org.eclipse.jpt.core.tests.internal.utility.jdt.AnnotationTestCase.setUp(AnnotationTestCase.java:76) 
at org.eclipse.jpt.core.tests.internal.context.ContextModelTestCase.setUp(ContextModelTestCase.java:57) 
at org.eclipse.jpt.eclipselink.core.tests.internal.PersistenceUnitTestCase.setUp(PersistenceUnitTestCase.java:54) 
at org.eclipse.jpt.eclipselink.core.tests.internal.customization.CustomizationValueModelTests.setUp(CustomizationValueModelTests.java:43) 
at org.eclipse.test.EclipseTestRunner.run(EclipseTestRunner.java:354) 
at org.eclipse.test.EclipseTestRunner.run(EclipseTestRunner.java:206) 
at org.eclipse.test.CoreTestApplication.runTests(CoreTestApplication.java:35) 
at org.eclipse.test.CoreTestApplication.run(CoreTestApplication.java:31) 
at org.eclipse.equinox.internal.app.EclipseAppContainer.callMethodWithException(EclipseAppContainer.java:574) 
at org.eclipse.equinox.internal.app.EclipseAppHandle.run(EclipseAppHandle.java:195) 
at org.eclipse.core.runtime.internal.adaptor.EclipseAppLauncher.runApplication(EclipseAppLauncher.java:110) 
at org.eclipse.core.runtime.internal.adaptor.EclipseAppLauncher.start(EclipseAppLauncher.java:79) 
at org.eclipse.core.runtime.adaptor.EclipseStarter.run(EclipseStarter.java:382) 
at org.eclipse.core.runtime.adaptor.EclipseStarter.run(EclipseStarter.java:179) 
at org.eclipse.equinox.launcher.Main.invokeFramework(Main.java:549) 
at org.eclipse.equinox.launcher.Main.basicRun(Main.java:504) 
at org.eclipse.equinox.launcher.Main.run(Main.java:1236) 
at org.eclipse.equinox.launcher.Main.main(Main.java:1212)
Test:  testSetNullValue
Class:  JptEclipseLinkCoreTests
java.lang.RuntimeException: missing Java system property: "org.eclipse.jpt.jpa.jar" 
at org.eclipse.jpt.core.tests.internal.projects.TestJpaProject.jarName(TestJpaProject.java:65) 
at org.eclipse.jpt.core.tests.internal.projects.TestJpaProject.<init>(TestJpaProject.java:57) 
at org.eclipse.jpt.core.tests.internal.projects.TestJpaProject.buildJpaProject(TestJpaProject.java:35) 
at org.eclipse.jpt.core.tests.internal.context.ContextModelTestCase.buildJpaProject(ContextModelTestCase.java:90) 
at org.eclipse.jpt.core.tests.internal.context.ContextModelTestCase.buildJavaProject(ContextModelTestCase.java:85) 
at org.eclipse.jpt.core.tests.internal.utility.jdt.AnnotationTestCase.setUp(AnnotationTestCase.java:76) 
at org.eclipse.jpt.core.tests.internal.context.ContextModelTestCase.setUp(ContextModelTestCase.java:57) 
at org.eclipse.jpt.eclipselink.core.tests.internal.PersistenceUnitTestCase.setUp(PersistenceUnitTestCase.java:54) 
at org.eclipse.jpt.eclipselink.core.tests.internal.customization.CustomizationValueModelTests.setUp(CustomizationValueModelTests.java:43) 
at org.eclipse.test.EclipseTestRunner.run(EclipseTestRunner.java:354) 
at org.eclipse.test.EclipseTestRunner.run(EclipseTestRunner.java:206) 
at org.eclipse.test.CoreTestApplication.runTests(CoreTestApplication.java:35) 
at org.eclipse.test.CoreTestApplication.run(CoreTestApplication.java:31) 
at org.eclipse.equinox.internal.app.EclipseAppContainer.callMethodWithException(EclipseAppContainer.java:574) 
at org.eclipse.equinox.internal.app.EclipseAppHandle.run(EclipseAppHandle.java:195) 
at org.eclipse.core.runtime.internal.adaptor.EclipseAppLauncher.runApplication(EclipseAppLauncher.java:110) 
at org.eclipse.core.runtime.internal.adaptor.EclipseAppLauncher.start(EclipseAppLauncher.java:79) 
at org.eclipse.core.runtime.adaptor.EclipseStarter.run(EclipseStarter.java:382) 
at org.eclipse.core.runtime.adaptor.EclipseStarter.run(EclipseStarter.java:179) 
at org.eclipse.equinox.launcher.Main.invokeFramework(Main.java:549) 
at org.eclipse.equinox.launcher.Main.basicRun(Main.java:504) 
at org.eclipse.equinox.launcher.Main.run(Main.java:1236) 
at org.eclipse.equinox.launcher.Main.main(Main.java:1212)
Test:  testEntitiesList
Class:  JptEclipseLinkCoreTests
java.lang.RuntimeException: missing Java system property: "org.eclipse.jpt.jpa.jar" 
at org.eclipse.jpt.core.tests.internal.projects.TestJpaProject.jarName(TestJpaProject.java:65) 
at org.eclipse.jpt.core.tests.internal.projects.TestJpaProject.<init>(TestJpaProject.java:57) 
at org.eclipse.jpt.core.tests.internal.projects.TestJpaProject.buildJpaProject(TestJpaProject.java:35) 
at org.eclipse.jpt.core.tests.internal.context.ContextModelTestCase.buildJpaProject(ContextModelTestCase.java:90) 
at org.eclipse.jpt.core.tests.internal.context.ContextModelTestCase.buildJavaProject(ContextModelTestCase.java:85) 
at org.eclipse.jpt.core.tests.internal.utility.jdt.AnnotationTestCase.setUp(AnnotationTestCase.java:76) 
at org.eclipse.jpt.core.tests.internal.context.ContextModelTestCase.setUp(ContextModelTestCase.java:57) 
at org.eclipse.jpt.eclipselink.core.tests.internal.PersistenceUnitTestCase.setUp(PersistenceUnitTestCase.java:54) 
at org.eclipse.jpt.eclipselink.core.tests.internal.customization.CustomizationAdapterTests.setUp(CustomizationAdapterTests.java:75) 
at org.eclipse.test.EclipseTestRunner.run(EclipseTestRunner.java:354) 
at org.eclipse.test.EclipseTestRunner.run(EclipseTestRunner.java:206) 
at org.eclipse.test.CoreTestApplication.runTests(CoreTestApplication.java:35) 
at org.eclipse.test.CoreTestApplication.run(CoreTestApplication.java:31) 
at org.eclipse.equinox.internal.app.EclipseAppContainer.callMethodWithException(EclipseAppContainer.java:574) 
at org.eclipse.equinox.internal.app.EclipseAppHandle.run(EclipseAppHandle.java:195) 
at org.eclipse.core.runtime.internal.adaptor.EclipseAppLauncher.runApplication(EclipseAppLauncher.java:110) 
at org.eclipse.core.runtime.internal.adaptor.EclipseAppLauncher.start(EclipseAppLauncher.java:79) 
at org.eclipse.core.runtime.adaptor.EclipseStarter.run(EclipseStarter.java:382) 
at org.eclipse.core.runtime.adaptor.EclipseStarter.run(EclipseStarter.java:179) 
at org.eclipse.equinox.launcher.Main.invokeFramework(Main.java:549) 
at org.eclipse.equinox.launcher.Main.basicRun(Main.java:504) 
at org.eclipse.equinox.launcher.Main.run(Main.java:1236) 
at org.eclipse.equinox.launcher.Main.main(Main.java:1212)
Test:  testHasListeners
Class:  JptEclipseLinkCoreTests
java.lang.RuntimeException: missing Java system property: "org.eclipse.jpt.jpa.jar" 
at org.eclipse.jpt.core.tests.internal.projects.TestJpaProject.jarName(TestJpaProject.java:65) 
at org.eclipse.jpt.core.tests.internal.projects.TestJpaProject.<init>(TestJpaProject.java:57) 
at org.eclipse.jpt.core.tests.internal.projects.TestJpaProject.buildJpaProject(TestJpaProject.java:35) 
at org.eclipse.jpt.core.tests.internal.context.ContextModelTestCase.buildJpaProject(ContextModelTestCase.java:90) 
at org.eclipse.jpt.core.tests.internal.context.ContextModelTestCase.buildJavaProject(ContextModelTestCase.java:85) 
at org.eclipse.jpt.core.tests.internal.utility.jdt.AnnotationTestCase.setUp(AnnotationTestCase.java:76) 
at org.eclipse.jpt.core.tests.internal.context.ContextModelTestCase.setUp(ContextModelTestCase.java:57) 
at org.eclipse.jpt.eclipselink.core.tests.internal.PersistenceUnitTestCase.setUp(PersistenceUnitTestCase.java:54) 
at org.eclipse.jpt.eclipselink.core.tests.internal.customization.CustomizationAdapterTests.setUp(CustomizationAdapterTests.java:75) 
at org.eclipse.test.EclipseTestRunner.run(EclipseTestRunner.java:354) 
at org.eclipse.test.EclipseTestRunner.run(EclipseTestRunner.java:206) 
at org.eclipse.test.CoreTestApplication.runTests(CoreTestApplication.java:35) 
at org.eclipse.test.CoreTestApplication.run(CoreTestApplication.java:31) 
at org.eclipse.equinox.internal.app.EclipseAppContainer.callMethodWithException(EclipseAppContainer.java:574) 
at org.eclipse.equinox.internal.app.EclipseAppHandle.run(EclipseAppHandle.java:195) 
at org.eclipse.core.runtime.internal.adaptor.EclipseAppLauncher.runApplication(EclipseAppLauncher.java:110) 
at org.eclipse.core.runtime.internal.adaptor.EclipseAppLauncher.start(EclipseAppLauncher.java:79) 
at org.eclipse.core.runtime.adaptor.EclipseStarter.run(EclipseStarter.java:382) 
at org.eclipse.core.runtime.adaptor.EclipseStarter.run(EclipseStarter.java:179) 
at org.eclipse.equinox.launcher.Main.invokeFramework(Main.java:549) 
at org.eclipse.equinox.launcher.Main.basicRun(Main.java:504) 
at org.eclipse.equinox.launcher.Main.run(Main.java:1236) 
at org.eclipse.equinox.launcher.Main.main(Main.java:1212)
Test:  testSetThrowExceptions
Class:  JptEclipseLinkCoreTests
java.lang.RuntimeException: missing Java system property: "org.eclipse.jpt.jpa.jar" 
at org.eclipse.jpt.core.tests.internal.projects.TestJpaProject.jarName(TestJpaProject.java:65) 
at org.eclipse.jpt.core.tests.internal.projects.TestJpaProject.<init>(TestJpaProject.java:57) 
at org.eclipse.jpt.core.tests.internal.projects.TestJpaProject.buildJpaProject(TestJpaProject.java:35) 
at org.eclipse.jpt.core.tests.internal.context.ContextModelTestCase.buildJpaProject(ContextModelTestCase.java:90) 
at org.eclipse.jpt.core.tests.internal.context.ContextModelTestCase.buildJavaProject(ContextModelTestCase.java:85) 
at org.eclipse.jpt.core.tests.internal.utility.jdt.AnnotationTestCase.setUp(AnnotationTestCase.java:76) 
at org.eclipse.jpt.core.tests.internal.context.ContextModelTestCase.setUp(ContextModelTestCase.java:57) 
at org.eclipse.jpt.eclipselink.core.tests.internal.PersistenceUnitTestCase.setUp(PersistenceUnitTestCase.java:54) 
at org.eclipse.jpt.eclipselink.core.tests.internal.customization.CustomizationAdapterTests.setUp(CustomizationAdapterTests.java:75) 
at org.eclipse.test.EclipseTestRunner.run(EclipseTestRunner.java:354) 
at org.eclipse.test.EclipseTestRunner.run(EclipseTestRunner.java:206) 
at org.eclipse.test.CoreTestApplication.runTests(CoreTestApplication.java:35) 
at org.eclipse.test.CoreTestApplication.run(CoreTestApplication.java:31) 
at org.eclipse.equinox.internal.app.EclipseAppContainer.callMethodWithException(EclipseAppContainer.java:574) 
at org.eclipse.equinox.internal.app.EclipseAppHandle.run(EclipseAppHandle.java:195) 
at org.eclipse.core.runtime.internal.adaptor.EclipseAppLauncher.runApplication(EclipseAppLauncher.java:110) 
at org.eclipse.core.runtime.internal.adaptor.EclipseAppLauncher.start(EclipseAppLauncher.java:79) 
at org.eclipse.core.runtime.adaptor.EclipseStarter.run(EclipseStarter.java:382) 
at org.eclipse.core.runtime.adaptor.EclipseStarter.run(EclipseStarter.java:179) 
at org.eclipse.equinox.launcher.Main.invokeFramework(Main.java:549) 
at org.eclipse.equinox.launcher.Main.basicRun(Main.java:504) 
at org.eclipse.equinox.launcher.Main.run(Main.java:1236) 
at org.eclipse.equinox.launcher.Main.main(Main.java:1212)
Test:  testAddRemoveThrowExceptions
Class:  JptEclipseLinkCoreTests
java.lang.RuntimeException: missing Java system property: "org.eclipse.jpt.jpa.jar" 
at org.eclipse.jpt.core.tests.internal.projects.TestJpaProject.jarName(TestJpaProject.java:65) 
at org.eclipse.jpt.core.tests.internal.projects.TestJpaProject.<init>(TestJpaProject.java:57) 
at org.eclipse.jpt.core.tests.internal.projects.TestJpaProject.buildJpaProject(TestJpaProject.java:35) 
at org.eclipse.jpt.core.tests.internal.context.ContextModelTestCase.buildJpaProject(ContextModelTestCase.java:90) 
at org.eclipse.jpt.core.tests.internal.context.ContextModelTestCase.buildJavaProject(ContextModelTestCase.java:85) 
at org.eclipse.jpt.core.tests.internal.utility.jdt.AnnotationTestCase.setUp(AnnotationTestCase.java:76) 
at org.eclipse.jpt.core.tests.internal.context.ContextModelTestCase.setUp(ContextModelTestCase.java:57) 
at org.eclipse.jpt.eclipselink.core.tests.internal.PersistenceUnitTestCase.setUp(PersistenceUnitTestCase.java:54) 
at org.eclipse.jpt.eclipselink.core.tests.internal.customization.CustomizationAdapterTests.setUp(CustomizationAdapterTests.java:75) 
at org.eclipse.test.EclipseTestRunner.run(EclipseTestRunner.java:354) 
at org.eclipse.test.EclipseTestRunner.run(EclipseTestRunner.java:206) 
at org.eclipse.test.CoreTestApplication.runTests(CoreTestApplication.java:35) 
at org.eclipse.test.CoreTestApplication.run(CoreTestApplication.java:31) 
at org.eclipse.equinox.internal.app.EclipseAppContainer.callMethodWithException(EclipseAppContainer.java:574) 
at org.eclipse.equinox.internal.app.EclipseAppHandle.run(EclipseAppHandle.java:195) 
at org.eclipse.core.runtime.internal.adaptor.EclipseAppLauncher.runApplication(EclipseAppLauncher.java:110) 
at org.eclipse.core.runtime.internal.adaptor.EclipseAppLauncher.start(EclipseAppLauncher.java:79) 
at org.eclipse.core.runtime.adaptor.EclipseStarter.run(EclipseStarter.java:382) 
at org.eclipse.core.runtime.adaptor.EclipseStarter.run(EclipseStarter.java:179) 
at org.eclipse.equinox.launcher.Main.invokeFramework(Main.java:549) 
at org.eclipse.equinox.launcher.Main.basicRun(Main.java:504) 
at org.eclipse.equinox.launcher.Main.run(Main.java:1236) 
at org.eclipse.equinox.launcher.Main.main(Main.java:1212)
Test:  testSetWeavingLazy
Class:  JptEclipseLinkCoreTests
java.lang.RuntimeException: missing Java system property: "org.eclipse.jpt.jpa.jar" 
at org.eclipse.jpt.core.tests.internal.projects.TestJpaProject.jarName(TestJpaProject.java:65) 
at org.eclipse.jpt.core.tests.internal.projects.TestJpaProject.<init>(TestJpaProject.java:57) 
at org.eclipse.jpt.core.tests.internal.projects.TestJpaProject.buildJpaProject(TestJpaProject.java:35) 
at org.eclipse.jpt.core.tests.internal.context.ContextModelTestCase.buildJpaProject(ContextModelTestCase.java:90) 
at org.eclipse.jpt.core.tests.internal.context.ContextModelTestCase.buildJavaProject(ContextModelTestCase.java:85) 
at org.eclipse.jpt.core.tests.internal.utility.jdt.AnnotationTestCase.setUp(AnnotationTestCase.java:76) 
at org.eclipse.jpt.core.tests.internal.context.ContextModelTestCase.setUp(ContextModelTestCase.java:57) 
at org.eclipse.jpt.eclipselink.core.tests.internal.PersistenceUnitTestCase.setUp(PersistenceUnitTestCase.java:54) 
at org.eclipse.jpt.eclipselink.core.tests.internal.customization.CustomizationAdapterTests.setUp(CustomizationAdapterTests.java:75) 
at org.eclipse.test.EclipseTestRunner.run(EclipseTestRunner.java:354) 
at org.eclipse.test.EclipseTestRunner.run(EclipseTestRunner.java:206) 
at org.eclipse.test.CoreTestApplication.runTests(CoreTestApplication.java:35) 
at org.eclipse.test.CoreTestApplication.run(CoreTestApplication.java:31) 
at org.eclipse.equinox.internal.app.EclipseAppContainer.callMethodWithException(EclipseAppContainer.java:574) 
at org.eclipse.equinox.internal.app.EclipseAppHandle.run(EclipseAppHandle.java:195) 
at org.eclipse.core.runtime.internal.adaptor.EclipseAppLauncher.runApplication(EclipseAppLauncher.java:110) 
at org.eclipse.core.runtime.internal.adaptor.EclipseAppLauncher.start(EclipseAppLauncher.java:79) 
at org.eclipse.core.runtime.adaptor.EclipseStarter.run(EclipseStarter.java:382) 
at org.eclipse.core.runtime.adaptor.EclipseStarter.run(EclipseStarter.java:179) 
at org.eclipse.equinox.launcher.Main.invokeFramework(Main.java:549) 
at org.eclipse.equinox.launcher.Main.basicRun(Main.java:504) 
at org.eclipse.equinox.launcher.Main.run(Main.java:1236) 
at org.eclipse.equinox.launcher.Main.main(Main.java:1212)
Test:  testAddRemoveWeavingLazy
Class:  JptEclipseLinkCoreTests
java.lang.RuntimeException: missing Java system property: "org.eclipse.jpt.jpa.jar" 
at org.eclipse.jpt.core.tests.internal.projects.TestJpaProject.jarName(TestJpaProject.java:65) 
at org.eclipse.jpt.core.tests.internal.projects.TestJpaProject.<init>(TestJpaProject.java:57) 
at org.eclipse.jpt.core.tests.internal.projects.TestJpaProject.buildJpaProject(TestJpaProject.java:35) 
at org.eclipse.jpt.core.tests.internal.context.ContextModelTestCase.buildJpaProject(ContextModelTestCase.java:90) 
at org.eclipse.jpt.core.tests.internal.context.ContextModelTestCase.buildJavaProject(ContextModelTestCase.java:85) 
at org.eclipse.jpt.core.tests.internal.utility.jdt.AnnotationTestCase.setUp(AnnotationTestCase.java:76) 
at org.eclipse.jpt.core.tests.internal.context.ContextModelTestCase.setUp(ContextModelTestCase.java:57) 
at org.eclipse.jpt.eclipselink.core.tests.internal.PersistenceUnitTestCase.setUp(PersistenceUnitTestCase.java:54) 
at org.eclipse.jpt.eclipselink.core.tests.internal.customization.CustomizationAdapterTests.setUp(CustomizationAdapterTests.java:75) 
at org.eclipse.test.EclipseTestRunner.run(EclipseTestRunner.java:354) 
at org.eclipse.test.EclipseTestRunner.run(EclipseTestRunner.java:206) 
at org.eclipse.test.CoreTestApplication.runTests(CoreTestApplication.java:35) 
at org.eclipse.test.CoreTestApplication.run(CoreTestApplication.java:31) 
at org.eclipse.equinox.internal.app.EclipseAppContainer.callMethodWithException(EclipseAppContainer.java:574) 
at org.eclipse.equinox.internal.app.EclipseAppHandle.run(EclipseAppHandle.java:195) 
at org.eclipse.core.runtime.internal.adaptor.EclipseAppLauncher.runApplication(EclipseAppLauncher.java:110) 
at org.eclipse.core.runtime.internal.adaptor.EclipseAppLauncher.start(EclipseAppLauncher.java:79) 
at org.eclipse.core.runtime.adaptor.EclipseStarter.run(EclipseStarter.java:382) 
at org.eclipse.core.runtime.adaptor.EclipseStarter.run(EclipseStarter.java:179) 
at org.eclipse.equinox.launcher.Main.invokeFramework(Main.java:549) 
at org.eclipse.equinox.launcher.Main.basicRun(Main.java:504) 
at org.eclipse.equinox.launcher.Main.run(Main.java:1236) 
at org.eclipse.equinox.launcher.Main.main(Main.java:1212)
Test:  testSetWeavingChangeTracking
Class:  JptEclipseLinkCoreTests
java.lang.RuntimeException: missing Java system property: "org.eclipse.jpt.jpa.jar" 
at org.eclipse.jpt.core.tests.internal.projects.TestJpaProject.jarName(TestJpaProject.java:65) 
at org.eclipse.jpt.core.tests.internal.projects.TestJpaProject.<init>(TestJpaProject.java:57) 
at org.eclipse.jpt.core.tests.internal.projects.TestJpaProject.buildJpaProject(TestJpaProject.java:35) 
at org.eclipse.jpt.core.tests.internal.context.ContextModelTestCase.buildJpaProject(ContextModelTestCase.java:90) 
at org.eclipse.jpt.core.tests.internal.context.ContextModelTestCase.buildJavaProject(ContextModelTestCase.java:85) 
at org.eclipse.jpt.core.tests.internal.utility.jdt.AnnotationTestCase.setUp(AnnotationTestCase.java:76) 
at org.eclipse.jpt.core.tests.internal.context.ContextModelTestCase.setUp(ContextModelTestCase.java:57) 
at org.eclipse.jpt.eclipselink.core.tests.internal.PersistenceUnitTestCase.setUp(PersistenceUnitTestCase.java:54) 
at org.eclipse.jpt.eclipselink.core.tests.internal.customization.CustomizationAdapterTests.setUp(CustomizationAdapterTests.java:75) 
at org.eclipse.test.EclipseTestRunner.run(EclipseTestRunner.java:354) 
at org.eclipse.test.EclipseTestRunner.run(EclipseTestRunner.java:206) 
at org.eclipse.test.CoreTestApplication.runTests(CoreTestApplication.java:35) 
at org.eclipse.test.CoreTestApplication.run(CoreTestApplication.java:31) 
at org.eclipse.equinox.internal.app.EclipseAppContainer.callMethodWithException(EclipseAppContainer.java:574) 
at org.eclipse.equinox.internal.app.EclipseAppHandle.run(EclipseAppHandle.java:195) 
at org.eclipse.core.runtime.internal.adaptor.EclipseAppLauncher.runApplication(EclipseAppLauncher.java:110) 
at org.eclipse.core.runtime.internal.adaptor.EclipseAppLauncher.start(EclipseAppLauncher.java:79) 
at org.eclipse.core.runtime.adaptor.EclipseStarter.run(EclipseStarter.java:382) 
at org.eclipse.core.runtime.adaptor.EclipseStarter.run(EclipseStarter.java:179) 
at org.eclipse.equinox.launcher.Main.invokeFramework(Main.java:549) 
at org.eclipse.equinox.launcher.Main.basicRun(Main.java:504) 
at org.eclipse.equinox.launcher.Main.run(Main.java:1236) 
at org.eclipse.equinox.launcher.Main.main(Main.java:1212)
Test:  testAddRemoveWeavingChangeTracking
Class:  JptEclipseLinkCoreTests
java.lang.RuntimeException: missing Java system property: "org.eclipse.jpt.jpa.jar" 
at org.eclipse.jpt.core.tests.internal.projects.TestJpaProject.jarName(TestJpaProject.java:65) 
at org.eclipse.jpt.core.tests.internal.projects.TestJpaProject.<init>(TestJpaProject.java:57) 
at org.eclipse.jpt.core.tests.internal.projects.TestJpaProject.buildJpaProject(TestJpaProject.java:35) 
at org.eclipse.jpt.core.tests.internal.context.ContextModelTestCase.buildJpaProject(ContextModelTestCase.java:90) 
at org.eclipse.jpt.core.tests.internal.context.ContextModelTestCase.buildJavaProject(ContextModelTestCase.java:85) 
at org.eclipse.jpt.core.tests.internal.utility.jdt.AnnotationTestCase.setUp(AnnotationTestCase.java:76) 
at org.eclipse.jpt.core.tests.internal.context.ContextModelTestCase.setUp(ContextModelTestCase.java:57) 
at org.eclipse.jpt.eclipselink.core.tests.internal.PersistenceUnitTestCase.setUp(PersistenceUnitTestCase.java:54) 
at org.eclipse.jpt.eclipselink.core.tests.internal.customization.CustomizationAdapterTests.setUp(CustomizationAdapterTests.java:75) 
at org.eclipse.test.EclipseTestRunner.run(EclipseTestRunner.java:354) 
at org.eclipse.test.EclipseTestRunner.run(EclipseTestRunner.java:206) 
at org.eclipse.test.CoreTestApplication.runTests(CoreTestApplication.java:35) 
at org.eclipse.test.CoreTestApplication.run(CoreTestApplication.java:31) 
at org.eclipse.equinox.internal.app.EclipseAppContainer.callMethodWithException(EclipseAppContainer.java:574) 
at org.eclipse.equinox.internal.app.EclipseAppHandle.run(EclipseAppHandle.java:195) 
at org.eclipse.core.runtime.internal.adaptor.EclipseAppLauncher.runApplication(EclipseAppLauncher.java:110) 
at org.eclipse.core.runtime.internal.adaptor.EclipseAppLauncher.start(EclipseAppLauncher.java:79) 
at org.eclipse.core.runtime.adaptor.EclipseStarter.run(EclipseStarter.java:382) 
at org.eclipse.core.runtime.adaptor.EclipseStarter.run(EclipseStarter.java:179) 
at org.eclipse.equinox.launcher.Main.invokeFramework(Main.java:549) 
at org.eclipse.equinox.launcher.Main.basicRun(Main.java:504) 
at org.eclipse.equinox.launcher.Main.run(Main.java:1236) 
at org.eclipse.equinox.launcher.Main.main(Main.java:1212)
Test:  testSetWeavingFetchGroups
Class:  JptEclipseLinkCoreTests
java.lang.RuntimeException: missing Java system property: "org.eclipse.jpt.jpa.jar" 
at org.eclipse.jpt.core.tests.internal.projects.TestJpaProject.jarName(TestJpaProject.java:65) 
at org.eclipse.jpt.core.tests.internal.projects.TestJpaProject.<init>(TestJpaProject.java:57) 
at org.eclipse.jpt.core.tests.internal.projects.TestJpaProject.buildJpaProject(TestJpaProject.java:35) 
at org.eclipse.jpt.core.tests.internal.context.ContextModelTestCase.buildJpaProject(ContextModelTestCase.java:90) 
at org.eclipse.jpt.core.tests.internal.context.ContextModelTestCase.buildJavaProject(ContextModelTestCase.java:85) 
at org.eclipse.jpt.core.tests.internal.utility.jdt.AnnotationTestCase.setUp(AnnotationTestCase.java:76) 
at org.eclipse.jpt.core.tests.internal.context.ContextModelTestCase.setUp(ContextModelTestCase.java:57) 
at org.eclipse.jpt.eclipselink.core.tests.internal.PersistenceUnitTestCase.setUp(PersistenceUnitTestCase.java:54) 
at org.eclipse.jpt.eclipselink.core.tests.internal.customization.CustomizationAdapterTests.setUp(CustomizationAdapterTests.java:75) 
at org.eclipse.test.EclipseTestRunner.run(EclipseTestRunner.java:354) 
at org.eclipse.test.EclipseTestRunner.run(EclipseTestRunner.java:206) 
at org.eclipse.test.CoreTestApplication.runTests(CoreTestApplication.java:35) 
at org.eclipse.test.CoreTestApplication.run(CoreTestApplication.java:31) 
at org.eclipse.equinox.internal.app.EclipseAppContainer.callMethodWithException(EclipseAppContainer.java:574) 
at org.eclipse.equinox.internal.app.EclipseAppHandle.run(EclipseAppHandle.java:195) 
at org.eclipse.core.runtime.internal.adaptor.EclipseAppLauncher.runApplication(EclipseAppLauncher.java:110) 
at org.eclipse.core.runtime.internal.adaptor.EclipseAppLauncher.start(EclipseAppLauncher.java:79) 
at org.eclipse.core.runtime.adaptor.EclipseStarter.run(EclipseStarter.java:382) 
at org.eclipse.core.runtime.adaptor.EclipseStarter.run(EclipseStarter.java:179) 
at org.eclipse.equinox.launcher.Main.invokeFramework(Main.java:549) 
at org.eclipse.equinox.launcher.Main.basicRun(Main.java:504) 
at org.eclipse.equinox.launcher.Main.run(Main.java:1236) 
at org.eclipse.equinox.launcher.Main.main(Main.java:1212)
Test:  testAddRemoveWeavingFetchGroups
Class:  JptEclipseLinkCoreTests
java.lang.RuntimeException: missing Java system property: "org.eclipse.jpt.jpa.jar" 
at org.eclipse.jpt.core.tests.internal.projects.TestJpaProject.jarName(TestJpaProject.java:65) 
at org.eclipse.jpt.core.tests.internal.projects.TestJpaProject.<init>(TestJpaProject.java:57) 
at org.eclipse.jpt.core.tests.internal.projects.TestJpaProject.buildJpaProject(TestJpaProject.java:35) 
at org.eclipse.jpt.core.tests.internal.context.ContextModelTestCase.buildJpaProject(ContextModelTestCase.java:90) 
at org.eclipse.jpt.core.tests.internal.context.ContextModelTestCase.buildJavaProject(ContextModelTestCase.java:85) 
at org.eclipse.jpt.core.tests.internal.utility.jdt.AnnotationTestCase.setUp(AnnotationTestCase.java:76) 
at org.eclipse.jpt.core.tests.internal.context.ContextModelTestCase.setUp(ContextModelTestCase.java:57) 
at org.eclipse.jpt.eclipselink.core.tests.internal.PersistenceUnitTestCase.setUp(PersistenceUnitTestCase.java:54) 
at org.eclipse.jpt.eclipselink.core.tests.internal.customization.CustomizationAdapterTests.setUp(CustomizationAdapterTests.java:75) 
at org.eclipse.test.EclipseTestRunner.run(EclipseTestRunner.java:354) 
at org.eclipse.test.EclipseTestRunner.run(EclipseTestRunner.java:206) 
at org.eclipse.test.CoreTestApplication.runTests(CoreTestApplication.java:35) 
at org.eclipse.test.CoreTestApplication.run(CoreTestApplication.java:31) 
at org.eclipse.equinox.internal.app.EclipseAppContainer.callMethodWithException(EclipseAppContainer.java:574) 
at org.eclipse.equinox.internal.app.EclipseAppHandle.run(EclipseAppHandle.java:195) 
at org.eclipse.core.runtime.internal.adaptor.EclipseAppLauncher.runApplication(EclipseAppLauncher.java:110) 
at org.eclipse.core.runtime.internal.adaptor.EclipseAppLauncher.start(EclipseAppLauncher.java:79) 
at org.eclipse.core.runtime.adaptor.EclipseStarter.run(EclipseStarter.java:382) 
at org.eclipse.core.runtime.adaptor.EclipseStarter.run(EclipseStarter.java:179) 
at org.eclipse.equinox.launcher.Main.invokeFramework(Main.java:549) 
at org.eclipse.equinox.launcher.Main.basicRun(Main.java:504) 
at org.eclipse.equinox.launcher.Main.run(Main.java:1236) 
at org.eclipse.equinox.launcher.Main.main(Main.java:1212)
Test:  testSetSessionCustomizer
Class:  JptEclipseLinkCoreTests
java.lang.RuntimeException: missing Java system property: "org.eclipse.jpt.jpa.jar" 
at org.eclipse.jpt.core.tests.internal.projects.TestJpaProject.jarName(TestJpaProject.java:65) 
at org.eclipse.jpt.core.tests.internal.projects.TestJpaProject.<init>(TestJpaProject.java:57) 
at org.eclipse.jpt.core.tests.internal.projects.TestJpaProject.buildJpaProject(TestJpaProject.java:35) 
at org.eclipse.jpt.core.tests.internal.context.ContextModelTestCase.buildJpaProject(ContextModelTestCase.java:90) 
at org.eclipse.jpt.core.tests.internal.context.ContextModelTestCase.buildJavaProject(ContextModelTestCase.java:85) 
at org.eclipse.jpt.core.tests.internal.utility.jdt.AnnotationTestCase.setUp(AnnotationTestCase.java:76) 
at org.eclipse.jpt.core.tests.internal.context.ContextModelTestCase.setUp(ContextModelTestCase.java:57) 
at org.eclipse.jpt.eclipselink.core.tests.internal.PersistenceUnitTestCase.setUp(PersistenceUnitTestCase.java:54) 
at org.eclipse.jpt.eclipselink.core.tests.internal.customization.CustomizationAdapterTests.setUp(CustomizationAdapterTests.java:75) 
at org.eclipse.test.EclipseTestRunner.run(EclipseTestRunner.java:354) 
at org.eclipse.test.EclipseTestRunner.run(EclipseTestRunner.java:206) 
at org.eclipse.test.CoreTestApplication.runTests(CoreTestApplication.java:35) 
at org.eclipse.test.CoreTestApplication.run(CoreTestApplication.java:31) 
at org.eclipse.equinox.internal.app.EclipseAppContainer.callMethodWithException(EclipseAppContainer.java:574) 
at org.eclipse.equinox.internal.app.EclipseAppHandle.run(EclipseAppHandle.java:195) 
at org.eclipse.core.runtime.internal.adaptor.EclipseAppLauncher.runApplication(EclipseAppLauncher.java:110) 
at org.eclipse.core.runtime.internal.adaptor.EclipseAppLauncher.start(EclipseAppLauncher.java:79) 
at org.eclipse.core.runtime.adaptor.EclipseStarter.run(EclipseStarter.java:382) 
at org.eclipse.core.runtime.adaptor.EclipseStarter.run(EclipseStarter.java:179) 
at org.eclipse.equinox.launcher.Main.invokeFramework(Main.java:549) 
at org.eclipse.equinox.launcher.Main.basicRun(Main.java:504) 
at org.eclipse.equinox.launcher.Main.run(Main.java:1236) 
at org.eclipse.equinox.launcher.Main.main(Main.java:1212)
Test:  testAddRemoveSessionCustomizer
Class:  JptEclipseLinkCoreTests
java.lang.RuntimeException: missing Java system property: "org.eclipse.jpt.jpa.jar" 
at org.eclipse.jpt.core.tests.internal.projects.TestJpaProject.jarName(TestJpaProject.java:65) 
at org.eclipse.jpt.core.tests.internal.projects.TestJpaProject.<init>(TestJpaProject.java:57) 
at org.eclipse.jpt.core.tests.internal.projects.TestJpaProject.buildJpaProject(TestJpaProject.java:35) 
at org.eclipse.jpt.core.tests.internal.context.ContextModelTestCase.buildJpaProject(ContextModelTestCase.java:90) 
at org.eclipse.jpt.core.tests.internal.context.ContextModelTestCase.buildJavaProject(ContextModelTestCase.java:85) 
at org.eclipse.jpt.core.tests.internal.utility.jdt.AnnotationTestCase.setUp(AnnotationTestCase.java:76) 
at org.eclipse.jpt.core.tests.internal.context.ContextModelTestCase.setUp(ContextModelTestCase.java:57) 
at org.eclipse.jpt.eclipselink.core.tests.internal.PersistenceUnitTestCase.setUp(PersistenceUnitTestCase.java:54) 
at org.eclipse.jpt.eclipselink.core.tests.internal.customization.CustomizationAdapterTests.setUp(CustomizationAdapterTests.java:75) 
at org.eclipse.test.EclipseTestRunner.run(EclipseTestRunner.java:354) 
at org.eclipse.test.EclipseTestRunner.run(EclipseTestRunner.java:206) 
at org.eclipse.test.CoreTestApplication.runTests(CoreTestApplication.java:35) 
at org.eclipse.test.CoreTestApplication.run(CoreTestApplication.java:31) 
at org.eclipse.equinox.internal.app.EclipseAppContainer.callMethodWithException(EclipseAppContainer.java:574) 
at org.eclipse.equinox.internal.app.EclipseAppHandle.run(EclipseAppHandle.java:195) 
at org.eclipse.core.runtime.internal.adaptor.EclipseAppLauncher.runApplication(EclipseAppLauncher.java:110) 
at org.eclipse.core.runtime.internal.adaptor.EclipseAppLauncher.start(EclipseAppLauncher.java:79) 
at org.eclipse.core.runtime.adaptor.EclipseStarter.run(EclipseStarter.java:382) 
at org.eclipse.core.runtime.adaptor.EclipseStarter.run(EclipseStarter.java:179) 
at org.eclipse.equinox.launcher.Main.invokeFramework(Main.java:549) 
at org.eclipse.equinox.launcher.Main.basicRun(Main.java:504) 
at org.eclipse.equinox.launcher.Main.run(Main.java:1236) 
at org.eclipse.equinox.launcher.Main.main(Main.java:1212)
Test:  testSetWeaving
Class:  JptEclipseLinkCoreTests
java.lang.RuntimeException: missing Java system property: "org.eclipse.jpt.jpa.jar" 
at org.eclipse.jpt.core.tests.internal.projects.TestJpaProject.jarName(TestJpaProject.java:65) 
at org.eclipse.jpt.core.tests.internal.projects.TestJpaProject.<init>(TestJpaProject.java:57) 
at org.eclipse.jpt.core.tests.internal.projects.TestJpaProject.buildJpaProject(TestJpaProject.java:35) 
at org.eclipse.jpt.core.tests.internal.context.ContextModelTestCase.buildJpaProject(ContextModelTestCase.java:90) 
at org.eclipse.jpt.core.tests.internal.context.ContextModelTestCase.buildJavaProject(ContextModelTestCase.java:85) 
at org.eclipse.jpt.core.tests.internal.utility.jdt.AnnotationTestCase.setUp(AnnotationTestCase.java:76) 
at org.eclipse.jpt.core.tests.internal.context.ContextModelTestCase.setUp(ContextModelTestCase.java:57) 
at org.eclipse.jpt.eclipselink.core.tests.internal.PersistenceUnitTestCase.setUp(PersistenceUnitTestCase.java:54) 
at org.eclipse.jpt.eclipselink.core.tests.internal.customization.CustomizationAdapterTests.setUp(CustomizationAdapterTests.java:75) 
at org.eclipse.test.EclipseTestRunner.run(EclipseTestRunner.java:354) 
at org.eclipse.test.EclipseTestRunner.run(EclipseTestRunner.java:206) 
at org.eclipse.test.CoreTestApplication.runTests(CoreTestApplication.java:35) 
at org.eclipse.test.CoreTestApplication.run(CoreTestApplication.java:31) 
at org.eclipse.equinox.internal.app.EclipseAppContainer.callMethodWithException(EclipseAppContainer.java:574) 
at org.eclipse.equinox.internal.app.EclipseAppHandle.run(EclipseAppHandle.java:195) 
at org.eclipse.core.runtime.internal.adaptor.EclipseAppLauncher.runApplication(EclipseAppLauncher.java:110) 
at org.eclipse.core.runtime.internal.adaptor.EclipseAppLauncher.start(EclipseAppLauncher.java:79) 
at org.eclipse.core.runtime.adaptor.EclipseStarter.run(EclipseStarter.java:382) 
at org.eclipse.core.runtime.adaptor.EclipseStarter.run(EclipseStarter.java:179) 
at org.eclipse.equinox.launcher.Main.invokeFramework(Main.java:549) 
at org.eclipse.equinox.launcher.Main.basicRun(Main.java:504) 
at org.eclipse.equinox.launcher.Main.run(Main.java:1236) 
at org.eclipse.equinox.launcher.Main.main(Main.java:1212)
Test:  testAddRemoveWeaving
Class:  JptEclipseLinkCoreTests
java.lang.RuntimeException: missing Java system property: "org.eclipse.jpt.jpa.jar" 
at org.eclipse.jpt.core.tests.internal.projects.TestJpaProject.jarName(TestJpaProject.java:65) 
at org.eclipse.jpt.core.tests.internal.projects.TestJpaProject.<init>(TestJpaProject.java:57) 
at org.eclipse.jpt.core.tests.internal.projects.TestJpaProject.buildJpaProject(TestJpaProject.java:35) 
at org.eclipse.jpt.core.tests.internal.context.ContextModelTestCase.buildJpaProject(ContextModelTestCase.java:90) 
at org.eclipse.jpt.core.tests.internal.context.ContextModelTestCase.buildJavaProject(ContextModelTestCase.java:85) 
at org.eclipse.jpt.core.tests.internal.utility.jdt.AnnotationTestCase.setUp(AnnotationTestCase.java:76) 
at org.eclipse.jpt.core.tests.internal.context.ContextModelTestCase.setUp(ContextModelTestCase.java:57) 
at org.eclipse.jpt.eclipselink.core.tests.internal.PersistenceUnitTestCase.setUp(PersistenceUnitTestCase.java:54) 
at org.eclipse.jpt.eclipselink.core.tests.internal.customization.CustomizationAdapterTests.setUp(CustomizationAdapterTests.java:75) 
at org.eclipse.test.EclipseTestRunner.run(EclipseTestRunner.java:354) 
at org.eclipse.test.EclipseTestRunner.run(EclipseTestRunner.java:206) 
at org.eclipse.test.CoreTestApplication.runTests(CoreTestApplication.java:35) 
at org.eclipse.test.CoreTestApplication.run(CoreTestApplication.java:31) 
at org.eclipse.equinox.internal.app.EclipseAppContainer.callMethodWithException(EclipseAppContainer.java:574) 
at org.eclipse.equinox.internal.app.EclipseAppHandle.run(EclipseAppHandle.java:195) 
at org.eclipse.core.runtime.internal.adaptor.EclipseAppLauncher.runApplication(EclipseAppLauncher.java:110) 
at org.eclipse.core.runtime.internal.adaptor.EclipseAppLauncher.start(EclipseAppLauncher.java:79) 
at org.eclipse.core.runtime.adaptor.EclipseStarter.run(EclipseStarter.java:382) 
at org.eclipse.core.runtime.adaptor.EclipseStarter.run(EclipseStarter.java:179) 
at org.eclipse.equinox.launcher.Main.invokeFramework(Main.java:549) 
at org.eclipse.equinox.launcher.Main.basicRun(Main.java:504) 
at org.eclipse.equinox.launcher.Main.run(Main.java:1236) 
at org.eclipse.equinox.launcher.Main.main(Main.java:1212)
Test:  testSetCustomization
Class:  JptEclipseLinkCoreTests
java.lang.RuntimeException: missing Java system property: "org.eclipse.jpt.jpa.jar" 
at org.eclipse.jpt.core.tests.internal.projects.TestJpaProject.jarName(TestJpaProject.java:65) 
at org.eclipse.jpt.core.tests.internal.projects.TestJpaProject.<init>(TestJpaProject.java:57) 
at org.eclipse.jpt.core.tests.internal.projects.TestJpaProject.buildJpaProject(TestJpaProject.java:35) 
at org.eclipse.jpt.core.tests.internal.context.ContextModelTestCase.buildJpaProject(ContextModelTestCase.java:90) 
at org.eclipse.jpt.core.tests.internal.context.ContextModelTestCase.buildJavaProject(ContextModelTestCase.java:85) 
at org.eclipse.jpt.core.tests.internal.utility.jdt.AnnotationTestCase.setUp(AnnotationTestCase.java:76) 
at org.eclipse.jpt.core.tests.internal.context.ContextModelTestCase.setUp(ContextModelTestCase.java:57) 
at org.eclipse.jpt.eclipselink.core.tests.internal.PersistenceUnitTestCase.setUp(PersistenceUnitTestCase.java:54) 
at org.eclipse.jpt.eclipselink.core.tests.internal.customization.CustomizationAdapterTests.setUp(CustomizationAdapterTests.java:75) 
at org.eclipse.test.EclipseTestRunner.run(EclipseTestRunner.java:354) 
at org.eclipse.test.EclipseTestRunner.run(EclipseTestRunner.java:206) 
at org.eclipse.test.CoreTestApplication.runTests(CoreTestApplication.java:35) 
at org.eclipse.test.CoreTestApplication.run(CoreTestApplication.java:31) 
at org.eclipse.equinox.internal.app.EclipseAppContainer.callMethodWithException(EclipseAppContainer.java:574) 
at org.eclipse.equinox.internal.app.EclipseAppHandle.run(EclipseAppHandle.java:195) 
at org.eclipse.core.runtime.internal.adaptor.EclipseAppLauncher.runApplication(EclipseAppLauncher.java:110) 
at org.eclipse.core.runtime.internal.adaptor.EclipseAppLauncher.start(EclipseAppLauncher.java:79) 
at org.eclipse.core.runtime.adaptor.EclipseStarter.run(EclipseStarter.java:382) 
at org.eclipse.core.runtime.adaptor.EclipseStarter.run(EclipseStarter.java:179) 
at org.eclipse.equinox.launcher.Main.invokeFramework(Main.java:549) 
at org.eclipse.equinox.launcher.Main.basicRun(Main.java:504) 
at org.eclipse.equinox.launcher.Main.run(Main.java:1236) 
at org.eclipse.equinox.launcher.Main.main(Main.java:1212)
Test:  testAddRemoveCustomization
Class:  JptEclipseLinkCoreTests
java.lang.RuntimeException: missing Java system property: "org.eclipse.jpt.jpa.jar" 
at org.eclipse.jpt.core.tests.internal.projects.TestJpaProject.jarName(TestJpaProject.java:65) 
at org.eclipse.jpt.core.tests.internal.projects.TestJpaProject.<init>(TestJpaProject.java:57) 
at org.eclipse.jpt.core.tests.internal.projects.TestJpaProject.buildJpaProject(TestJpaProject.java:35) 
at org.eclipse.jpt.core.tests.internal.context.ContextModelTestCase.buildJpaProject(ContextModelTestCase.java:90) 
at org.eclipse.jpt.core.tests.internal.context.ContextModelTestCase.buildJavaProject(ContextModelTestCase.java:85) 
at org.eclipse.jpt.core.tests.internal.utility.jdt.AnnotationTestCase.setUp(AnnotationTestCase.java:76) 
at org.eclipse.jpt.core.tests.internal.context.ContextModelTestCase.setUp(ContextModelTestCase.java:57) 
at org.eclipse.jpt.eclipselink.core.tests.internal.PersistenceUnitTestCase.setUp(PersistenceUnitTestCase.java:54) 
at org.eclipse.jpt.eclipselink.core.tests.internal.customization.CustomizationAdapterTests.setUp(CustomizationAdapterTests.java:75) 
at org.eclipse.test.EclipseTestRunner.run(EclipseTestRunner.java:354) 
at org.eclipse.test.EclipseTestRunner.run(EclipseTestRunner.java:206) 
at org.eclipse.test.CoreTestApplication.runTests(CoreTestApplication.java:35) 
at org.eclipse.test.CoreTestApplication.run(CoreTestApplication.java:31) 
at org.eclipse.equinox.internal.app.EclipseAppContainer.callMethodWithException(EclipseAppContainer.java:574) 
at org.eclipse.equinox.internal.app.EclipseAppHandle.run(EclipseAppHandle.java:195) 
at org.eclipse.core.runtime.internal.adaptor.EclipseAppLauncher.runApplication(EclipseAppLauncher.java:110) 
at org.eclipse.core.runtime.internal.adaptor.EclipseAppLauncher.start(EclipseAppLauncher.java:79) 
at org.eclipse.core.runtime.adaptor.EclipseStarter.run(EclipseStarter.java:382) 
at org.eclipse.core.runtime.adaptor.EclipseStarter.run(EclipseStarter.java:179) 
at org.eclipse.equinox.launcher.Main.invokeFramework(Main.java:549) 
at org.eclipse.equinox.launcher.Main.basicRun(Main.java:504) 
at org.eclipse.equinox.launcher.Main.run(Main.java:1236) 
at org.eclipse.equinox.launcher.Main.main(Main.java:1212)
Test:  testHasListeners
Class:  JptEclipseLinkCoreTests
java.lang.RuntimeException: missing Java system property: "org.eclipse.jpt.jpa.jar" 
at org.eclipse.jpt.core.tests.internal.projects.TestJpaProject.jarName(TestJpaProject.java:65) 
at org.eclipse.jpt.core.tests.internal.projects.TestJpaProject.<init>(TestJpaProject.java:57) 
at org.eclipse.jpt.core.tests.internal.projects.TestJpaProject.buildJpaProject(TestJpaProject.java:35) 
at org.eclipse.jpt.core.tests.internal.context.ContextModelTestCase.buildJpaProject(ContextModelTestCase.java:90) 
at org.eclipse.jpt.core.tests.internal.context.ContextModelTestCase.buildJavaProject(ContextModelTestCase.java:85) 
at org.eclipse.jpt.core.tests.internal.utility.jdt.AnnotationTestCase.setUp(AnnotationTestCase.java:76) 
at org.eclipse.jpt.core.tests.internal.context.ContextModelTestCase.setUp(ContextModelTestCase.java:57) 
at org.eclipse.jpt.eclipselink.core.tests.internal.PersistenceUnitTestCase.setUp(PersistenceUnitTestCase.java:54) 
at org.eclipse.jpt.eclipselink.core.tests.internal.caching.CachingValueModelTests.setUp(CachingValueModelTests.java:60) 
at org.eclipse.test.EclipseTestRunner.run(EclipseTestRunner.java:354) 
at org.eclipse.test.EclipseTestRunner.run(EclipseTestRunner.java:206) 
at org.eclipse.test.CoreTestApplication.runTests(CoreTestApplication.java:35) 
at org.eclipse.test.CoreTestApplication.run(CoreTestApplication.java:31) 
at org.eclipse.equinox.internal.app.EclipseAppContainer.callMethodWithException(EclipseAppContainer.java:574) 
at org.eclipse.equinox.internal.app.EclipseAppHandle.run(EclipseAppHandle.java:195) 
at org.eclipse.core.runtime.internal.adaptor.EclipseAppLauncher.runApplication(EclipseAppLauncher.java:110) 
at org.eclipse.core.runtime.internal.adaptor.EclipseAppLauncher.start(EclipseAppLauncher.java:79) 
at org.eclipse.core.runtime.adaptor.EclipseStarter.run(EclipseStarter.java:382) 
at org.eclipse.core.runtime.adaptor.EclipseStarter.run(EclipseStarter.java:179) 
at org.eclipse.equinox.launcher.Main.invokeFramework(Main.java:549) 
at org.eclipse.equinox.launcher.Main.basicRun(Main.java:504) 
at org.eclipse.equinox.launcher.Main.run(Main.java:1236) 
at org.eclipse.equinox.launcher.Main.main(Main.java:1212)
Test:  testValue
Class:  JptEclipseLinkCoreTests
java.lang.RuntimeException: missing Java system property: "org.eclipse.jpt.jpa.jar" 
at org.eclipse.jpt.core.tests.internal.projects.TestJpaProject.jarName(TestJpaProject.java:65) 
at org.eclipse.jpt.core.tests.internal.projects.TestJpaProject.<init>(TestJpaProject.java:57) 
at org.eclipse.jpt.core.tests.internal.projects.TestJpaProject.buildJpaProject(TestJpaProject.java:35) 
at org.eclipse.jpt.core.tests.internal.context.ContextModelTestCase.buildJpaProject(ContextModelTestCase.java:90) 
at org.eclipse.jpt.core.tests.internal.context.ContextModelTestCase.buildJavaProject(ContextModelTestCase.java:85) 
at org.eclipse.jpt.core.tests.internal.utility.jdt.AnnotationTestCase.setUp(AnnotationTestCase.java:76) 
at org.eclipse.jpt.core.tests.internal.context.ContextModelTestCase.setUp(ContextModelTestCase.java:57) 
at org.eclipse.jpt.eclipselink.core.tests.internal.PersistenceUnitTestCase.setUp(PersistenceUnitTestCase.java:54) 
at org.eclipse.jpt.eclipselink.core.tests.internal.caching.CachingValueModelTests.setUp(CachingValueModelTests.java:60) 
at org.eclipse.test.EclipseTestRunner.run(EclipseTestRunner.java:354) 
at org.eclipse.test.EclipseTestRunner.run(EclipseTestRunner.java:206) 
at org.eclipse.test.CoreTestApplication.runTests(CoreTestApplication.java:35) 
at org.eclipse.test.CoreTestApplication.run(CoreTestApplication.java:31) 
at org.eclipse.equinox.internal.app.EclipseAppContainer.callMethodWithException(EclipseAppContainer.java:574) 
at org.eclipse.equinox.internal.app.EclipseAppHandle.run(EclipseAppHandle.java:195) 
at org.eclipse.core.runtime.internal.adaptor.EclipseAppLauncher.runApplication(EclipseAppLauncher.java:110) 
at org.eclipse.core.runtime.internal.adaptor.EclipseAppLauncher.start(EclipseAppLauncher.java:79) 
at org.eclipse.core.runtime.adaptor.EclipseStarter.run(EclipseStarter.java:382) 
at org.eclipse.core.runtime.adaptor.EclipseStarter.run(EclipseStarter.java:179) 
at org.eclipse.equinox.launcher.Main.invokeFramework(Main.java:549) 
at org.eclipse.equinox.launcher.Main.basicRun(Main.java:504) 
at org.eclipse.equinox.launcher.Main.run(Main.java:1236) 
at org.eclipse.equinox.launcher.Main.main(Main.java:1212)
Test:  testSetValue
Class:  JptEclipseLinkCoreTests
java.lang.RuntimeException: missing Java system property: "org.eclipse.jpt.jpa.jar" 
at org.eclipse.jpt.core.tests.internal.projects.TestJpaProject.jarName(TestJpaProject.java:65) 
at org.eclipse.jpt.core.tests.internal.projects.TestJpaProject.<init>(TestJpaProject.java:57) 
at org.eclipse.jpt.core.tests.internal.projects.TestJpaProject.buildJpaProject(TestJpaProject.java:35) 
at org.eclipse.jpt.core.tests.internal.context.ContextModelTestCase.buildJpaProject(ContextModelTestCase.java:90) 
at org.eclipse.jpt.core.tests.internal.context.ContextModelTestCase.buildJavaProject(ContextModelTestCase.java:85) 
at org.eclipse.jpt.core.tests.internal.utility.jdt.AnnotationTestCase.setUp(AnnotationTestCase.java:76) 
at org.eclipse.jpt.core.tests.internal.context.ContextModelTestCase.setUp(ContextModelTestCase.java:57) 
at org.eclipse.jpt.eclipselink.core.tests.internal.PersistenceUnitTestCase.setUp(PersistenceUnitTestCase.java:54) 
at org.eclipse.jpt.eclipselink.core.tests.internal.caching.CachingValueModelTests.setUp(CachingValueModelTests.java:60) 
at org.eclipse.test.EclipseTestRunner.run(EclipseTestRunner.java:354) 
at org.eclipse.test.EclipseTestRunner.run(EclipseTestRunner.java:206) 
at org.eclipse.test.CoreTestApplication.runTests(CoreTestApplication.java:35) 
at org.eclipse.test.CoreTestApplication.run(CoreTestApplication.java:31) 
at org.eclipse.equinox.internal.app.EclipseAppContainer.callMethodWithException(EclipseAppContainer.java:574) 
at org.eclipse.equinox.internal.app.EclipseAppHandle.run(EclipseAppHandle.java:195) 
at org.eclipse.core.runtime.internal.adaptor.EclipseAppLauncher.runApplication(EclipseAppLauncher.java:110) 
at org.eclipse.core.runtime.internal.adaptor.EclipseAppLauncher.start(EclipseAppLauncher.java:79) 
at org.eclipse.core.runtime.adaptor.EclipseStarter.run(EclipseStarter.java:382) 
at org.eclipse.core.runtime.adaptor.EclipseStarter.run(EclipseStarter.java:179) 
at org.eclipse.equinox.launcher.Main.invokeFramework(Main.java:549) 
at org.eclipse.equinox.launcher.Main.basicRun(Main.java:504) 
at org.eclipse.equinox.launcher.Main.run(Main.java:1236) 
at org.eclipse.equinox.launcher.Main.main(Main.java:1212)
Test:  testSetNullValue
Class:  JptEclipseLinkCoreTests
java.lang.RuntimeException: missing Java system property: "org.eclipse.jpt.jpa.jar" 
at org.eclipse.jpt.core.tests.internal.projects.TestJpaProject.jarName(TestJpaProject.java:65) 
at org.eclipse.jpt.core.tests.internal.projects.TestJpaProject.<init>(TestJpaProject.java:57) 
at org.eclipse.jpt.core.tests.internal.projects.TestJpaProject.buildJpaProject(TestJpaProject.java:35) 
at org.eclipse.jpt.core.tests.internal.context.ContextModelTestCase.buildJpaProject(ContextModelTestCase.java:90) 
at org.eclipse.jpt.core.tests.internal.context.ContextModelTestCase.buildJavaProject(ContextModelTestCase.java:85) 
at org.eclipse.jpt.core.tests.internal.utility.jdt.AnnotationTestCase.setUp(AnnotationTestCase.java:76) 
at org.eclipse.jpt.core.tests.internal.context.ContextModelTestCase.setUp(ContextModelTestCase.java:57) 
at org.eclipse.jpt.eclipselink.core.tests.internal.PersistenceUnitTestCase.setUp(PersistenceUnitTestCase.java:54) 
at org.eclipse.jpt.eclipselink.core.tests.internal.caching.CachingValueModelTests.setUp(CachingValueModelTests.java:60) 
at org.eclipse.test.EclipseTestRunner.run(EclipseTestRunner.java:354) 
at org.eclipse.test.EclipseTestRunner.run(EclipseTestRunner.java:206) 
at org.eclipse.test.CoreTestApplication.runTests(CoreTestApplication.java:35) 
at org.eclipse.test.CoreTestApplication.run(CoreTestApplication.java:31) 
at org.eclipse.equinox.internal.app.EclipseAppContainer.callMethodWithException(EclipseAppContainer.java:574) 
at org.eclipse.equinox.internal.app.EclipseAppHandle.run(EclipseAppHandle.java:195) 
at org.eclipse.core.runtime.internal.adaptor.EclipseAppLauncher.runApplication(EclipseAppLauncher.java:110) 
at org.eclipse.core.runtime.internal.adaptor.EclipseAppLauncher.start(EclipseAppLauncher.java:79) 
at org.eclipse.core.runtime.adaptor.EclipseStarter.run(EclipseStarter.java:382) 
at org.eclipse.core.runtime.adaptor.EclipseStarter.run(EclipseStarter.java:179) 
at org.eclipse.equinox.launcher.Main.invokeFramework(Main.java:549) 
at org.eclipse.equinox.launcher.Main.basicRun(Main.java:504) 
at org.eclipse.equinox.launcher.Main.run(Main.java:1236) 
at org.eclipse.equinox.launcher.Main.main(Main.java:1212)
Test:  testEntitiesList
Class:  JptEclipseLinkCoreTests
java.lang.RuntimeException: missing Java system property: "org.eclipse.jpt.jpa.jar" 
at org.eclipse.jpt.core.tests.internal.projects.TestJpaProject.jarName(TestJpaProject.java:65) 
at org.eclipse.jpt.core.tests.internal.projects.TestJpaProject.<init>(TestJpaProject.java:57) 
at org.eclipse.jpt.core.tests.internal.projects.TestJpaProject.buildJpaProject(TestJpaProject.java:35) 
at org.eclipse.jpt.core.tests.internal.context.ContextModelTestCase.buildJpaProject(ContextModelTestCase.java:90) 
at org.eclipse.jpt.core.tests.internal.context.ContextModelTestCase.buildJavaProject(ContextModelTestCase.java:85) 
at org.eclipse.jpt.core.tests.internal.utility.jdt.AnnotationTestCase.setUp(AnnotationTestCase.java:76) 
at org.eclipse.jpt.core.tests.internal.context.ContextModelTestCase.setUp(ContextModelTestCase.java:57) 
at org.eclipse.jpt.eclipselink.core.tests.internal.PersistenceUnitTestCase.setUp(PersistenceUnitTestCase.java:54) 
at org.eclipse.jpt.eclipselink.core.tests.internal.caching.CachingAdapterTests.setUp(CachingAdapterTests.java:71) 
at org.eclipse.test.EclipseTestRunner.run(EclipseTestRunner.java:354) 
at org.eclipse.test.EclipseTestRunner.run(EclipseTestRunner.java:206) 
at org.eclipse.test.CoreTestApplication.runTests(CoreTestApplication.java:35) 
at org.eclipse.test.CoreTestApplication.run(CoreTestApplication.java:31) 
at org.eclipse.equinox.internal.app.EclipseAppContainer.callMethodWithException(EclipseAppContainer.java:574) 
at org.eclipse.equinox.internal.app.EclipseAppHandle.run(EclipseAppHandle.java:195) 
at org.eclipse.core.runtime.internal.adaptor.EclipseAppLauncher.runApplication(EclipseAppLauncher.java:110) 
at org.eclipse.core.runtime.internal.adaptor.EclipseAppLauncher.start(EclipseAppLauncher.java:79) 
at org.eclipse.core.runtime.adaptor.EclipseStarter.run(EclipseStarter.java:382) 
at org.eclipse.core.runtime.adaptor.EclipseStarter.run(EclipseStarter.java:179) 
at org.eclipse.equinox.launcher.Main.invokeFramework(Main.java:549) 
at org.eclipse.equinox.launcher.Main.basicRun(Main.java:504) 
at org.eclipse.equinox.launcher.Main.run(Main.java:1236) 
at org.eclipse.equinox.launcher.Main.main(Main.java:1212)
Test:  testHasListeners
Class:  JptEclipseLinkCoreTests
java.lang.RuntimeException: missing Java system property: "org.eclipse.jpt.jpa.jar" 
at org.eclipse.jpt.core.tests.internal.projects.TestJpaProject.jarName(TestJpaProject.java:65) 
at org.eclipse.jpt.core.tests.internal.projects.TestJpaProject.<init>(TestJpaProject.java:57) 
at org.eclipse.jpt.core.tests.internal.projects.TestJpaProject.buildJpaProject(TestJpaProject.java:35) 
at org.eclipse.jpt.core.tests.internal.context.ContextModelTestCase.buildJpaProject(ContextModelTestCase.java:90) 
at org.eclipse.jpt.core.tests.internal.context.ContextModelTestCase.buildJavaProject(ContextModelTestCase.java:85) 
at org.eclipse.jpt.core.tests.internal.utility.jdt.AnnotationTestCase.setUp(AnnotationTestCase.java:76) 
at org.eclipse.jpt.core.tests.internal.context.ContextModelTestCase.setUp(ContextModelTestCase.java:57) 
at org.eclipse.jpt.eclipselink.core.tests.internal.PersistenceUnitTestCase.setUp(PersistenceUnitTestCase.java:54) 
at org.eclipse.jpt.eclipselink.core.tests.internal.caching.CachingAdapterTests.setUp(CachingAdapterTests.java:71) 
at org.eclipse.test.EclipseTestRunner.run(EclipseTestRunner.java:354) 
at org.eclipse.test.EclipseTestRunner.run(EclipseTestRunner.java:206) 
at org.eclipse.test.CoreTestApplication.runTests(CoreTestApplication.java:35) 
at org.eclipse.test.CoreTestApplication.run(CoreTestApplication.java:31) 
at org.eclipse.equinox.internal.app.EclipseAppContainer.callMethodWithException(EclipseAppContainer.java:574) 
at org.eclipse.equinox.internal.app.EclipseAppHandle.run(EclipseAppHandle.java:195) 
at org.eclipse.core.runtime.internal.adaptor.EclipseAppLauncher.runApplication(EclipseAppLauncher.java:110) 
at org.eclipse.core.runtime.internal.adaptor.EclipseAppLauncher.start(EclipseAppLauncher.java:79) 
at org.eclipse.core.runtime.adaptor.EclipseStarter.run(EclipseStarter.java:382) 
at org.eclipse.core.runtime.adaptor.EclipseStarter.run(EclipseStarter.java:179) 
at org.eclipse.equinox.launcher.Main.invokeFramework(Main.java:549) 
at org.eclipse.equinox.launcher.Main.basicRun(Main.java:504) 
at org.eclipse.equinox.launcher.Main.run(Main.java:1236) 
at org.eclipse.equinox.launcher.Main.main(Main.java:1212)
Test:  testSetCacheTypeDefault
Class:  JptEclipseLinkCoreTests
java.lang.RuntimeException: missing Java system property: "org.eclipse.jpt.jpa.jar" 
at org.eclipse.jpt.core.tests.internal.projects.TestJpaProject.jarName(TestJpaProject.java:65) 
at org.eclipse.jpt.core.tests.internal.projects.TestJpaProject.<init>(TestJpaProject.java:57) 
at org.eclipse.jpt.core.tests.internal.projects.TestJpaProject.buildJpaProject(TestJpaProject.java:35) 
at org.eclipse.jpt.core.tests.internal.context.ContextModelTestCase.buildJpaProject(ContextModelTestCase.java:90) 
at org.eclipse.jpt.core.tests.internal.context.ContextModelTestCase.buildJavaProject(ContextModelTestCase.java:85) 
at org.eclipse.jpt.core.tests.internal.utility.jdt.AnnotationTestCase.setUp(AnnotationTestCase.java:76) 
at org.eclipse.jpt.core.tests.internal.context.ContextModelTestCase.setUp(ContextModelTestCase.java:57) 
at org.eclipse.jpt.eclipselink.core.tests.internal.PersistenceUnitTestCase.setUp(PersistenceUnitTestCase.java:54) 
at org.eclipse.jpt.eclipselink.core.tests.internal.caching.CachingAdapterTests.setUp(CachingAdapterTests.java:71) 
at org.eclipse.test.EclipseTestRunner.run(EclipseTestRunner.java:354) 
at org.eclipse.test.EclipseTestRunner.run(EclipseTestRunner.java:206) 
at org.eclipse.test.CoreTestApplication.runTests(CoreTestApplication.java:35) 
at org.eclipse.test.CoreTestApplication.run(CoreTestApplication.java:31) 
at org.eclipse.equinox.internal.app.EclipseAppContainer.callMethodWithException(EclipseAppContainer.java:574) 
at org.eclipse.equinox.internal.app.EclipseAppHandle.run(EclipseAppHandle.java:195) 
at org.eclipse.core.runtime.internal.adaptor.EclipseAppLauncher.runApplication(EclipseAppLauncher.java:110) 
at org.eclipse.core.runtime.internal.adaptor.EclipseAppLauncher.start(EclipseAppLauncher.java:79) 
at org.eclipse.core.runtime.adaptor.EclipseStarter.run(EclipseStarter.java:382) 
at org.eclipse.core.runtime.adaptor.EclipseStarter.run(EclipseStarter.java:179) 
at org.eclipse.equinox.launcher.Main.invokeFramework(Main.java:549) 
at org.eclipse.equinox.launcher.Main.basicRun(Main.java:504) 
at org.eclipse.equinox.launcher.Main.run(Main.java:1236) 
at org.eclipse.equinox.launcher.Main.main(Main.java:1212)
Test:  testAddRemoveCacheTypeDefault
Class:  JptEclipseLinkCoreTests
java.lang.RuntimeException: missing Java system property: "org.eclipse.jpt.jpa.jar" 
at org.eclipse.jpt.core.tests.internal.projects.TestJpaProject.jarName(TestJpaProject.java:65) 
at org.eclipse.jpt.core.tests.internal.projects.TestJpaProject.<init>(TestJpaProject.java:57) 
at org.eclipse.jpt.core.tests.internal.projects.TestJpaProject.buildJpaProject(TestJpaProject.java:35) 
at org.eclipse.jpt.core.tests.internal.context.ContextModelTestCase.buildJpaProject(ContextModelTestCase.java:90) 
at org.eclipse.jpt.core.tests.internal.context.ContextModelTestCase.buildJavaProject(ContextModelTestCase.java:85) 
at org.eclipse.jpt.core.tests.internal.utility.jdt.AnnotationTestCase.setUp(AnnotationTestCase.java:76) 
at org.eclipse.jpt.core.tests.internal.context.ContextModelTestCase.setUp(ContextModelTestCase.java:57) 
at org.eclipse.jpt.eclipselink.core.tests.internal.PersistenceUnitTestCase.setUp(PersistenceUnitTestCase.java:54) 
at org.eclipse.jpt.eclipselink.core.tests.internal.caching.CachingAdapterTests.setUp(CachingAdapterTests.java:71) 
at org.eclipse.test.EclipseTestRunner.run(EclipseTestRunner.java:354) 
at org.eclipse.test.EclipseTestRunner.run(EclipseTestRunner.java:206) 
at org.eclipse.test.CoreTestApplication.runTests(CoreTestApplication.java:35) 
at org.eclipse.test.CoreTestApplication.run(CoreTestApplication.java:31) 
at org.eclipse.equinox.internal.app.EclipseAppContainer.callMethodWithException(EclipseAppContainer.java:574) 
at org.eclipse.equinox.internal.app.EclipseAppHandle.run(EclipseAppHandle.java:195) 
at org.eclipse.core.runtime.internal.adaptor.EclipseAppLauncher.runApplication(EclipseAppLauncher.java:110) 
at org.eclipse.core.runtime.internal.adaptor.EclipseAppLauncher.start(EclipseAppLauncher.java:79) 
at org.eclipse.core.runtime.adaptor.EclipseStarter.run(EclipseStarter.java:382) 
at org.eclipse.core.runtime.adaptor.EclipseStarter.run(EclipseStarter.java:179) 
at org.eclipse.equinox.launcher.Main.invokeFramework(Main.java:549) 
at org.eclipse.equinox.launcher.Main.basicRun(Main.java:504) 
at org.eclipse.equinox.launcher.Main.run(Main.java:1236) 
at org.eclipse.equinox.launcher.Main.main(Main.java:1212)
Test:  testSetCacheSizeDefault
Class:  JptEclipseLinkCoreTests
java.lang.RuntimeException: missing Java system property: "org.eclipse.jpt.jpa.jar" 
at org.eclipse.jpt.core.tests.internal.projects.TestJpaProject.jarName(TestJpaProject.java:65) 
at org.eclipse.jpt.core.tests.internal.projects.TestJpaProject.<init>(TestJpaProject.java:57) 
at org.eclipse.jpt.core.tests.internal.projects.TestJpaProject.buildJpaProject(TestJpaProject.java:35) 
at org.eclipse.jpt.core.tests.internal.context.ContextModelTestCase.buildJpaProject(ContextModelTestCase.java:90) 
at org.eclipse.jpt.core.tests.internal.context.ContextModelTestCase.buildJavaProject(ContextModelTestCase.java:85) 
at org.eclipse.jpt.core.tests.internal.utility.jdt.AnnotationTestCase.setUp(AnnotationTestCase.java:76) 
at org.eclipse.jpt.core.tests.internal.context.ContextModelTestCase.setUp(ContextModelTestCase.java:57) 
at org.eclipse.jpt.eclipselink.core.tests.internal.PersistenceUnitTestCase.setUp(PersistenceUnitTestCase.java:54) 
at org.eclipse.jpt.eclipselink.core.tests.internal.caching.CachingAdapterTests.setUp(CachingAdapterTests.java:71) 
at org.eclipse.test.EclipseTestRunner.run(EclipseTestRunner.java:354) 
at org.eclipse.test.EclipseTestRunner.run(EclipseTestRunner.java:206) 
at org.eclipse.test.CoreTestApplication.runTests(CoreTestApplication.java:35) 
at org.eclipse.test.CoreTestApplication.run(CoreTestApplication.java:31) 
at org.eclipse.equinox.internal.app.EclipseAppContainer.callMethodWithException(EclipseAppContainer.java:574) 
at org.eclipse.equinox.internal.app.EclipseAppHandle.run(EclipseAppHandle.java:195) 
at org.eclipse.core.runtime.internal.adaptor.EclipseAppLauncher.runApplication(EclipseAppLauncher.java:110) 
at org.eclipse.core.runtime.internal.adaptor.EclipseAppLauncher.start(EclipseAppLauncher.java:79) 
at org.eclipse.core.runtime.adaptor.EclipseStarter.run(EclipseStarter.java:382) 
at org.eclipse.core.runtime.adaptor.EclipseStarter.run(EclipseStarter.java:179) 
at org.eclipse.equinox.launcher.Main.invokeFramework(Main.java:549) 
at org.eclipse.equinox.launcher.Main.basicRun(Main.java:504) 
at org.eclipse.equinox.launcher.Main.run(Main.java:1236) 
at org.eclipse.equinox.launcher.Main.main(Main.java:1212)
Test:  testAddRemoveCacheSizeDefault
Class:  JptEclipseLinkCoreTests
java.lang.RuntimeException: missing Java system property: "org.eclipse.jpt.jpa.jar" 
at org.eclipse.jpt.core.tests.internal.projects.TestJpaProject.jarName(TestJpaProject.java:65) 
at org.eclipse.jpt.core.tests.internal.projects.TestJpaProject.<init>(TestJpaProject.java:57) 
at org.eclipse.jpt.core.tests.internal.projects.TestJpaProject.buildJpaProject(TestJpaProject.java:35) 
at org.eclipse.jpt.core.tests.internal.context.ContextModelTestCase.buildJpaProject(ContextModelTestCase.java:90) 
at org.eclipse.jpt.core.tests.internal.context.ContextModelTestCase.buildJavaProject(ContextModelTestCase.java:85) 
at org.eclipse.jpt.core.tests.internal.utility.jdt.AnnotationTestCase.setUp(AnnotationTestCase.java:76) 
at org.eclipse.jpt.core.tests.internal.context.ContextModelTestCase.setUp(ContextModelTestCase.java:57) 
at org.eclipse.jpt.eclipselink.core.tests.internal.PersistenceUnitTestCase.setUp(PersistenceUnitTestCase.java:54) 
at org.eclipse.jpt.eclipselink.core.tests.internal.caching.CachingAdapterTests.setUp(CachingAdapterTests.java:71) 
at org.eclipse.test.EclipseTestRunner.run(EclipseTestRunner.java:354) 
at org.eclipse.test.EclipseTestRunner.run(EclipseTestRunner.java:206) 
at org.eclipse.test.CoreTestApplication.runTests(CoreTestApplication.java:35) 
at org.eclipse.test.CoreTestApplication.run(CoreTestApplication.java:31) 
at org.eclipse.equinox.internal.app.EclipseAppContainer.callMethodWithException(EclipseAppContainer.java:574) 
at org.eclipse.equinox.internal.app.EclipseAppHandle.run(EclipseAppHandle.java:195) 
at org.eclipse.core.runtime.internal.adaptor.EclipseAppLauncher.runApplication(EclipseAppLauncher.java:110) 
at org.eclipse.core.runtime.internal.adaptor.EclipseAppLauncher.start(EclipseAppLauncher.java:79) 
at org.eclipse.core.runtime.adaptor.EclipseStarter.run(EclipseStarter.java:382) 
at org.eclipse.core.runtime.adaptor.EclipseStarter.run(EclipseStarter.java:179) 
at org.eclipse.equinox.launcher.Main.invokeFramework(Main.java:549) 
at org.eclipse.equinox.launcher.Main.basicRun(Main.java:504) 
at org.eclipse.equinox.launcher.Main.run(Main.java:1236) 
at org.eclipse.equinox.launcher.Main.main(Main.java:1212)
Test:  testSetSharedCacheDefault
Class:  JptEclipseLinkCoreTests
java.lang.RuntimeException: missing Java system property: "org.eclipse.jpt.jpa.jar" 
at org.eclipse.jpt.core.tests.internal.projects.TestJpaProject.jarName(TestJpaProject.java:65) 
at org.eclipse.jpt.core.tests.internal.projects.TestJpaProject.<init>(TestJpaProject.java:57) 
at org.eclipse.jpt.core.tests.internal.projects.TestJpaProject.buildJpaProject(TestJpaProject.java:35) 
at org.eclipse.jpt.core.tests.internal.context.ContextModelTestCase.buildJpaProject(ContextModelTestCase.java:90) 
at org.eclipse.jpt.core.tests.internal.context.ContextModelTestCase.buildJavaProject(ContextModelTestCase.java:85) 
at org.eclipse.jpt.core.tests.internal.utility.jdt.AnnotationTestCase.setUp(AnnotationTestCase.java:76) 
at org.eclipse.jpt.core.tests.internal.context.ContextModelTestCase.setUp(ContextModelTestCase.java:57) 
at org.eclipse.jpt.eclipselink.core.tests.internal.PersistenceUnitTestCase.setUp(PersistenceUnitTestCase.java:54) 
at org.eclipse.jpt.eclipselink.core.tests.internal.caching.CachingAdapterTests.setUp(CachingAdapterTests.java:71) 
at org.eclipse.test.EclipseTestRunner.run(EclipseTestRunner.java:354) 
at org.eclipse.test.EclipseTestRunner.run(EclipseTestRunner.java:206) 
at org.eclipse.test.CoreTestApplication.runTests(CoreTestApplication.java:35) 
at org.eclipse.test.CoreTestApplication.run(CoreTestApplication.java:31) 
at org.eclipse.equinox.internal.app.EclipseAppContainer.callMethodWithException(EclipseAppContainer.java:574) 
at org.eclipse.equinox.internal.app.EclipseAppHandle.run(EclipseAppHandle.java:195) 
at org.eclipse.core.runtime.internal.adaptor.EclipseAppLauncher.runApplication(EclipseAppLauncher.java:110) 
at org.eclipse.core.runtime.internal.adaptor.EclipseAppLauncher.start(EclipseAppLauncher.java:79) 
at org.eclipse.core.runtime.adaptor.EclipseStarter.run(EclipseStarter.java:382) 
at org.eclipse.core.runtime.adaptor.EclipseStarter.run(EclipseStarter.java:179) 
at org.eclipse.equinox.launcher.Main.invokeFramework(Main.java:549)