[Date Prev][Date Next][Thread Prev][Thread Next][Date Index][Thread Index] [List Home]
[pdt-dev] Build failed in Hudson: cbi-pdt-2.2-helios #261

See <https://build.eclipse.org/hudson/job/cbi-pdt-2.2-helios/261/changes>

Changes:

[zzhongwei] Bug 268099	Built-in Task tags - wrong appearance in Tasks view

[rganor] *** empty log message ***

[zzhongwei] add NPE check

------------------------------------------
[...truncated 53731 lines...]
     [exec]      [echo] 
     [exec]      [echo] 	p2.director.input.repo.cleaned = <https://build.eclipse.org/hudson/job/cbi-pdt-2.2-helios/ws/build/RC1201005190642/eclipse/p2/org.eclipse.equinox.p2.engine/profileRegistry/SDKProfile.profile,file>:/home/data/httpd/download.eclipse.org/modeling//emf/updates/milestones/,file:/home/data/httpd/download.eclipse.org/webtools/milestones/,file:/home/data/httpd/download.eclipse.org/technology/dltk/updates-dev/2.0/,file:/home/data/httpd/download.eclipse.org/tools/gef/updates/milestones/,file:/home/data/httpd/download.eclipse.org/tools/orbit/downloads/drops/R20090825191606/updateSite,file:/home/data/httpd/download.eclipse.org/tools/mylyn/update/helios,file:/home/data/httpd/download.eclipse.org/modeling//emf/updates/milestones/,file:/home/data/httpd/download.eclipse.org/webtools/milestones/,file:/home/data/httpd/download.eclipse.org/technology/dltk/updates-dev/2.0/,file:/home/data/httpd/download.eclipse.org/tools/gef/updates/milestones/,file:/home/data/httpd/download.eclipse.org/tools/orbit/downloads/drops/R20090825191606/updateSite,file:/home/data/httpd/download.eclipse.org/tools/mylyn/update/helios
     [exec]      [echo] 	p2.director.destination        = <https://build.eclipse.org/hudson/job/cbi-pdt-2.2-helios/ws/build/RC1201005190642/testing/target/eclipse> 
     [exec] 
     [exec] -timestamp:
     [exec]      [echo] 06:59:07
     [exec]    [p2.dir] !SESSION 2010-05-19 06:59:09.049 -----------------------------------------------
     [exec]    [p2.dir] eclipse.buildId=I20100312-1448
     [exec]    [p2.dir] java.fullversion=J2RE 1.5.0 IBM J9 2.3 Linux ppc-32 j9vmxp3223-20071007 (JIT enabled)
     [exec]    [p2.dir] J9VM - 20071004_14218_bHdSMR
     [exec]    [p2.dir] JIT  - 20070820_1846ifx1_r8
     [exec]    [p2.dir] GC   - 200708_10
     [exec]    [p2.dir] BootLoader constants: OS=linux, ARCH=ppc, WS=gtk, NL=en_US
     [exec]    [p2.dir] Framework arguments:  -application org.eclipse.equinox.p2.director -flavor tooling -roaming -profile SDKProfile -installIU org.eclipse.wst.web_ui.feature.feature.group -installIU org.eclipse.dltk.core.feature.group -installIU org.eclipse.dltk.mylyn.feature.group -installIU org.eclipse.wst.xsl.feature.feature.group -installIU org.eclipse.dltk.core.index.feature.group -installIU org.eclipse.wst.common.fproj.feature.group -destination <https://build.eclipse.org/hudson/job/cbi-pdt-2.2-helios/ws/build/RC1201005190642/testing/target/eclipse> -bundlepool <https://build.eclipse.org/hudson/job/cbi-pdt-2.2-helios/ws/build/RC1201005190642/testing/target/eclipse> -metadataRepository <https://build.eclipse.org/hudson/job/cbi-pdt-2.2-helios/ws/build/RC1201005190642/eclipse/p2/org.eclipse.equinox.p2.engine/profileRegistry/SDKProfile.profile,file>:/home/data/httpd/download.eclipse.org/modeling//emf/updates/milestones/,file:/home/data/httpd/download.eclipse.org/webtools/milestones/,file:/home/data/httpd/download.eclipse.org/technology/dltk/updates-dev/2.0/,file:/home/data/httpd/download.eclipse.org/tools/gef/updates/milestones/,file:/home/data/httpd/download.eclipse.org/tools/orbit/downloads/drops/R20090825191606/updateSite,file:/home/data/httpd/download.eclipse.org/tools/mylyn/update/helios,file:/home/data/httpd/download.eclipse.org/modeling//emf/updates/milestones/,file:/home/data/httpd/download.eclipse.org/webtools/milestones/,file:/home/data/httpd/download.eclipse.org/technology/dltk/updates-dev/2.0/,file:/home/data/httpd/download.eclipse.org/tools/gef/updates/milestones/,file:/home/data/httpd/download.eclipse.org/tools/orbit/downloads/drops/R20090825191606/updateSite,file:/home/data/httpd/download.eclipse.org/tools/mylyn/update/helios,<https://build.eclipse.org/hudson/job/cbi-pdt-2.2-helios/ws/build/RC1201005190642/testing/target/eclipse/p2/org.eclipse.equinox.p2.engine/profileRegistry/SDKProfile.profile> -artifactRepository <https://build.eclipse.org/hudson/job/cbi-pdt-2.2-helios/ws/build/RC1201005190642/eclipse/p2/org.eclipse.equinox.p2.engine/profileRegistry/SDKProfile.profile,file>:/home/data/httpd/download.eclipse.org/modeling//emf/updates/milestones/,file:/home/data/httpd/download.eclipse.org/webtools/milestones/,file:/home/data/httpd/download.eclipse.org/technology/dltk/updates-dev/2.0/,file:/home/data/httpd/download.eclipse.org/tools/gef/updates/milestones/,file:/home/data/httpd/download.eclipse.org/tools/orbit/downloads/drops/R20090825191606/updateSite,file:/home/data/httpd/download.eclipse.org/tools/mylyn/update/helios,file:/home/data/httpd/download.eclipse.org/modeling//emf/updates/milestones/,file:/home/data/httpd/download.eclipse.org/webtools/milestones/,file:/home/data/httpd/download.eclipse.org/technology/dltk/updates-dev/2.0/,file:/home/data/httpd/download.eclipse.org/tools/gef/updates/milestones/,file:/home/data/httpd/download.eclipse.org/tools/orbit/downloads/drops/R20090825191606/updateSite,file:/home/data/httpd/download.eclipse.org/tools/mylyn/update/helios, -profileProperties org.eclipse.update.install.features=true
     [exec]    [p2.dir] Command-line arguments:  -application org.eclipse.equinox.p2.director -consoleLog -flavor tooling -roaming -profile SDKProfile -installIU org.eclipse.wst.web_ui.feature.feature.group -installIU org.eclipse.dltk.core.feature.group -installIU org.eclipse.dltk.mylyn.feature.group -installIU org.eclipse.wst.xsl.feature.feature.group -installIU org.eclipse.dltk.core.index.feature.group -installIU org.eclipse.wst.common.fproj.feature.group -destination <https://build.eclipse.org/hudson/job/cbi-pdt-2.2-helios/ws/build/RC1201005190642/testing/target/eclipse> -bundlepool <https://build.eclipse.org/hudson/job/cbi-pdt-2.2-helios/ws/build/RC1201005190642/testing/target/eclipse> -metadataRepository <https://build.eclipse.org/hudson/job/cbi-pdt-2.2-helios/ws/build/RC1201005190642/eclipse/p2/org.eclipse.equinox.p2.engine/profileRegistry/SDKProfile.profile,file>:/home/data/httpd/download.eclipse.org/modeling//emf/updates/milestones/,file:/home/data/httpd/download.eclipse.org/webtools/milestones/,file:/home/data/httpd/download.eclipse.org/technology/dltk/updates-dev/2.0/,file:/home/data/httpd/download.eclipse.org/tools/gef/updates/milestones/,file:/home/data/httpd/download.eclipse.org/tools/orbit/downloads/drops/R20090825191606/updateSite,file:/home/data/httpd/download.eclipse.org/tools/mylyn/update/helios,file:/home/data/httpd/download.eclipse.org/modeling//emf/updates/milestones/,file:/home/data/httpd/download.eclipse.org/webtools/milestones/,file:/home/data/httpd/download.eclipse.org/technology/dltk/updates-dev/2.0/,file:/home/data/httpd/download.eclipse.org/tools/gef/updates/milestones/,file:/home/data/httpd/download.eclipse.org/tools/orbit/downloads/drops/R20090825191606/updateSite,file:/home/data/httpd/download.eclipse.org/tools/mylyn/update/helios,<https://build.eclipse.org/hudson/job/cbi-pdt-2.2-helios/ws/build/RC1201005190642/testing/target/eclipse/p2/org.eclipse.equinox.p2.engine/profileRegistry/SDKProfile.profile> -artifactRepository <https://build.eclipse.org/hudson/job/cbi-pdt-2.2-helios/ws/build/RC1201005190642/eclipse/p2/org.eclipse.equinox.p2.engine/profileRegistry/SDKProfile.profile,file>:/home/data/httpd/download.eclipse.org/modeling//emf/updates/milestones/,file:/home/data/httpd/download.eclipse.org/webtools/milestones/,file:/home/data/httpd/download.eclipse.org/technology/dltk/updates-dev/2.0/,file:/home/data/httpd/download.eclipse.org/tools/gef/updates/milestones/,file:/home/data/httpd/download.eclipse.org/tools/orbit/downloads/drops/R20090825191606/updateSite,file:/home/data/httpd/download.eclipse.org/tools/mylyn/update/helios,file:/home/data/httpd/download.eclipse.org/modeling//emf/updates/milestones/,file:/home/data/httpd/download.eclipse.org/webtools/milestones/,file:/home/data/httpd/download.eclipse.org/technology/dltk/updates-dev/2.0/,file:/home/data/httpd/download.eclipse.org/tools/gef/updates/milestones/,file:/home/data/httpd/download.eclipse.org/tools/orbit/downloads/drops/R20090825191606/updateSite,file:/home/data/httpd/download.eclipse.org/tools/mylyn/update/helios, -profileProperties org.eclipse.update.install.features=true -os linux -ws gtk -arch ppc
     [exec]    [p2.dir] 
     [exec]    [p2.dir] !ENTRY org.eclipse.equinox.p2.artifact.repository 4 1000 2010-05-19 06:59:29.484
     [exec]    [p2.dir] !MESSAGE No repository found at <https://build.eclipse.org/hudson/job/cbi-pdt-2.2-helios/ws/build/RC1201005190642/eclipse/p2/org.eclipse.equinox.p2.engine/profileRegistry/SDKProfile.profile/.>
     [exec]    [p2.dir] Installing org.eclipse.wst.web_ui.feature.feature.group 3.2.0.v201004292000-7O7CFb3EMf6XlpNJSz0w3dFLmZJ3.
     [exec]    [p2.dir] Installing org.eclipse.dltk.core.feature.group 2.0.0.v20100518-1923-7L--EAAoOUVSNeCBbHpz0.
     [exec]    [p2.dir] Installing org.eclipse.dltk.mylyn.feature.group 1.0.0.v20100518-1923-2--7w3121162402154.
     [exec]    [p2.dir] Installing org.eclipse.wst.xsl.feature.feature.group 1.1.0.v201004290551-7S7WFAKFIpRz0voO9MFQ-p4_EWNN.
     [exec]    [p2.dir] Installing org.eclipse.dltk.core.index.feature.group 2.0.0.v20100518-1923-7708p9oA57D5N8G28_EA.
     [exec]    [p2.dir] Installing org.eclipse.wst.common.fproj.feature.group 3.2.0.v201004210642-377A78s73533B7L3935.
     [exec]    [p2.dir] Operation completed in 94301 ms.
     [exec]    [p2.dir] 
     [exec]    [p2.dir] !ENTRY org.eclipse.equinox.p2.engine 2 0 2010-05-19 07:01:05.311
     [exec]    [p2.dir] !MESSAGE Exception saving profile preferences
     [exec]    [p2.dir] !STACK 0
     [exec]    [p2.dir] java.lang.RuntimeException: Attempt to access stopped agent: org.eclipse.equinox.internal.p2.core.ProvisioningAgent@39ac39ac
     [exec]    [p2.dir] 	at org.eclipse.equinox.internal.p2.core.ProvisioningAgent.checkRunning(ProvisioningAgent.java:79)
     [exec]    [p2.dir] 	at org.eclipse.equinox.internal.p2.core.ProvisioningAgent.getService(ProvisioningAgent.java:45)
     [exec]    [p2.dir] 	at org.eclipse.equinox.internal.p2.engine.ProfilePreferences.doSave(ProfilePreferences.java:112)
     [exec]    [p2.dir] 	at org.eclipse.equinox.internal.p2.engine.ProfilePreferences$SaveJob.run(ProfilePreferences.java:49)
     [exec]    [p2.dir] 	at org.eclipse.core.internal.jobs.Worker.run(Worker.java:54)
     [exec]    [delete] Deleting directory <https://build.eclipse.org/hudson/job/cbi-pdt-2.2-helios/ws/build/RC1201005190642/eclipse/p2repoZipsTmp>
     [exec] 
     [exec] -timestamp:
     [exec]      [echo] 07:01:06
     [exec]      [echo] Install org.apache.commons.lang to <https://build.eclipse.org/hudson/job/cbi-pdt-2.2-helios/ws/build/RC1201005190642/eclipse>
     [exec] 
     [exec] run.director:
     [exec] 
     [exec] -timestamp:
     [exec]      [echo] 07:01:06
     [exec]     [mkdir] Created dir: <https://build.eclipse.org/hudson/job/cbi-pdt-2.2-helios/ws/build/RC1201005190642/eclipse/p2repoZipsTmp>
     [exec] Trying to override old definition of task resolvepath
     [exec] 
     [exec] get.PACK200_JAVA_HOME:
     [exec] Trying to override old definition of task resolvepath
     [exec] 
     [exec] get.baseoswsarch:
     [exec]      [echo] 
     [exec]      [echo] 	p2.director.input.repo.cleaned = <https://build.eclipse.org/hudson/job/cbi-pdt-2.2-helios/ws/build/RC1201005190642/eclipse/p2/org.eclipse.equinox.p2.engine/profileRegistry/SDKProfile.profile,file>:/home/data/httpd/download.eclipse.org/modeling//emf/updates/milestones/,file:/home/data/httpd/download.eclipse.org/webtools/milestones/,file:/home/data/httpd/download.eclipse.org/technology/dltk/updates-dev/2.0/,file:/home/data/httpd/download.eclipse.org/tools/gef/updates/milestones/,file:/home/data/httpd/download.eclipse.org/tools/orbit/downloads/drops/R20090825191606/updateSite,file:/home/data/httpd/download.eclipse.org/tools/mylyn/update/helios,file:/home/data/httpd/download.eclipse.org/modeling//emf/updates/milestones/,file:/home/data/httpd/download.eclipse.org/webtools/milestones/,file:/home/data/httpd/download.eclipse.org/technology/dltk/updates-dev/2.0/,file:/home/data/httpd/download.eclipse.org/tools/gef/updates/milestones/,file:/home/data/httpd/download.eclipse.org/tools/orbit/downloads/drops/R20090825191606/updateSite,file:/home/data/httpd/download.eclipse.org/tools/mylyn/update/helios
     [exec]      [echo] 	p2.director.destination        = <https://build.eclipse.org/hudson/job/cbi-pdt-2.2-helios/ws/build/RC1201005190642/testing/target/eclipse> 
     [exec] 
     [exec] -timestamp:
     [exec]      [echo] 07:01:06
     [exec]    [p2.dir] !SESSION 2010-05-19 07:01:09.003 -----------------------------------------------
     [exec]    [p2.dir] eclipse.buildId=I20100312-1448
     [exec]    [p2.dir] java.fullversion=J2RE 1.5.0 IBM J9 2.3 Linux ppc-32 j9vmxp3223-20071007 (JIT enabled)
     [exec]    [p2.dir] J9VM - 20071004_14218_bHdSMR
     [exec]    [p2.dir] JIT  - 20070820_1846ifx1_r8
     [exec]    [p2.dir] GC   - 200708_10
     [exec]    [p2.dir] BootLoader constants: OS=linux, ARCH=ppc, WS=gtk, NL=en_US
     [exec]    [p2.dir] Framework arguments:  -application org.eclipse.equinox.p2.director -flavor tooling -roaming -profile SDKProfile -installIU org.apache.commons.lang -destination <https://build.eclipse.org/hudson/job/cbi-pdt-2.2-helios/ws/build/RC1201005190642/testing/target/eclipse> -bundlepool <https://build.eclipse.org/hudson/job/cbi-pdt-2.2-helios/ws/build/RC1201005190642/testing/target/eclipse> -metadataRepository <https://build.eclipse.org/hudson/job/cbi-pdt-2.2-helios/ws/build/RC1201005190642/eclipse/p2/org.eclipse.equinox.p2.engine/profileRegistry/SDKProfile.profile,file>:/home/data/httpd/download.eclipse.org/modeling//emf/updates/milestones/,file:/home/data/httpd/download.eclipse.org/webtools/milestones/,file:/home/data/httpd/download.eclipse.org/technology/dltk/updates-dev/2.0/,file:/home/data/httpd/download.eclipse.org/tools/gef/updates/milestones/,file:/home/data/httpd/download.eclipse.org/tools/orbit/downloads/drops/R20090825191606/updateSite,file:/home/data/httpd/download.eclipse.org/tools/mylyn/update/helios,file:/home/data/httpd/download.eclipse.org/modeling//emf/updates/milestones/,file:/home/data/httpd/download.eclipse.org/webtools/milestones/,file:/home/data/httpd/download.eclipse.org/technology/dltk/updates-dev/2.0/,file:/home/data/httpd/download.eclipse.org/tools/gef/updates/milestones/,file:/home/data/httpd/download.eclipse.org/tools/orbit/downloads/drops/R20090825191606/updateSite,file:/home/data/httpd/download.eclipse.org/tools/mylyn/update/helios,<https://build.eclipse.org/hudson/job/cbi-pdt-2.2-helios/ws/build/RC1201005190642/testing/target/eclipse/p2/org.eclipse.equinox.p2.engine/profileRegistry/SDKProfile.profile> -artifactRepository <https://build.eclipse.org/hudson/job/cbi-pdt-2.2-helios/ws/build/RC1201005190642/eclipse/p2/org.eclipse.equinox.p2.engine/profileRegistry/SDKProfile.profile,file>:/home/data/httpd/download.eclipse.org/modeling//emf/updates/milestones/,file:/home/data/httpd/download.eclipse.org/webtools/milestones/,file:/home/data/httpd/download.eclipse.org/technology/dltk/updates-dev/2.0/,file:/home/data/httpd/download.eclipse.org/tools/gef/updates/milestones/,file:/home/data/httpd/download.eclipse.org/tools/orbit/downloads/drops/R20090825191606/updateSite,file:/home/data/httpd/download.eclipse.org/tools/mylyn/update/helios,file:/home/data/httpd/download.eclipse.org/modeling//emf/updates/milestones/,file:/home/data/httpd/download.eclipse.org/webtools/milestones/,file:/home/data/httpd/download.eclipse.org/technology/dltk/updates-dev/2.0/,file:/home/data/httpd/download.eclipse.org/tools/gef/updates/milestones/,file:/home/data/httpd/download.eclipse.org/tools/orbit/downloads/drops/R20090825191606/updateSite,file:/home/data/httpd/download.eclipse.org/tools/mylyn/update/helios, -profileProperties org.eclipse.update.install.features=true
     [exec]    [p2.dir] Command-line arguments:  -application org.eclipse.equinox.p2.director -consoleLog -flavor tooling -roaming -profile SDKProfile -installIU org.apache.commons.lang -destination <https://build.eclipse.org/hudson/job/cbi-pdt-2.2-helios/ws/build/RC1201005190642/testing/target/eclipse> -bundlepool <https://build.eclipse.org/hudson/job/cbi-pdt-2.2-helios/ws/build/RC1201005190642/testing/target/eclipse> -metadataRepository <https://build.eclipse.org/hudson/job/cbi-pdt-2.2-helios/ws/build/RC1201005190642/eclipse/p2/org.eclipse.equinox.p2.engine/profileRegistry/SDKProfile.profile,file>:/home/data/httpd/download.eclipse.org/modeling//emf/updates/milestones/,file:/home/data/httpd/download.eclipse.org/webtools/milestones/,file:/home/data/httpd/download.eclipse.org/technology/dltk/updates-dev/2.0/,file:/home/data/httpd/download.eclipse.org/tools/gef/updates/milestones/,file:/home/data/httpd/download.eclipse.org/tools/orbit/downloads/drops/R20090825191606/updateSite,file:/home/data/httpd/download.eclipse.org/tools/mylyn/update/helios,file:/home/data/httpd/download.eclipse.org/modeling//emf/updates/milestones/,file:/home/data/httpd/download.eclipse.org/webtools/milestones/,file:/home/data/httpd/download.eclipse.org/technology/dltk/updates-dev/2.0/,file:/home/data/httpd/download.eclipse.org/tools/gef/updates/milestones/,file:/home/data/httpd/download.eclipse.org/tools/orbit/downloads/drops/R20090825191606/updateSite,file:/home/data/httpd/download.eclipse.org/tools/mylyn/update/helios,<https://build.eclipse.org/hudson/job/cbi-pdt-2.2-helios/ws/build/RC1201005190642/testing/target/eclipse/p2/org.eclipse.equinox.p2.engine/profileRegistry/SDKProfile.profile> -artifactRepository <https://build.eclipse.org/hudson/job/cbi-pdt-2.2-helios/ws/build/RC1201005190642/eclipse/p2/org.eclipse.equinox.p2.engine/profileRegistry/SDKProfile.profile,file>:/home/data/httpd/download.eclipse.org/modeling//emf/updates/milestones/,file:/home/data/httpd/download.eclipse.org/webtools/milestones/,file:/home/data/httpd/download.eclipse.org/technology/dltk/updates-dev/2.0/,file:/home/data/httpd/download.eclipse.org/tools/gef/updates/milestones/,file:/home/data/httpd/download.eclipse.org/tools/orbit/downloads/drops/R20090825191606/updateSite,file:/home/data/httpd/download.eclipse.org/tools/mylyn/update/helios,file:/home/data/httpd/download.eclipse.org/modeling//emf/updates/milestones/,file:/home/data/httpd/download.eclipse.org/webtools/milestones/,file:/home/data/httpd/download.eclipse.org/technology/dltk/updates-dev/2.0/,file:/home/data/httpd/download.eclipse.org/tools/gef/updates/milestones/,file:/home/data/httpd/download.eclipse.org/tools/orbit/downloads/drops/R20090825191606/updateSite,file:/home/data/httpd/download.eclipse.org/tools/mylyn/update/helios, -profileProperties org.eclipse.update.install.features=true -os linux -ws gtk -arch ppc
     [exec]    [p2.dir] 
     [exec]    [p2.dir] !ENTRY org.eclipse.equinox.p2.artifact.repository 4 1000 2010-05-19 07:01:21.537
     [exec]    [p2.dir] !MESSAGE No repository found at <https://build.eclipse.org/hudson/job/cbi-pdt-2.2-helios/ws/build/RC1201005190642/eclipse/p2/org.eclipse.equinox.p2.engine/profileRegistry/SDKProfile.profile/.>
     [exec]    [p2.dir] Installing org.apache.commons.lang 2.4.0.v20081016-1030.
     [exec]    [p2.dir] Operation completed in 27213 ms.
     [exec]    [p2.dir] 
     [exec]    [p2.dir] !ENTRY org.eclipse.equinox.p2.engine 2 0 2010-05-19 07:01:49.843
     [exec]    [p2.dir] !MESSAGE Exception saving profile preferences
     [exec]    [p2.dir] !STACK 0
     [exec]    [p2.dir] java.lang.RuntimeException: Attempt to access stopped agent: org.eclipse.equinox.internal.p2.core.ProvisioningAgent@5c0e5c0e
     [exec]    [p2.dir] 	at org.eclipse.equinox.internal.p2.core.ProvisioningAgent.checkRunning(ProvisioningAgent.java:79)
     [exec]    [p2.dir] 	at org.eclipse.equinox.internal.p2.core.ProvisioningAgent.getService(ProvisioningAgent.java:45)
     [exec]    [p2.dir] 	at org.eclipse.equinox.internal.p2.engine.ProfilePreferences.doSave(ProfilePreferences.java:112)
     [exec]    [p2.dir] 	at org.eclipse.equinox.internal.p2.engine.ProfilePreferences$SaveJob.run(ProfilePreferences.java:49)
     [exec]    [p2.dir] 	at org.eclipse.core.internal.jobs.Worker.run(Worker.java:54)
     [exec]    [delete] Deleting directory <https://build.eclipse.org/hudson/job/cbi-pdt-2.2-helios/ws/build/RC1201005190642/eclipse/p2repoZipsTmp>
     [exec] 
     [exec] -timestamp:
     [exec]      [echo] 07:01:50
     [exec] 
     [exec] unpackBundle:
     [exec] 
     [exec] unzipFile:
     [exec]     [unzip] Expanding: <https://build.eclipse.org/hudson/job/cbi-pdt-2.2-helios/ws/build/downloads/dltk-core-Automated_Tests-S-2.0M6-201003160541.zip> into <https://build.eclipse.org/hudson/job/cbi-pdt-2.2-helios/ws/build/RC1201005190642/testing/target/eclipse/dropins/dltk-core-Automated_Tests-S-2.0M6-201003160541.zip_>
     [exec] 
     [exec] untarFile:
     [exec]      [echo] Install org.eclipse.php.all feature to <https://build.eclipse.org/hudson/job/cbi-pdt-2.2-helios/ws/build/RC1201005190642/testing/target>
     [exec] 
     [exec] run.director:
     [exec] 
     [exec] -timestamp:
     [exec]      [echo] 07:01:51
     [exec]     [mkdir] Created dir: <https://build.eclipse.org/hudson/job/cbi-pdt-2.2-helios/ws/build/RC1201005190642/eclipse/p2repoZipsTmp>
     [exec] Trying to override old definition of task resolvepath
     [exec] 
     [exec] get.PACK200_JAVA_HOME:
     [exec] Trying to override old definition of task resolvepath
     [exec] 
     [exec] get.baseoswsarch:
     [exec]      [echo] 
     [exec]      [echo] 	p2.director.input.repo.cleaned = jar:<https://build.eclipse.org/hudson/job/cbi-pdt-2.2-helios/ws/build/RC1201005190642/eclipse/RC1201005190642/pdt-Update-RC1201005190642.zip!/>
     [exec]      [echo] 	p2.director.destination        = <https://build.eclipse.org/hudson/job/cbi-pdt-2.2-helios/ws/build/RC1201005190642/testing/target/eclipse> 
     [exec] 
     [exec] -timestamp:
     [exec]      [echo] 07:01:51
     [exec]    [p2.dir] Installing org.eclipse.php.all.feature.group 2.2.0.v20100519-1400-53-7A51J1WES6MOWsOaXR7U7YYPM.
     [exec]    [p2.dir] Operation completed in 20737 ms.
     [exec]    [p2.dir] !SESSION 2010-05-19 07:01:53.168 -----------------------------------------------
     [exec]    [p2.dir] eclipse.buildId=I20100312-1448
     [exec]    [p2.dir] java.fullversion=J2RE 1.5.0 IBM J9 2.3 Linux ppc-32 j9vmxp3223-20071007 (JIT enabled)
     [exec]    [p2.dir] J9VM - 20071004_14218_bHdSMR
     [exec]    [p2.dir] JIT  - 20070820_1846ifx1_r8
     [exec]    [p2.dir] GC   - 200708_10
     [exec]    [p2.dir] BootLoader constants: OS=linux, ARCH=ppc, WS=gtk, NL=en_US
     [exec]    [p2.dir] Framework arguments:  -application org.eclipse.equinox.p2.director -flavor tooling -roaming -profile SDKProfile -installIU org.eclipse.php.all.feature.group -destination <https://build.eclipse.org/hudson/job/cbi-pdt-2.2-helios/ws/build/RC1201005190642/testing/target/eclipse> -bundlepool <https://build.eclipse.org/hudson/job/cbi-pdt-2.2-helios/ws/build/RC1201005190642/testing/target/eclipse> -metadataRepository jar:<https://build.eclipse.org/hudson/job/cbi-pdt-2.2-helios/ws/build/RC1201005190642/eclipse/RC1201005190642/pdt-Update-RC1201005190642.zip!/,file>:<https://build.eclipse.org/hudson/job/cbi-pdt-2.2-helios/ws/build/RC1201005190642/testing/target/eclipse/p2/org.eclipse.equinox.p2.engine/profileRegistry/SDKProfile.profile,file>:<https://build.eclipse.org/hudson/job/cbi-pdt-2.2-helios/ws/build/RC1201005190642/eclipse/p2/org.eclipse.equinox.p2.engine/profileRegistry/SDKProfile.profile> -artifactRepository jar:<https://build.eclipse.org/hudson/job/cbi-pdt-2.2-helios/ws/build/RC1201005190642/eclipse/RC1201005190642/pdt-Update-RC1201005190642.zip!/,> -profileProperties org.eclipse.update.install.features=true
     [exec]    [p2.dir] Command-line arguments:  -application org.eclipse.equinox.p2.director -consoleLog -flavor tooling -roaming -profile SDKProfile -installIU org.eclipse.php.all.feature.group -destination <https://build.eclipse.org/hudson/job/cbi-pdt-2.2-helios/ws/build/RC1201005190642/testing/target/eclipse> -bundlepool <https://build.eclipse.org/hudson/job/cbi-pdt-2.2-helios/ws/build/RC1201005190642/testing/target/eclipse> -metadataRepository jar:<https://build.eclipse.org/hudson/job/cbi-pdt-2.2-helios/ws/build/RC1201005190642/eclipse/RC1201005190642/pdt-Update-RC1201005190642.zip!/,file>:<https://build.eclipse.org/hudson/job/cbi-pdt-2.2-helios/ws/build/RC1201005190642/testing/target/eclipse/p2/org.eclipse.equinox.p2.engine/profileRegistry/SDKProfile.profile,file>:<https://build.eclipse.org/hudson/job/cbi-pdt-2.2-helios/ws/build/RC1201005190642/eclipse/p2/org.eclipse.equinox.p2.engine/profileRegistry/SDKProfile.profile> -artifactRepository jar:<https://build.eclipse.org/hudson/job/cbi-pdt-2.2-helios/ws/build/RC1201005190642/eclipse/RC1201005190642/pdt-Update-RC1201005190642.zip!/,> -profileProperties org.eclipse.update.install.features=true -os linux -ws gtk -arch ppc
     [exec]    [p2.dir] 
     [exec]    [p2.dir] !ENTRY org.eclipse.equinox.p2.engine 2 0 2010-05-19 07:02:32.803
     [exec]    [p2.dir] !MESSAGE Exception saving profile preferences
     [exec]    [p2.dir] !STACK 0
     [exec]    [p2.dir] java.lang.RuntimeException: Attempt to access stopped agent: org.eclipse.equinox.internal.p2.core.ProvisioningAgent@6b206b20
     [exec]    [p2.dir] 	at org.eclipse.equinox.internal.p2.core.ProvisioningAgent.checkRunning(ProvisioningAgent.java:79)
     [exec]    [p2.dir] 	at org.eclipse.equinox.internal.p2.core.ProvisioningAgent.getService(ProvisioningAgent.java:45)
     [exec]    [p2.dir] 	at org.eclipse.equinox.internal.p2.engine.ProfilePreferences.doSave(ProfilePreferences.java:112)
     [exec]    [p2.dir] 	at org.eclipse.equinox.internal.p2.engine.ProfilePreferences$SaveJob.run(ProfilePreferences.java:49)
     [exec]    [p2.dir] 	at org.eclipse.core.internal.jobs.Worker.run(Worker.java:54)
     [exec]    [delete] Deleting directory <https://build.eclipse.org/hudson/job/cbi-pdt-2.2-helios/ws/build/RC1201005190642/eclipse/p2repoZipsTmp>
     [exec] 
     [exec] -timestamp:
     [exec]      [echo] 07:02:35
     [exec] 
     [exec] expandTestFrameworkZip:
     [exec]      [echo] Unpack tests <https://build.eclipse.org/hudson/job/cbi-pdt-2.2-helios/ws/build/RC1201005190642/eclipse/RC1201005190642/pdt-Automated-Tests-RC1201005190642.zip> to <https://build.eclipse.org/hudson/job/cbi-pdt-2.2-helios/ws/build/RC1201005190642/testing/target/eclipse/dropins/pdt>
     [exec]     [unzip] Expanding: <https://build.eclipse.org/hudson/job/cbi-pdt-2.2-helios/ws/build/RC1201005190642/eclipse/RC1201005190642/pdt-Automated-Tests-RC1201005190642.zip> into <https://build.eclipse.org/hudson/job/cbi-pdt-2.2-helios/ws/build/RC1201005190642/testing/target/eclipse/dropins/pdt>
     [exec]     [unzip] Expanding: <https://build.eclipse.org/hudson/job/cbi-pdt-2.2-helios/ws/build/RC1201005190642/testing/target/eclipse/dropins/pdt/testing/pdt-junit-tests-RC1201005190642.zip> into <https://build.eclipse.org/hudson/job/cbi-pdt-2.2-helios/ws/build/RC1201005190642/testing/target/eclipse/dropins/pdt>
     [exec] 
     [exec] all:
     [exec]      [echo] testPluginDirRoot: <https://build.eclipse.org/hudson/job/cbi-pdt-2.2-helios/ws/build/RC1201005190642/testing/target/eclipse/dropins/pdt/eclipse/plugins>
     [exec]      [echo] testPluginName: org.eclipse.php.core.tests
     [exec]      [echo] Run <https://build.eclipse.org/hudson/job/cbi-pdt-2.2-helios/ws/build/RC1201005190642/testing/target/eclipse/dropins/pdt/eclipse/plugins/org.eclipse.php.core.tests_2.2.0.v20100519-1400/test.xml>:
     [exec] 
     [exec] init:
     [exec] 
     [exec] suite:
     [exec] 
     [exec] init:
     [exec]     [mkdir] Created dir: <https://build.eclipse.org/hudson/job/cbi-pdt-2.2-helios/ws/build/RC1201005190642/testing/target/eclipse/results>
     [exec] 
     [exec] core-test:
     [exec] 
     [exec] java-test:
     [exec]      [echo] Running org.eclipse.php.core.tests.AllTests. Result file: <https://build.eclipse.org/hudson/job/cbi-pdt-2.2-helios/ws/build/RC1201005190642/testing/target/eclipse/results/org.eclipse.php.core.tests.AllTests.xml.>
     [exec]      [echo] vmargs= -Xms40m -Xmx348m, extraVMargs=-Dorg.eclipse.swt.browser.XULRunnerPath=/shared/common/mozilla-xulrunner181-1.8.1.4-30.ppc, Xflags=-Xms256M -Xmx256M, Dflags=-Dosgi.bundlefile.limit=100
     [exec] FreeFontPath: FPE "/usr/X11R6/lib/X11/fonts/misc/" refcount is 2, should be 1; fixing.
     [exec] 19/05/2010 07:10:28 Xvnc version XF4VNC-4.4.0.0
     [exec] 19/05/2010 07:10:28 Copyright (C) 2001-2004 Alan Hourihane.
     [exec] 19/05/2010 07:10:28 Copyright (C) 2000-2004 Constantin Kaplinsky
     [exec] 19/05/2010 07:10:28 Copyright (C) 1999 AT&T Laboratories Cambridge
     [exec] 19/05/2010 07:10:28 All Rights Reserved.
     [exec] 19/05/2010 07:10:28 See http://www.tightvnc.com/ for information on TightVNC
     [exec] 19/05/2010 07:10:28 See http://xf4vnc.sf.net for xf4vnc-specific information
     [exec] 19/05/2010 07:10:28 Desktop name 'x11' (build:41)
     [exec] 19/05/2010 07:10:28 Protocol versions supported: 3.7, 3.3
     [exec] 19/05/2010 07:10:28 RGB format 8 8 8
     [exec] 19/05/2010 07:10:28 Listening for VNC connections on TCP port 5941
     [exec] Could not init font path element /usr/X11R6/lib/X11/fonts/TTF/, removing from list!
     [exec] Could not init font path element /usr/X11R6/lib/X11/fonts/CID/, removing from list!
     [exec] Could not init font path element /usr/X11R6/lib/X11/fonts/100dpi/, removing from list!
     [exec]      [java] Java Result: 2
     [exec] 
     [exec] collect-results:
     [exec]      [xslt] Transforming into <https://build.eclipse.org/hudson/job/cbi-pdt-2.2-helios/ws/build/RC1201005190642/testing/target/eclipse/results>
     [exec] 
     [exec] cleanup:
     [exec] 
     [exec] run:
     [exec] 
     [exec] collect:
     [exec]      [copy] Copying 1 file to <https://build.eclipse.org/hudson/job/cbi-pdt-2.2-helios/ws/build/RC1201005190642/testing/RC1201005190642/testing/results/xml>
     [exec] 
     [exec] genHtml:
     [exec]      [xslt] Transforming into <https://build.eclipse.org/hudson/job/cbi-pdt-2.2-helios/ws/build/RC1201005190642/testing/RC1201005190642/testing/results/html>
     [exec]      [xslt] Processing <https://build.eclipse.org/hudson/job/cbi-pdt-2.2-helios/ws/build/RC1201005190642/testing/RC1201005190642/testing/results/xml/org.eclipse.php.core.tests_linux.gtk.xml> to <https://build.eclipse.org/hudson/job/cbi-pdt-2.2-helios/ws/build/RC1201005190642/testing/RC1201005190642/testing/results/html/org.eclipse.php.core.tests_linux.gtk.html>
     [exec]      [xslt] Loading stylesheet <https://build.eclipse.org/hudson/job/cbi-pdt-2.2-helios/ws/build/RC1201005190642/testing/target/eclipse/dropins/pdt/eclipse/plugins/org.eclipse.test/JUNIT.XSL>
     [exec] 
     [exec] BUILD FAILED
     [exec] <https://build.eclipse.org/hudson/job/cbi-pdt-2.2-helios/ws/build/org.eclipse.dash.common.releng/builder/tests/test.xml>:612: The following error occurred while executing this line:
     [exec] <https://build.eclipse.org/hudson/job/cbi-pdt-2.2-helios/ws/build/org.eclipse.dash.common.releng/builder/tests/test.xml>:623: java.lang.StackOverflowError
     [exec] 
     [exec] Total time: 16 minutes 0 seconds
     [exec] [runtests] [07:14:41] Eclipse test run completed. 
     [exec] [runtests] Found test failure(s) in <https://build.eclipse.org/hudson/job/cbi-pdt-2.2-helios/ws/build/RC1201005190642/testing/RC1201005190642/testing/results/xml/org.eclipse.php.core.tests_linux.gtk.xml>: 
     [exec] FreeFontPath: FPE "/usr/X11R6/lib/X11/fonts/misc/" refcount is 2, should be 1; fixing.
     [exec]    <testsuite errors="2" failures="54" hostname="build" id="0" name="AllTests" package="org.eclipse.php.core.tests" tests="1755" time="683.861" timestamp="2010-05-19T11:03:06">
     [exec] [runtests] Creating 'noclean' file to prevent cleanup after build completes.
     [exec] [runtests] runtests.sh done: 07:14:41
    [mkdir] Created dir: <https://build.eclipse.org/hudson/job/cbi-pdt-2.2-helios/ws/build/RC1201005190642/eclipse/RC1201005190642/testresults>
    [mkdir] Created dir: <https://build.eclipse.org/hudson/job/cbi-pdt-2.2-helios/ws/build/RC1201005190642/eclipse/RC1201005190642/testresults/consolelogs>
     [copy] Copying 2 files to <https://build.eclipse.org/hudson/job/cbi-pdt-2.2-helios/ws/build/RC1201005190642/eclipse/RC1201005190642/testresults>
     [copy] Copying 1 file to <https://build.eclipse.org/hudson/job/cbi-pdt-2.2-helios/ws/build/RC1201005190642/eclipse/RC1201005190642/testresults/consolelogs>
     [echo] buildAll.xml#run :: build.step :: publish

publish:
     [echo] Copy static files to build root folder
     [copy] Copying 1 file to <https://build.eclipse.org/hudson/job/cbi-pdt-2.2-helios/ws/build/RC1201005190642/eclipse/RC1201005190642>
     [echo] Move generated zips to build root folder
     [move] Moving 15 files to <https://build.eclipse.org/hudson/job/cbi-pdt-2.2-helios/ws/build/RC1201005190642>
     [echo] Generate compilelogs/summary.txt

init:

run:
     [copy] Copying 1 file to <https://build.eclipse.org/hudson/job/cbi-pdt-2.2-helios/ws/build/RC1201005190642/testresults>
     [copy] Copying 1 file to <https://build.eclipse.org/hudson/job/cbi-pdt-2.2-helios/ws/build/RC1201005190642/testresults/consolelogs>
     [copy] Copying 1 file to <https://build.eclipse.org/hudson/job/cbi-pdt-2.2-helios/ws/build/RC1201005190642/testresults/html>
     [copy] Copying 1 file to <https://build.eclipse.org/hudson/job/cbi-pdt-2.2-helios/ws/build/RC1201005190642/testresults/xml>
     [copy] Copying 1 file to <https://build.eclipse.org/hudson/job/cbi-pdt-2.2-helios/ws/build/RC1201005190642/compilelogs>
     [copy] Copying 1 file to <https://build.eclipse.org/hudson/job/cbi-pdt-2.2-helios/ws/build/RC1201005190642/compilelogs/plugins>
     [copy] Copying 1 file to <https://build.eclipse.org/hudson/job/cbi-pdt-2.2-helios/ws/build/RC1201005190642/compilelogs/plugins/org.eclipse.php.mylyn.ui_1.0.0.v20100410-0300>
     [echo] buildAll.xml#run :: build.step :: cleanup

cleanup:
     [echo] The follow temporary files/folders should be deleted from your build:
     [echo] 	<https://build.eclipse.org/hudson/job/cbi-pdt-2.2-helios/ws/build/RC1201005190642/*-AllFeaturesAndPlugins-*.zip*>
     [echo] 	<https://build.eclipse.org/hudson/job/cbi-pdt-2.2-helios/ws/build/RC1201005190642/*-Master-*.zip*>
     [echo] 	<https://build.eclipse.org/hudson/job/cbi-pdt-2.2-helios/ws/build/RC1201005190642/eclipse>
     [echo] 	<https://build.eclipse.org/hudson/job/cbi-pdt-2.2-helios/ws/build/RC1201005190642/testing>
BUILD SUCCESSFUL

BUILD SUCCESSFUL
Total time: 31 minutes 45 seconds
[start] [07:14:45] start.sh finished.

++ rm -f <https://build.eclipse.org/hudson/job/cbi-pdt-2.2-helios/ws/build/.cvspass>
+++ date '+%Y/%m/%d %H:%M'
++ echo '[2010/05/19 07:14] Hudson job  build #261 (2010-05-19_06-42-20) done.'
[2010/05/19 07:14] Hudson job  build #261 (2010-05-19_06-42-20) done.
Terminating xvnc.
Archiving artifacts
ERROR: No artifacts found that match the file pattern "build/?20*/**, build/?-SNAPSHOT/**,". Configuration error?
ERROR: 'build/?20*/**' doesn't match anything, but '**' does. Perhaps that's what you mean?
Recording test results