[Date Prev][Date Next][Thread Prev][Thread Next][Date Index][Thread Index] [List Home]
[pdt-dev] Build failed in Hudson: cbi-pdt-2.2-helios #257

See <https://build.eclipse.org/hudson/job/cbi-pdt-2.2-helios/257/changes>

Changes:

[zzhongwei] [Bug 313282] Inserting single proposal automatically provokes an Illegal State Exception in a dialog.

------------------------------------------
[...truncated 140 lines...]

genBuildCfg:
Trying to override old definition of task resolvepath

createBuildConfigFile:
Trying to override old definition of task resolvepath

initCommandlineArgsList:
Trying to override old definition of task resolvepath

load.properties:
     [echo] Load properties from <https://build.eclipse.org/hudson/job/cbi-pdt-2.2-helios/ws/build/org.eclipse.pdt.releng/build.properties>
     [echo] 
     [echo] Loaded JAVA*_HOME and bootclasspath values:
     [echo]         JAVA_HOME = /opt/public/common/ibm-java2-ppc-50
     [echo]       JAVA14_HOME = /opt/public/common/ibm-java2-142, J2SE-1.4 = /opt/public/common/ibm-java2-142/lib/vm.jar:/opt/public/common/ibm-java2-142/jre/lib/vm.jar:/opt/public/common/ibm-java2-142/lib/dt.jar:/opt/public/common/ibm-java2-142/jre/lib/dt.jar:/opt/public/common/ibm-java2-142/lib/rt.jar:/opt/public/common/ibm-java2-142/jre/lib/rt.jar:/opt/public/common/ibm-java2-142/lib/core.jar:/opt/public/common/ibm-java2-142/jre/lib/core.jar:/opt/public/common/ibm-java2-142/lib/xml.jar:/opt/public/common/ibm-java2-142/jre/lib/xml.jar:/opt/public/common/ibm-java2-142/lib/graphics.jar:/opt/public/common/ibm-java2-142/jre/lib/graphics.jar:/opt/public/common/ibm-java2-142/lib/server.jar:/opt/public/common/ibm-java2-142/jre/lib/server.jar:/opt/public/common/ibm-java2-142/lib/ibmorbapi.jar:/opt/public/common/ibm-java2-142/jre/lib/ibmorbapi.jar:/opt/public/common/ibm-java2-142/lib/security.jar:/opt/public/common/ibm-java2-142/jre/lib/security.jar:/opt/public/common/ibm-java2-142/lib/classes.jar:/opt/public/common/ibm-java2-142/jre/lib/classes.jar:/opt/public/common/ibm-java2-142/jre/lib/jce.jar:/opt/public/common/ibm-java2-142/lib/jsse.jar:/opt/public/common/ibm-java2-142/jre/lib/jsse.jar:/opt/public/common/ibm-java2-142/../Classes/dt.jar:/opt/public/common/ibm-java2-142/../Classes/classes.jar:/opt/public/common/ibm-java2-142/../Classes/jsse.jar:/opt/public/common/ibm-java2-142/../Classes/jce.jar
     [echo]       JAVA50_HOME = /opt/public/common/ibm-java2-ppc-50, J2SE-1.5 = /opt/public/common/ibm-java2-ppc-50/jre/lib/rt.jar:/opt/public/common/ibm-java2-ppc-50/jre/lib/vm.jar:/opt/public/common/ibm-java2-ppc-50/jre/lib/core.jar:/opt/public/common/ibm-java2-ppc-50/jre/lib/xml.jar:/opt/public/common/ibm-java2-ppc-50/jre/lib/graphics.jar:/opt/public/common/ibm-java2-ppc-50/jre/lib/server.jar:/opt/public/common/ibm-java2-ppc-50/jre/lib/ibmorbapi.jar:/opt/public/common/ibm-java2-ppc-50/jre/lib/security.jar:/opt/public/common/ibm-java2-ppc-50/jre/lib/classes.jar:/opt/public/common/ibm-java2-ppc-50/jre/lib/jsse.jar:/opt/public/common/ibm-java2-ppc-50/jre/lib/jce.jar:/opt/public/common/ibm-java2-ppc-50/jre/lib/ibmjcefw.jar:/opt/public/common/ibm-java2-ppc-50/../Classes/dt.jar:/opt/public/common/ibm-java2-ppc-50/../Classes/classes.jar:/opt/public/common/ibm-java2-ppc-50/../Classes/jsse.jar:/opt/public/common/ibm-java2-ppc-50/../Classes/jce.jar
     [echo]       JAVA60_HOME = /opt/public/common/ibm-java-jdk-ppc-60, JavaSE-1.6 = /opt/public/common/ibm-java-jdk-ppc-60/jre/lib/rt.jar:/opt/public/common/ibm-java-jdk-ppc-60/jre/lib/core.jar:/opt/public/common/ibm-java-jdk-ppc-60/jre/lib/annotation.jar:/opt/public/common/ibm-java-jdk-ppc-60/jre/lib/beans.jar:/opt/public/common/ibm-java-jdk-ppc-60/jre/lib/ibmorbapi.jar:/opt/public/common/ibm-java-jdk-ppc-60/jre/lib/java.util.jar:/opt/public/common/ibm-java-jdk-ppc-60/jre/lib/jlm.jar:/opt/public/common/ibm-java-jdk-ppc-60/jre/lib/logging.jar:/opt/public/common/ibm-java-jdk-ppc-60/jre/lib/resources.jar:/opt/public/common/ibm-java-jdk-ppc-60/jre/lib/security.jar:/opt/public/common/ibm-java-jdk-ppc-60/jre/lib/sql.jar:/opt/public/common/ibm-java-jdk-ppc-60/jre/lib/vm.jar:/opt/public/common/ibm-java-jdk-ppc-60/jre/lib/xmldsigfw.jar:/opt/public/common/ibm-java-jdk-ppc-60/jre/lib/xml.jar:/opt/public/common/ibm-java-jdk-ppc-60/jre/lib/graphics.jar:/opt/public/common/ibm-java-jdk-ppc-60/jre/lib/server.jar:/opt/public/common/ibm-java-jdk-ppc-60/jre/lib/jce.jar:/opt/public/common/ibm-java-jdk-ppc-60/jre/lib/jsse.jar:/opt/public/common/ibm-java-jdk-ppc-60/jre/lib/ibmjcefw.jar:/opt/public/common/ibm-java-jdk-ppc-60/lib/dt.jar:/opt/public/common/ibm-java-jdk-ppc-60/../Classes/dt.jar:/opt/public/common/ibm-java-jdk-ppc-60/../Classes/classes.jar:/opt/public/common/ibm-java-jdk-ppc-60/../Classes/jsse.jar:/opt/public/common/ibm-java-jdk-ppc-60/../Classes/jce.jar
     [echo] Created <https://build.eclipse.org/hudson/job/cbi-pdt-2.2-helios/257/artifact/build/N201005180920/build.cfg>
Trying to override old definition of task resolvepath

collectMapTypes:
     [echo] Found these map entry types: CVS
Trying to override old definition of task resolvepath

collectURLs:

getZip:
      [get] Getting: http://download.eclipse.org/eclipse/downloads/drops/S-3.6M6-201003121448/eclipse-SDK-3.6M6-linux-gtk-ppc.tar.gz
      [get] To: <https://build.eclipse.org/hudson/job/cbi-pdt-2.2-helios/ws/build/downloads/eclipse-SDK-3.6M6-linux-gtk-ppc.tar.gz>

getZip:
      [get] Getting: http://download.eclipse.org/technology/dltk/downloads/drops/R2.0/S-2.0M6-201003160541/dltk-core-Automated_Tests-S-2.0M6-201003160541.zip
      [get] To: <https://build.eclipse.org/hudson/job/cbi-pdt-2.2-helios/ws/build/downloads/dltk-core-Automated_Tests-S-2.0M6-201003160541.zip>
     [echo] Found 2 dependency URLs
     [echo] Load properties from <https://build.eclipse.org/hudson/job/cbi-pdt-2.2-helios/257/artifact/build/N201005180920/build.cfg>
     [echo] Got incubation = 

create.label.properties:
     [echo] subprojectName = pdt
     [echo] Base OS: linux; Base Window System: gtk

collectMaps:

run:
     [echo] Get pde.build.svn

get.pde.build.svn:
     [echo] Get ant4eclipse

get.ant4eclipse:

get.SWTBot.junit4:
     [echo] buildAll.xml#run :: build.step :: buildUpdate

buildUpdate:

buildMasterZip:

-timestamp:
     [echo] 09:21:27

main-init:

main:

main:

preBuild:

preSetup:
    [mkdir] Created dir: <https://build.eclipse.org/hudson/job/cbi-pdt-2.2-helios/257/artifact/build/N201005180920/eclipse/N201005180920>

getMapFiles:
     [copy] Copying 1 file to <https://build.eclipse.org/hudson/job/cbi-pdt-2.2-helios/257/artifact/build/N201005180920/eclipse>

init:

postSetup:

provision.eclipse.build.base:

provision.eclipse.base:
     [echo] Provision Eclipse base from eclipse-SDK-3.6M6-linux-gtk-ppc.tar.gz into <https://build.eclipse.org/hudson/job/cbi-pdt-2.2-helios/257/artifact/build/N201005180920...>

init:

getDep:

getBundle:

downloadFile:

unpackBundle:

unzipFile:

untarFile:
    [untar] Expanding: <https://build.eclipse.org/hudson/job/cbi-pdt-2.2-helios/ws/build/downloads/eclipse-SDK-3.6M6-linux-gtk-ppc.tar.gz> into <https://build.eclipse.org/hudson/job/cbi-pdt-2.2-helios/257/artifact/build/N201005180920>
     [echo] Install org.eclipse.wst.web_ui.feature+org.eclipse.dltk.core+org.eclipse.dltk.mylyn+org.eclipse.wst.xsl.feature+org.eclipse.dltk.core.index+org.eclipse.wst.common.fproj to <https://build.eclipse.org/hudson/job/cbi-pdt-2.2-helios/257/artifact/build/N201005180920/eclipse>

run.director:

-timestamp:
     [echo] 09:21:49
    [mkdir] Created dir: <https://build.eclipse.org/hudson/job/cbi-pdt-2.2-helios/257/artifact/build/N201005180920/eclipse/p2repoZipsTmp>
Trying to override old definition of task resolvepath

get.PACK200_JAVA_HOME:
Trying to override old definition of task resolvepath

get.baseoswsarch:
     [echo] 
     [echo] 	p2.director.input.repo.cleaned = <https://build.eclipse.org/hudson/job/cbi-pdt-2.2-helios/257/artifact/build/N201005180920/eclipse/p2/org.eclipse.equinox.p2.engine/profileRegistry/SDKProfile.profile,file>:/home/data/httpd/download.eclipse.org/modeling//emf/updates/milestones/,file:/home/data/httpd/download.eclipse.org/webtools/milestones/,file:/home/data/httpd/download.eclipse.org/technology/dltk/updates-dev/2.0/,file:/home/data/httpd/download.eclipse.org/tools/gef/updates/milestones/,file:/home/data/httpd/download.eclipse.org/tools/orbit/downloads/drops/R20090825191606/updateSite,file:/home/data/httpd/download.eclipse.org/tools/mylyn/update/helios,file:/home/data/httpd/download.eclipse.org/modeling//emf/updates/milestones/,file:/home/data/httpd/download.eclipse.org/webtools/milestones/,file:/home/data/httpd/download.eclipse.org/technology/dltk/updates-dev/2.0/,file:/home/data/httpd/download.eclipse.org/tools/gef/updates/milestones/,file:/home/data/httpd/download.eclipse.org/tools/orbit/downloads/drops/R20090825191606/updateSite,file:/home/data/httpd/download.eclipse.org/tools/mylyn/update/helios
     [echo] 	p2.director.destination        = <https://build.eclipse.org/hudson/job/cbi-pdt-2.2-helios/257/artifact/build/N201005180920/eclipse> 

-timestamp:
     [echo] 09:21:50
   [p2.dir] !SESSION 2010-05-18 09:21:52.208 -----------------------------------------------
   [p2.dir] eclipse.buildId=I20100312-1448
   [p2.dir] java.fullversion=J2RE 1.5.0 IBM J9 2.3 Linux ppc-32 j9vmxp3223-20071007 (JIT enabled)
   [p2.dir] J9VM - 20071004_14218_bHdSMR
   [p2.dir] JIT  - 20070820_1846ifx1_r8
   [p2.dir] GC   - 200708_10
   [p2.dir] BootLoader constants: OS=linux, ARCH=ppc, WS=gtk, NL=en_US
   [p2.dir] Framework arguments:  -application org.eclipse.equinox.p2.director -flavor tooling -roaming -profile SDKProfile -installIU org.eclipse.wst.web_ui.feature.feature.group -installIU org.eclipse.dltk.core.feature.group -installIU org.eclipse.dltk.mylyn.feature.group -installIU org.eclipse.wst.xsl.feature.feature.group -installIU org.eclipse.dltk.core.index.feature.group -installIU org.eclipse.wst.common.fproj.feature.group -destination <https://build.eclipse.org/hudson/job/cbi-pdt-2.2-helios/257/artifact/build/N201005180920/eclipse> -bundlepool <https://build.eclipse.org/hudson/job/cbi-pdt-2.2-helios/257/artifact/build/N201005180920/eclipse> -metadataRepository <https://build.eclipse.org/hudson/job/cbi-pdt-2.2-helios/257/artifact/build/N201005180920/eclipse/p2/org.eclipse.equinox.p2.engine/profileRegistry/SDKProfile.profile,file>:/home/data/httpd/download.eclipse.org/modeling//emf/updates/milestones/,file:/home/data/httpd/download.eclipse.org/webtools/milestones/,file:/home/data/httpd/download.eclipse.org/technology/dltk/updates-dev/2.0/,file:/home/data/httpd/download.eclipse.org/tools/gef/updates/milestones/,file:/home/data/httpd/download.eclipse.org/tools/orbit/downloads/drops/R20090825191606/updateSite,file:/home/data/httpd/download.eclipse.org/tools/mylyn/update/helios,file:/home/data/httpd/download.eclipse.org/modeling//emf/updates/milestones/,file:/home/data/httpd/download.eclipse.org/webtools/milestones/,file:/home/data/httpd/download.eclipse.org/technology/dltk/updates-dev/2.0/,file:/home/data/httpd/download.eclipse.org/tools/gef/updates/milestones/,file:/home/data/httpd/download.eclipse.org/tools/orbit/downloads/drops/R20090825191606/updateSite,file:/home/data/httpd/download.eclipse.org/tools/mylyn/update/helios, -artifactRepository <https://build.eclipse.org/hudson/job/cbi-pdt-2.2-helios/257/artifact/build/N201005180920/eclipse/p2/org.eclipse.equinox.p2.engine/profileRegistry/SDKProfile.profile,file>:/home/data/httpd/download.eclipse.org/modeling//emf/updates/milestones/,file:/home/data/httpd/download.eclipse.org/webtools/milestones/,file:/home/data/httpd/download.eclipse.org/technology/dltk/updates-dev/2.0/,file:/home/data/httpd/download.eclipse.org/tools/gef/updates/milestones/,file:/home/data/httpd/download.eclipse.org/tools/orbit/downloads/drops/R20090825191606/updateSite,file:/home/data/httpd/download.eclipse.org/tools/mylyn/update/helios,file:/home/data/httpd/download.eclipse.org/modeling//emf/updates/milestones/,file:/home/data/httpd/download.eclipse.org/webtools/milestones/,file:/home/data/httpd/download.eclipse.org/technology/dltk/updates-dev/2.0/,file:/home/data/httpd/download.eclipse.org/tools/gef/updates/milestones/,file:/home/data/httpd/download.eclipse.org/tools/orbit/downloads/drops/R20090825191606/updateSite,file:/home/data/httpd/download.eclipse.org/tools/mylyn/update/helios, -profileProperties org.eclipse.update.install.features=true
   [p2.dir] Command-line arguments:  -application org.eclipse.equinox.p2.director -consoleLog -flavor tooling -roaming -profile SDKProfile -installIU org.eclipse.wst.web_ui.feature.feature.group -installIU org.eclipse.dltk.core.feature.group -installIU org.eclipse.dltk.mylyn.feature.group -installIU org.eclipse.wst.xsl.feature.feature.group -installIU org.eclipse.dltk.core.index.feature.group -installIU org.eclipse.wst.common.fproj.feature.group -destination <https://build.eclipse.org/hudson/job/cbi-pdt-2.2-helios/257/artifact/build/N201005180920/eclipse> -bundlepool <https://build.eclipse.org/hudson/job/cbi-pdt-2.2-helios/257/artifact/build/N201005180920/eclipse> -metadataRepository <https://build.eclipse.org/hudson/job/cbi-pdt-2.2-helios/257/artifact/build/N201005180920/eclipse/p2/org.eclipse.equinox.p2.engine/profileRegistry/SDKProfile.profile,file>:/home/data/httpd/download.eclipse.org/modeling//emf/updates/milestones/,file:/home/data/httpd/download.eclipse.org/webtools/milestones/,file:/home/data/httpd/download.eclipse.org/technology/dltk/updates-dev/2.0/,file:/home/data/httpd/download.eclipse.org/tools/gef/updates/milestones/,file:/home/data/httpd/download.eclipse.org/tools/orbit/downloads/drops/R20090825191606/updateSite,file:/home/data/httpd/download.eclipse.org/tools/mylyn/update/helios,file:/home/data/httpd/download.eclipse.org/modeling//emf/updates/milestones/,file:/home/data/httpd/download.eclipse.org/webtools/milestones/,file:/home/data/httpd/download.eclipse.org/technology/dltk/updates-dev/2.0/,file:/home/data/httpd/download.eclipse.org/tools/gef/updates/milestones/,file:/home/data/httpd/download.eclipse.org/tools/orbit/downloads/drops/R20090825191606/updateSite,file:/home/data/httpd/download.eclipse.org/tools/mylyn/update/helios, -artifactRepository <https://build.eclipse.org/hudson/job/cbi-pdt-2.2-helios/257/artifact/build/N201005180920/eclipse/p2/org.eclipse.equinox.p2.engine/profileRegistry/SDKProfile.profile,file>:/home/data/httpd/download.eclipse.org/modeling//emf/updates/milestones/,file:/home/data/httpd/download.eclipse.org/webtools/milestones/,file:/home/data/httpd/download.eclipse.org/technology/dltk/updates-dev/2.0/,file:/home/data/httpd/download.eclipse.org/tools/gef/updates/milestones/,file:/home/data/httpd/download.eclipse.org/tools/orbit/downloads/drops/R20090825191606/updateSite,file:/home/data/httpd/download.eclipse.org/tools/mylyn/update/helios,file:/home/data/httpd/download.eclipse.org/modeling//emf/updates/milestones/,file:/home/data/httpd/download.eclipse.org/webtools/milestones/,file:/home/data/httpd/download.eclipse.org/technology/dltk/updates-dev/2.0/,file:/home/data/httpd/download.eclipse.org/tools/gef/updates/milestones/,file:/home/data/httpd/download.eclipse.org/tools/orbit/downloads/drops/R20090825191606/updateSite,file:/home/data/httpd/download.eclipse.org/tools/mylyn/update/helios, -profileProperties org.eclipse.update.install.features=true -os linux -ws gtk -arch ppc
   [p2.dir] 
   [p2.dir] !ENTRY org.eclipse.equinox.p2.artifact.repository 4 1000 2010-05-18 09:22:18.068
   [p2.dir] !MESSAGE No repository found at <https://build.eclipse.org/hudson/job/cbi-pdt-2.2-helios/257/artifact/build/N201005180920/eclipse/p2/org.eclipse.equinox.p2.engine/profileRegistry/SDKProfile.profile/.>
   [p2.dir] Installing org.eclipse.wst.web_ui.feature.feature.group 3.2.0.v201004292000-7O7CFb3EMf6XlpNJSz0w3dFLmZJ3.
   [p2.dir] Installing org.eclipse.dltk.core.feature.group 2.0.0.v20100505-1154-7L--EAAoOUVSNe3Bb0tz0.
   [p2.dir] Installing org.eclipse.dltk.mylyn.feature.group 1.0.0.v20100505-1154-2--7w3121162402154.
   [p2.dir] Installing org.eclipse.wst.xsl.feature.feature.group 1.1.0.v201004290551-7S7WFAKFIpRz0voO9MFQ-p4_EWNN.
   [p2.dir] Installing org.eclipse.dltk.core.index.feature.group 2.0.0.v20100505-1154-7708p9oA57D5N8G28_EA.
   [p2.dir] Installing org.eclipse.wst.common.fproj.feature.group 3.2.0.v201004210642-377A78s73533B7L3935.
   [p2.dir] Cannot complete the install because one or more required items could not be found.
   [p2.dir]  Software being installed: Eclipse Web Developer Tools 3.2.0.v201004292000-7O7CFb3EMf6XlpNJSz0w3dFLmZJ3 (org.eclipse.wst.web_ui.feature.feature.group 3.2.0.v201004292000-7O7CFb3EMf6XlpNJSz0w3dFLmZJ3)
   [p2.dir]  Missing requirement: XML Schema Editor 1.2.303.v201004290328 (org.eclipse.wst.xsd.ui 1.2.303.v201004290328) requires 'bundle org.eclipse.xsd.edit [2.2.0,3.0.0)' but it could not be found
   [p2.dir]  Cannot satisfy dependency:
   [p2.dir]   From: Eclipse Web Developer Tools 3.2.0.v201004292000-7O7CFb3EMf6XlpNJSz0w3dFLmZJ3 (org.eclipse.wst.web_ui.feature.feature.group 3.2.0.v201004292000-7O7CFb3EMf6XlpNJSz0w3dFLmZJ3)
   [p2.dir]   To: org.eclipse.wst.xml_ui.feature.feature.group [3.2.0.v201004210707-7H7AFSjDxumOhOYBz0bmPPfNlA3J]
   [p2.dir]  Cannot satisfy dependency:
   [p2.dir]   From: Eclipse XML Editors and Tools 3.2.0.v201004210707-7H7AFSjDxumOhOYBz0bmPPfNlA3J (org.eclipse.wst.xml_ui.feature.feature.group 3.2.0.v201004210707-7H7AFSjDxumOhOYBz0bmPPfNlA3J)
   [p2.dir]   To: org.eclipse.wst.xsd.ui [1.2.303.v201004290328]
   [p2.dir] Application failed, log file location: <https://build.eclipse.org/hudson/job/cbi-pdt-2.2-helios/257/artifact/build/N201005180920/eclipse/configuration/1274188913380.log>
   [p2.dir] Installation failed.
   [p2.dir] 
   [p2.dir] !ENTRY org.eclipse.equinox.p2.director 4 1 2010-05-18 09:22:42.501
   [p2.dir] !MESSAGE Cannot complete the install because one or more required items could not be found.
   [p2.dir] !SUBENTRY 1 org.eclipse.equinox.p2.director 4 0 2010-05-18 09:22:42.501
   [p2.dir] !MESSAGE Software being installed: Eclipse Web Developer Tools 3.2.0.v201004292000-7O7CFb3EMf6XlpNJSz0w3dFLmZJ3 (org.eclipse.wst.web_ui.feature.feature.group 3.2.0.v201004292000-7O7CFb3EMf6XlpNJSz0w3dFLmZJ3)
   [p2.dir] !SUBENTRY 1 org.eclipse.equinox.p2.director 4 0 2010-05-18 09:22:42.502
   [p2.dir] !MESSAGE Missing requirement: XML Schema Editor 1.2.303.v201004290328 (org.eclipse.wst.xsd.ui 1.2.303.v201004290328) requires 'bundle org.eclipse.xsd.edit [2.2.0,3.0.0)' but it could not be found
   [p2.dir] !SUBENTRY 1 org.eclipse.equinox.p2.director 4 1 2010-05-18 09:22:42.502
   [p2.dir] !MESSAGE Cannot satisfy dependency:
   [p2.dir] !SUBENTRY 2 org.eclipse.equinox.p2.director 4 0 2010-05-18 09:22:42.502
   [p2.dir] !MESSAGE From: Eclipse Web Developer Tools 3.2.0.v201004292000-7O7CFb3EMf6XlpNJSz0w3dFLmZJ3 (org.eclipse.wst.web_ui.feature.feature.group 3.2.0.v201004292000-7O7CFb3EMf6XlpNJSz0w3dFLmZJ3)
   [p2.dir] !SUBENTRY 2 org.eclipse.equinox.p2.director 4 0 2010-05-18 09:22:42.503
   [p2.dir] !MESSAGE To: org.eclipse.wst.xml_ui.feature.feature.group [3.2.0.v201004210707-7H7AFSjDxumOhOYBz0bmPPfNlA3J]
   [p2.dir] !SUBENTRY 1 org.eclipse.equinox.p2.director 4 1 2010-05-18 09:22:42.503
   [p2.dir] !MESSAGE Cannot satisfy dependency:
   [p2.dir] !SUBENTRY 2 org.eclipse.equinox.p2.director 4 0 2010-05-18 09:22:42.504
   [p2.dir] !MESSAGE From: Eclipse XML Editors and Tools 3.2.0.v201004210707-7H7AFSjDxumOhOYBz0bmPPfNlA3J (org.eclipse.wst.xml_ui.feature.feature.group 3.2.0.v201004210707-7H7AFSjDxumOhOYBz0bmPPfNlA3J)
   [p2.dir] !SUBENTRY 2 org.eclipse.equinox.p2.director 4 0 2010-05-18 09:22:42.504
   [p2.dir] !MESSAGE To: org.eclipse.wst.xsd.ui [1.2.303.v201004290328]
   [p2.dir] 
   [p2.dir] !ENTRY org.eclipse.equinox.p2.engine 2 0 2010-05-18 09:22:43.797
   [p2.dir] !MESSAGE Exception saving profile preferences
   [p2.dir] !STACK 0
   [p2.dir] java.lang.RuntimeException: Attempt to access stopped agent: org.eclipse.equinox.internal.p2.core.ProvisioningAgent@15dc15dc
   [p2.dir] 	at org.eclipse.equinox.internal.p2.core.ProvisioningAgent.checkRunning(ProvisioningAgent.java:79)
   [p2.dir] 	at org.eclipse.equinox.internal.p2.core.ProvisioningAgent.getService(ProvisioningAgent.java:45)
   [p2.dir] 	at org.eclipse.equinox.internal.p2.engine.ProfilePreferences.doSave(ProfilePreferences.java:112)
   [p2.dir] 	at org.eclipse.equinox.internal.p2.engine.ProfilePreferences$SaveJob.run(ProfilePreferences.java:49)
   [p2.dir] 	at org.eclipse.core.internal.jobs.Worker.run(Worker.java:54)
      [for] org.eclipse.wst.web_ui.feature+org.eclipse.dltk.core+org.eclipse.dltk.mylyn+org.eclipse.wst.xsl.feature+org.eclipse.dltk.core.index+org.eclipse.wst.common.fproj: The following error occurred while executing this line:
      [for] <https://build.eclipse.org/hudson/job/cbi-pdt-2.2-helios/ws/build/org.eclipse.dash.common.releng/builder/all/customTargets.xml>:257: The following error occurred while executing this line:
      [for] <https://build.eclipse.org/hudson/job/cbi-pdt-2.2-helios/ws/build/org.eclipse.dash.common.releng/tools/scripts/buildAllHelper.xml>:1569: Java returned: 13
      [for] featureIDsToInstall: The following error occurred while executing this line:
      [for] <https://build.eclipse.org/hudson/job/cbi-pdt-2.2-helios/ws/build/org.eclipse.dash.common.releng/builder/all/customTargets.xml>:230: Keepgoing execution: 1 of 1 iterations failed.
     [echo] Install org.apache.commons.lang to <https://build.eclipse.org/hudson/job/cbi-pdt-2.2-helios/257/artifact/build/N201005180920/eclipse>

run.director:

-timestamp:
     [echo] 09:22:45
Trying to override old definition of task resolvepath

get.PACK200_JAVA_HOME:
Trying to override old definition of task resolvepath

get.baseoswsarch:
     [echo] 
     [echo] 	p2.director.input.repo.cleaned = <https://build.eclipse.org/hudson/job/cbi-pdt-2.2-helios/257/artifact/build/N201005180920/eclipse/p2/org.eclipse.equinox.p2.engine/profileRegistry/SDKProfile.profile,file>:/home/data/httpd/download.eclipse.org/modeling//emf/updates/milestones/,file:/home/data/httpd/download.eclipse.org/webtools/milestones/,file:/home/data/httpd/download.eclipse.org/technology/dltk/updates-dev/2.0/,file:/home/data/httpd/download.eclipse.org/tools/gef/updates/milestones/,file:/home/data/httpd/download.eclipse.org/tools/orbit/downloads/drops/R20090825191606/updateSite,file:/home/data/httpd/download.eclipse.org/tools/mylyn/update/helios,file:/home/data/httpd/download.eclipse.org/modeling//emf/updates/milestones/,file:/home/data/httpd/download.eclipse.org/webtools/milestones/,file:/home/data/httpd/download.eclipse.org/technology/dltk/updates-dev/2.0/,file:/home/data/httpd/download.eclipse.org/tools/gef/updates/milestones/,file:/home/data/httpd/download.eclipse.org/tools/orbit/downloads/drops/R20090825191606/updateSite,file:/home/data/httpd/download.eclipse.org/tools/mylyn/update/helios
     [echo] 	p2.director.destination        = <https://build.eclipse.org/hudson/job/cbi-pdt-2.2-helios/257/artifact/build/N201005180920/eclipse> 

-timestamp:
     [echo] 09:22:45
   [p2.dir] !SESSION 2010-05-18 09:22:47.691 -----------------------------------------------
   [p2.dir] eclipse.buildId=I20100312-1448
   [p2.dir] java.fullversion=J2RE 1.5.0 IBM J9 2.3 Linux ppc-32 j9vmxp3223-20071007 (JIT enabled)
   [p2.dir] J9VM - 20071004_14218_bHdSMR
   [p2.dir] JIT  - 20070820_1846ifx1_r8
   [p2.dir] GC   - 200708_10
   [p2.dir] BootLoader constants: OS=linux, ARCH=ppc, WS=gtk, NL=en_US
   [p2.dir] Framework arguments:  -application org.eclipse.equinox.p2.director -flavor tooling -roaming -profile SDKProfile -installIU org.apache.commons.lang -destination <https://build.eclipse.org/hudson/job/cbi-pdt-2.2-helios/257/artifact/build/N201005180920/eclipse> -bundlepool <https://build.eclipse.org/hudson/job/cbi-pdt-2.2-helios/257/artifact/build/N201005180920/eclipse> -metadataRepository <https://build.eclipse.org/hudson/job/cbi-pdt-2.2-helios/257/artifact/build/N201005180920/eclipse/p2/org.eclipse.equinox.p2.engine/profileRegistry/SDKProfile.profile,file>:/home/data/httpd/download.eclipse.org/modeling//emf/updates/milestones/,file:/home/data/httpd/download.eclipse.org/webtools/milestones/,file:/home/data/httpd/download.eclipse.org/technology/dltk/updates-dev/2.0/,file:/home/data/httpd/download.eclipse.org/tools/gef/updates/milestones/,file:/home/data/httpd/download.eclipse.org/tools/orbit/downloads/drops/R20090825191606/updateSite,file:/home/data/httpd/download.eclipse.org/tools/mylyn/update/helios,file:/home/data/httpd/download.eclipse.org/modeling//emf/updates/milestones/,file:/home/data/httpd/download.eclipse.org/webtools/milestones/,file:/home/data/httpd/download.eclipse.org/technology/dltk/updates-dev/2.0/,file:/home/data/httpd/download.eclipse.org/tools/gef/updates/milestones/,file:/home/data/httpd/download.eclipse.org/tools/orbit/downloads/drops/R20090825191606/updateSite,file:/home/data/httpd/download.eclipse.org/tools/mylyn/update/helios, -artifactRepository <https://build.eclipse.org/hudson/job/cbi-pdt-2.2-helios/257/artifact/build/N201005180920/eclipse/p2/org.eclipse.equinox.p2.engine/profileRegistry/SDKProfile.profile,file>:/home/data/httpd/download.eclipse.org/modeling//emf/updates/milestones/,file:/home/data/httpd/download.eclipse.org/webtools/milestones/,file:/home/data/httpd/download.eclipse.org/technology/dltk/updates-dev/2.0/,file:/home/data/httpd/download.eclipse.org/tools/gef/updates/milestones/,file:/home/data/httpd/download.eclipse.org/tools/orbit/downloads/drops/R20090825191606/updateSite,file:/home/data/httpd/download.eclipse.org/tools/mylyn/update/helios,file:/home/data/httpd/download.eclipse.org/modeling//emf/updates/milestones/,file:/home/data/httpd/download.eclipse.org/webtools/milestones/,file:/home/data/httpd/download.eclipse.org/technology/dltk/updates-dev/2.0/,file:/home/data/httpd/download.eclipse.org/tools/gef/updates/milestones/,file:/home/data/httpd/download.eclipse.org/tools/orbit/downloads/drops/R20090825191606/updateSite,file:/home/data/httpd/download.eclipse.org/tools/mylyn/update/helios, -profileProperties org.eclipse.update.install.features=true
   [p2.dir] Command-line arguments:  -application org.eclipse.equinox.p2.director -consoleLog -flavor tooling -roaming -profile SDKProfile -installIU org.apache.commons.lang -destination <https://build.eclipse.org/hudson/job/cbi-pdt-2.2-helios/257/artifact/build/N201005180920/eclipse> -bundlepool <https://build.eclipse.org/hudson/job/cbi-pdt-2.2-helios/257/artifact/build/N201005180920/eclipse> -metadataRepository <https://build.eclipse.org/hudson/job/cbi-pdt-2.2-helios/257/artifact/build/N201005180920/eclipse/p2/org.eclipse.equinox.p2.engine/profileRegistry/SDKProfile.profile,file>:/home/data/httpd/download.eclipse.org/modeling//emf/updates/milestones/,file:/home/data/httpd/download.eclipse.org/webtools/milestones/,file:/home/data/httpd/download.eclipse.org/technology/dltk/updates-dev/2.0/,file:/home/data/httpd/download.eclipse.org/tools/gef/updates/milestones/,file:/home/data/httpd/download.eclipse.org/tools/orbit/downloads/drops/R20090825191606/updateSite,file:/home/data/httpd/download.eclipse.org/tools/mylyn/update/helios,file:/home/data/httpd/download.eclipse.org/modeling//emf/updates/milestones/,file:/home/data/httpd/download.eclipse.org/webtools/milestones/,file:/home/data/httpd/download.eclipse.org/technology/dltk/updates-dev/2.0/,file:/home/data/httpd/download.eclipse.org/tools/gef/updates/milestones/,file:/home/data/httpd/download.eclipse.org/tools/orbit/downloads/drops/R20090825191606/updateSite,file:/home/data/httpd/download.eclipse.org/tools/mylyn/update/helios, -artifactRepository <https://build.eclipse.org/hudson/job/cbi-pdt-2.2-helios/257/artifact/build/N201005180920/eclipse/p2/org.eclipse.equinox.p2.engine/profileRegistry/SDKProfile.profile,file>:/home/data/httpd/download.eclipse.org/modeling//emf/updates/milestones/,file:/home/data/httpd/download.eclipse.org/webtools/milestones/,file:/home/data/httpd/download.eclipse.org/technology/dltk/updates-dev/2.0/,file:/home/data/httpd/download.eclipse.org/tools/gef/updates/milestones/,file:/home/data/httpd/download.eclipse.org/tools/orbit/downloads/drops/R20090825191606/updateSite,file:/home/data/httpd/download.eclipse.org/tools/mylyn/update/helios,file:/home/data/httpd/download.eclipse.org/modeling//emf/updates/milestones/,file:/home/data/httpd/download.eclipse.org/webtools/milestones/,file:/home/data/httpd/download.eclipse.org/technology/dltk/updates-dev/2.0/,file:/home/data/httpd/download.eclipse.org/tools/gef/updates/milestones/,file:/home/data/httpd/download.eclipse.org/tools/orbit/downloads/drops/R20090825191606/updateSite,file:/home/data/httpd/download.eclipse.org/tools/mylyn/update/helios, -profileProperties org.eclipse.update.install.features=true -os linux -ws gtk -arch ppc
   [p2.dir] 
   [p2.dir] !ENTRY org.eclipse.equinox.p2.artifact.repository 4 1000 2010-05-18 09:22:51.678
   [p2.dir] !MESSAGE No repository found at <https://build.eclipse.org/hudson/job/cbi-pdt-2.2-helios/257/artifact/build/N201005180920/eclipse/p2/org.eclipse.equinox.p2.engine/profileRegistry/SDKProfile.profile/.>
   [p2.dir] Installing org.apache.commons.lang 2.4.0.v20081016-1030.
   [p2.dir] Operation completed in 33909 ms.
   [p2.dir] 
   [p2.dir] !ENTRY org.eclipse.equinox.p2.engine 2 0 2010-05-18 09:23:25.725
   [p2.dir] !MESSAGE Exception saving profile preferences
   [p2.dir] !STACK 0
   [p2.dir] java.lang.RuntimeException: Attempt to access stopped agent: org.eclipse.equinox.internal.p2.core.ProvisioningAgent@59325932
   [p2.dir] 	at org.eclipse.equinox.internal.p2.core.ProvisioningAgent.checkRunning(ProvisioningAgent.java:79)
   [p2.dir] 	at org.eclipse.equinox.internal.p2.core.ProvisioningAgent.getService(ProvisioningAgent.java:45)
   [p2.dir] 	at org.eclipse.equinox.internal.p2.engine.ProfilePreferences.doSave(ProfilePreferences.java:112)
   [p2.dir] 	at org.eclipse.equinox.internal.p2.engine.ProfilePreferences$SaveJob.run(ProfilePreferences.java:49)
   [p2.dir] 	at org.eclipse.core.internal.jobs.Worker.run(Worker.java:54)
   [delete] Deleting directory <https://build.eclipse.org/hudson/job/cbi-pdt-2.2-helios/257/artifact/build/N201005180920/eclipse/p2repoZipsTmp>

-timestamp:
     [echo] 09:23:26

BUILD FAILED
<https://build.eclipse.org/hudson/job/cbi-pdt-2.2-helios/ws/build/org.eclipse.dash.common.releng/buildAll.xml>:374: The following error occurred while executing this line:
<https://build.eclipse.org/hudson/job/cbi-pdt-2.2-helios/ws/build/org.eclipse.dash.common.releng/buildAll.xml>:415: The following error occurred while executing this line:
<https://build.eclipse.org/hudson/job/cbi-pdt-2.2-helios/ws/build/org.eclipse.dash.common.releng/tools/scripts/buildAllHelper.xml>:807: The following error occurred while executing this line:
<https://build.eclipse.org/hudson/job/cbi-pdt-2.2-helios/ws/build/org.eclipse.dash.common.releng/tools/scripts/buildAllHelper.xml>:1216: The following error occurred while executing this line:
<https://build.eclipse.org/hudson/job/cbi-pdt-2.2-helios/ws/build/org.eclipse.dash.common.releng/build.xml>:199: The following error occurred while executing this line:
/opt/public/cbi/build/org.eclipse.releng.basebuilder_r35x_v20090811/plugins/org.eclipse.pde.build_3.5.0.v20090527-1800/scripts/build.xml:32: The following error occurred while executing this line:
/opt/public/cbi/build/org.eclipse.releng.basebuilder_r35x_v20090811/plugins/org.eclipse.pde.build_3.5.0.v20090527-1800/scripts/build.xml:53: The following error occurred while executing this line:
<https://build.eclipse.org/hudson/job/cbi-pdt-2.2-helios/ws/build/org.eclipse.dash.common.releng/builder/all/customTargets.xml>:208: Keepgoing execution: 1 of 3 iterations failed.

Total time: 2 minutes 14 seconds
[start] [09:23:27] start.sh finished.

++ rm -f <https://build.eclipse.org/hudson/job/cbi-pdt-2.2-helios/ws/build/.cvspass>
+++ date '+%Y/%m/%d %H:%M'
++ echo '[2010/05/18 09:23] Hudson job  build #257 (2010-05-18_09-20-26) done.'
[2010/05/18 09:23] Hudson job  build #257 (2010-05-18_09-20-26) done.
Terminating xvnc.
Archiving artifacts
Recording test results
No test report files were found. Configuration error?