Skip to main content

[Date Prev][Date Next][Thread Prev][Thread Next][Date Index][Thread Index] [List Home]
[emfcompare-build] [Hudson] Build failed in Hudson: master-rcptt-nightly » luna #421

See <https://hudson.eclipse.org/emfcompare/job/master-rcptt-nightly/./PLATFORM=luna/421/changes>

Changes:

[Laurent Delaigue] Fix target platform for mars

[Mathieu Cartaud] Fix git related tests

------------------------------------------
Started by upstream job "master-rcptt-nightly" build number 421
Checkout:luna / <https://hudson.eclipse.org/emfcompare/job/master-rcptt-nightly/./PLATFORM=luna/ws/> - hudson.remoting.LocalChannel@4f18f461
Using strategy: Default
Git Exe: git
Last Built Revision: Revision f1cce62157c60fc065bdfa8ed8fe40df2d2ccb93 (origin/master)
Checkout:luna / <https://hudson.eclipse.org/emfcompare/job/master-rcptt-nightly/./PLATFORM=luna/ws/> - hudson.remoting.LocalChannel@4f18f461
Fetching changes from the remote Git repository
Fetching upstream changes from /gitroot/emfcompare/org.eclipse.emf.compare.git
Commencing build of Revision 1df79ebeb8b351f42f419c88e3abd311a8df2ff4 (origin/master)
Checking out Revision 1df79ebeb8b351f42f419c88e3abd311a8df2ff4 (origin/master)
Starting xvnc
[luna] $ Xvnc :620 -geometry 1024x768 -depth 24 -ac
[luna] $ /bin/sh -xe /tmp/genie.emfcompare/hudson8599408375608916502.sh
+ wget -m http://download.eclipse.org/rcptt/release/2.0.0/runner/rcptt.runner-2.0.0.zip
--2016-02-29 20:20:39--  http://download.eclipse.org/rcptt/release/2.0.0/runner/rcptt.runner-2.0.0.zip
29/02/2016 20:20:39 Xvnc version X.org/xf4vnc custom version
29/02/2016 20:20:39 Copyright (C) 2001-2004 Alan Hourihane.
29/02/2016 20:20:39 Copyright (C) 2000-2004 Constantin Kaplinsky
29/02/2016 20:20:39 Copyright (C) 1999 AT&T Laboratories Cambridge
29/02/2016 20:20:39 All Rights Reserved.
29/02/2016 20:20:39 See http://www.tightvnc.com/ for information on TightVNC
29/02/2016 20:20:39 See http://xf4vnc.sf.net for xf4vnc-specific information
29/02/2016 20:20:39 Desktop name 'x11' (hipp6:620)
29/02/2016 20:20:39 Protocol versions supported: 3.7, 3.3
Resolving download.eclipse.org... 29/02/2016 20:20:39 RGB format 8 8 8
29/02/2016 20:20:39 Listening for VNC connections on TCP port 6520
172.30.206.10
Connecting to download.eclipse.org|172.30.206.10|:80... connected.
HTTP request sent, awaiting response... 200 OK
Length: 167708087 (160M) [application/zip]
Server file no newer than local file `download.eclipse.org/rcptt/release/2.0.0/runner/rcptt.runner-2.0.0.zip' -- not retrieving.

[INFO] Using Maven 3 installation: Maven 3.2.1
[dix] Could not init font path element /usr/share/fonts/TTF/, removing from list!
[dix] Could not init font path element /usr/share/fonts/OTF, removing from list!
[INFO] Checking Maven 3 installation environment
[luna] $ /shared/common/apache-maven-3.2.1/bin/mvn --help
[INFO] Checking Maven 3 installation version
(EE) config/hal: NewInputDeviceRequest failed (2)
(EE) config/hal: NewInputDeviceRequest failed (2)
[INFO] Detected Maven 3 installation version: 3.2.1
[luna] $ /shared/common/apache-maven-3.2.1/bin/mvn clean verify -V -B -e -DPLATFORM=luna -Drcpttrunner=<https://hudson.eclipse.org/emfcompare/job/master-rcptt-nightly/./PLATFORM=luna/ws/download.eclipse.org/rcptt/release/2.0.0/runner/rcptt.runner-2.0.0.zip> -Dmaven.ext.class.path=/home/hudson/genie.emfcompare/.hudson/maven/slavebundle/resources:/home/hudson/genie.emfcompare/.hudson/maven/slavebundle/lib/maven3-eventspy-3.1.jar:/home/hudson/genie.emfcompare/.hudson/war/webapp/WEB-INF/lib/hudson-remoting-3.0.3.jar -Dhudson.eventspy.port=59651 -Dmaven.repo.local=<https://hudson.eclipse.org/emfcompare/job/master-rcptt-nightly/./PLATFORM=luna/ws/.maven/repo> -f plugins/org.eclipse.emf.compare.rcptt.tests/pom.xml -P luna -fae
[DEBUG] Waiting for connection on port: 59651
Apache Maven 3.2.1 (ea8b2b07643dbb1b84b6d16e1f08391b666bc1e9; 2014-02-14T12:37:52-05:00)
Maven home: /shared/common/apache-maven-3.2.1
Java version: 1.7.0_80, vendor: Oracle Corporation
Java home: /opt/public/common/jdk1.7.0_80/jre
Default locale: en_US, platform encoding: UTF-8
OS name: "linux", version: "3.0.101-0.47.71-default", arch: "amd64", family: "unix"
SLF4J: Class path contains multiple SLF4J bindings.
SLF4J: Found binding in [jar:file:/home/hudson/genie.emfcompare/.hudson/maven/slavebundle/lib/maven3-eventspy-runtime.jar!/org/slf4j/impl/StaticLoggerBinder.class]
SLF4J: Found binding in [jar:file:/shared/common/apache-maven-3.2.1/lib/slf4j-simple-1.7.5.jar!/org/slf4j/impl/StaticLoggerBinder.class]
SLF4J: See http://www.slf4j.org/codes.html#multiple_bindings for an explanation.
[DEBUG] Connected to remote
[INFO] Error stacktraces are turned on.
[INFO] Scanning for projects...
[INFO] 
[INFO] Using the builder org.apache.maven.lifecycle.internal.builder.singlethreaded.SingleThreadedBuilder with a thread count of 1
[INFO]                                                                         
[INFO] ------------------------------------------------------------------------
[INFO] Building org.eclipse.emf.compare.rcptt.test 4.0.0-SNAPSHOT
[INFO] ------------------------------------------------------------------------
Downloading: https://repo.eclipse.org/content/repositories/rcptt-releases/org/apache/maven/plugins/maven-install-plugin/maven-metadata.xml
Downloading: https://repo.eclipse.org/content/repositories/rcptt-releases/org/apache/maven/plugins/maven-deploy-plugin/maven-metadata.xml
[INFO] 
[INFO] --- maven-clean-plugin:2.5:clean (default-clean) @ org.eclipse.emf.compare.rcptt.test ---
[INFO] Deleting /jobs/genie.emfcompare/master-rcptt-nightly/workspace/PLATFORM/luna/plugins/org.eclipse.emf.compare.rcptt.tests/target
[INFO] 
[INFO] --- exec-maven-plugin:1.2.1:exec (AUT Generation) @ org.eclipse.emf.compare.rcptt.test ---
Downloading https://github.com/mbarbero/p2-admin/releases/download/v1.1.0/p2-admin-1.1.0-linux.gtk.x86_64.tar.gz
Unzipping p2-admin-1.1.0-linux.gtk.x86_64.tar.gz

gzip: stdin: unexpected end of file
tar: Child returned status 1
tar: Error is not recoverable: exiting now
Downloading http://download.eclipse.org/eclipse/downloads/drops4/R-4.4.2-201502041700/eclipse-SDK-4.4.2-linux-gtk-x86_64.tar.gz
Unzipping eclipse-SDK-4.4.2-linux-gtk-x86_64.tar.gz
Provisioning AUT
  Repositories: http://download.eclipse.org/releases/luna/,http://download.eclipse.org/modeling/emf/compare/updates/nightly/latest/,http://download.eclipse.org/modeling/emf/compare/updates/egit-logical/nightly/
  IUs: org.eclipse.emf.compare.ide.ui.feature.group,org.eclipse.egit.feature.group,org.eclipse.emf.sdk.feature.group,org.eclipse.uml2.uml.feature.group,org.eclipse.papyrus.sdk.feature.feature.group,org.eclipse.emf.compare.uml2.feature.group,org.eclipse.emf.compare.diagram.gmf.feature.group,org.eclipse.emf.compare.diagram.papyrus.feature.group,org.eclipse.emf.compare.egit.feature.group
/jobs/genie.emfcompare/master-rcptt-nightly/workspace/PLATFORM/luna/plugins/org.eclipse.emf.compare.rcptt.tests/createAUT.sh: line 164: /jobs/genie.emfcompare/master-rcptt-nightly/workspace/PLATFORM/luna/plugins/org.eclipse.emf.compare.rcptt.tests/target/p2-admin/p2-admin: No such file or directory
[INFO] ------------------------------------------------------------------------
[INFO] BUILD FAILURE
[INFO] ------------------------------------------------------------------------
[INFO] Total time: 01:06 h
[INFO] Finished at: 2016-02-29T21:26:58-05:00
[INFO] Final Memory: 30M/1932M
[INFO] ------------------------------------------------------------------------
[INFO] o.h.m.e.h.MavenExecutionResultHandler - Build failed with exception(s)
[INFO] o.h.m.e.h.MavenExecutionResultHandler - [1] org.apache.maven.lifecycle.LifecycleExecutionException: Failed to execute goal org.codehaus.mojo:exec-maven-plugin:1.2.1:exec (AUT Generation) on project org.eclipse.emf.compare.rcptt.test: Command execution failed.
[DEBUG] Closing connection to remote
[ERROR] Failed to execute goal org.codehaus.mojo:exec-maven-plugin:1.2.1:exec (AUT Generation) on project org.eclipse.emf.compare.rcptt.test: Command execution failed. Process exited with an error: 127 (Exit value: 127) -> [Help 1]
org.apache.maven.lifecycle.LifecycleExecutionException: Failed to execute goal org.codehaus.mojo:exec-maven-plugin:1.2.1:exec (AUT Generation) on project org.eclipse.emf.compare.rcptt.test: Command execution failed.
	at org.apache.maven.lifecycle.internal.MojoExecutor.execute(MojoExecutor.java:216)
	at org.apache.maven.lifecycle.internal.MojoExecutor.execute(MojoExecutor.java:153)
	at org.apache.maven.lifecycle.internal.MojoExecutor.execute(MojoExecutor.java:145)
	at org.apache.maven.lifecycle.internal.LifecycleModuleBuilder.buildProject(LifecycleModuleBuilder.java:108)
	at org.apache.maven.lifecycle.internal.LifecycleModuleBuilder.buildProject(LifecycleModuleBuilder.java:76)
	at org.apache.maven.lifecycle.internal.builder.singlethreaded.SingleThreadedBuilder.build(SingleThreadedBuilder.java:51)
	at org.apache.maven.lifecycle.internal.LifecycleStarter.execute(LifecycleStarter.java:116)
	at org.apache.maven.DefaultMaven.doExecute(DefaultMaven.java:361)
	at org.apache.maven.DefaultMaven.execute(DefaultMaven.java:155)
	at org.apache.maven.cli.MavenCli.execute(MavenCli.java:584)
	at org.apache.maven.cli.MavenCli.doMain(MavenCli.java:213)
	at org.apache.maven.cli.MavenCli.main(MavenCli.java:157)
	at sun.reflect.NativeMethodAccessorImpl.invoke0(Native Method)
	at sun.reflect.NativeMethodAccessorImpl.invoke(NativeMethodAccessorImpl.java:57)
	at sun.reflect.DelegatingMethodAccessorImpl.invoke(DelegatingMethodAccessorImpl.java:43)
	at java.lang.reflect.Method.invoke(Method.java:606)
	at org.codehaus.plexus.classworlds.launcher.Launcher.launchEnhanced(Launcher.java:289)
	at org.codehaus.plexus.classworlds.launcher.Launcher.launch(Launcher.java:229)
	at org.codehaus.plexus.classworlds.launcher.Launcher.mainWithExitCode(Launcher.java:415)
	at org.codehaus.plexus.classworlds.launcher.Launcher.main(Launcher.java:356)
Caused by: org.apache.maven.plugin.MojoExecutionException: Command execution failed.
	at org.codehaus.mojo.exec.ExecMojo.execute(ExecMojo.java:362)
	at org.apache.maven.plugin.DefaultBuildPluginManager.executeMojo(DefaultBuildPluginManager.java:133)
	at org.apache.maven.lifecycle.internal.MojoExecutor.execute(MojoExecutor.java:208)
	... 19 more
Caused by: org.apache.commons.exec.ExecuteException: Process exited with an error: 127 (Exit value: 127)
	at org.apache.commons.exec.DefaultExecutor.executeInternal(DefaultExecutor.java:377)
	at org.apache.commons.exec.DefaultExecutor.execute(DefaultExecutor.java:160)
	at org.codehaus.mojo.exec.ExecMojo.executeCommandLine(ExecMojo.java:610)
	at org.codehaus.mojo.exec.ExecMojo.execute(ExecMojo.java:352)
	... 21 more
[ERROR] 
[ERROR] Re-run Maven using the -X switch to enable full debug logging.
[ERROR] 
[ERROR] For more information about the errors and possible solutions, please read the following articles:
[ERROR] [Help 1] http://cwiki.apache.org/confluence/display/MAVEN/MojoExecutionException
[DEBUG] Waiting for process to finish
[DEBUG] Result: 1
Terminating xvnc.
Recording test results

--
This message is automatically generated by Hudson. 
For more information on Hudson, see: http://hudson-ci.org/


Back to the top