[Date Prev][Date Next][Thread Prev][Thread Next][Date Index][Thread Index] [List Home]
[wtp-releng] Build failed in Jenkins: webtools-jsdt_master #292

See <https://ci.eclipse.org/webtools/job/webtools-jsdt_master/292/display/redirect>

------------------------------------------
[...truncated 4.52 MB...]
[INFO] Installing /jobs/genie.webtools/webtools-jsdt_master/workspace/features/org.eclipse.wst.jsdt.chromium.debug.feature/pom.xml to <https://ci.eclipse.org/webtools/job/webtools-jsdt_master/ws/.repository/org/eclipse/webtools/jsdt/features/org.eclipse.wst.jsdt.chromium.debug.feature/0.6.0-SNAPSHOT/org.eclipse.wst.jsdt.chromium.debug.feature-0.6.0-SNAPSHOT.pom>
[INFO] Installing /jobs/genie.webtools/webtools-jsdt_master/workspace/features/org.eclipse.wst.jsdt.chromium.debug.feature/target/org.eclipse.wst.jsdt.chromium.debug.feature-0.6.0-SNAPSHOT-sources-feature.jar to <https://ci.eclipse.org/webtools/job/webtools-jsdt_master/ws/.repository/org/eclipse/webtools/jsdt/features/org.eclipse.wst.jsdt.chromium.debug.feature/0.6.0-SNAPSHOT/org.eclipse.wst.jsdt.chromium.debug.feature-0.6.0-SNAPSHOT-sources-feature.jar>
[INFO] Installing /jobs/genie.webtools/webtools-jsdt_master/workspace/features/org.eclipse.wst.jsdt.chromium.debug.feature/target/p2content.xml to <https://ci.eclipse.org/webtools/job/webtools-jsdt_master/ws/.repository/org/eclipse/webtools/jsdt/features/org.eclipse.wst.jsdt.chromium.debug.feature/0.6.0-SNAPSHOT/org.eclipse.wst.jsdt.chromium.debug.feature-0.6.0-SNAPSHOT-p2metadata.xml>
[INFO] Installing /jobs/genie.webtools/webtools-jsdt_master/workspace/features/org.eclipse.wst.jsdt.chromium.debug.feature/target/p2artifacts.xml to <https://ci.eclipse.org/webtools/job/webtools-jsdt_master/ws/.repository/org/eclipse/webtools/jsdt/features/org.eclipse.wst.jsdt.chromium.debug.feature/0.6.0-SNAPSHOT/org.eclipse.wst.jsdt.chromium.debug.feature-0.6.0-SNAPSHOT-p2artifacts.xml>
[INFO] Installing /jobs/genie.webtools/webtools-jsdt_master/workspace/features/org.eclipse.wst.jsdt.chromium.debug.feature/target/p2content.xml to <https://ci.eclipse.org/webtools/job/webtools-jsdt_master/ws/.repository/org/eclipse/webtools/jsdt/features/org.eclipse.wst.jsdt.chromium.debug.feature/0.6.0-SNAPSHOT/org.eclipse.wst.jsdt.chromium.debug.feature-0.6.0-SNAPSHOT-p2metadata.xml>
[INFO] Installing /jobs/genie.webtools/webtools-jsdt_master/workspace/features/org.eclipse.wst.jsdt.chromium.debug.feature/target/p2artifacts.xml to <https://ci.eclipse.org/webtools/job/webtools-jsdt_master/ws/.repository/org/eclipse/webtools/jsdt/features/org.eclipse.wst.jsdt.chromium.debug.feature/0.6.0-SNAPSHOT/org.eclipse.wst.jsdt.chromium.debug.feature-0.6.0-SNAPSHOT-p2artifacts.xml>
[INFO] 
[INFO] --- tycho-p2-plugin:1.2.0:update-local-index (default-update-local-index) @ org.eclipse.wst.jsdt.chromium.debug.feature ---
[INFO] 
[INFO] --< org.eclipse.webtools.jsdt.features:org.eclipse.wst.jsdt.chromium_sdk.feature >--
[INFO] Building org.eclipse.wst.jsdt.chromium_sdk.feature 0.6.0-SNAPSHOT [46/53]
[INFO] --------------------------[ eclipse-feature ]---------------------------
[INFO] 
[INFO] --- maven-clean-plugin:2.5:clean (default-clean) @ org.eclipse.wst.jsdt.chromium_sdk.feature ---
[INFO] 
[INFO] --- tycho-packaging-plugin:1.2.0:build-qualifier-aggregator (default-build-qualifier-aggregator) @ org.eclipse.wst.jsdt.chromium_sdk.feature ---
[INFO] The project's OSGi version is 0.6.0.v201705091354
[INFO] 
[INFO] --- tycho-packaging-plugin:1.2.0:validate-id (default-validate-id) @ org.eclipse.wst.jsdt.chromium_sdk.feature ---
[INFO] 
[INFO] --- tycho-packaging-plugin:1.2.0:validate-version (default-validate-version) @ org.eclipse.wst.jsdt.chromium_sdk.feature ---
[INFO] 
[INFO] --- build-helper-maven-plugin:3.0.0:regex-property (regex-property) @ org.eclipse.wst.jsdt.chromium_sdk.feature ---
[INFO] 
[INFO] --- tycho-source-plugin:1.2.0:plugin-source (plugin-source) @ org.eclipse.wst.jsdt.chromium_sdk.feature ---
[INFO] 
[INFO] --- target-platform-configuration:1.2.0:target-platform (default-target-platform) @ org.eclipse.wst.jsdt.chromium_sdk.feature ---
[INFO] 
[INFO] --- tycho-packaging-plugin:1.2.0:package-feature (default-package-feature) @ org.eclipse.wst.jsdt.chromium_sdk.feature ---
[INFO] Building jar: /jobs/genie.webtools/webtools-jsdt_master/workspace/features/org.eclipse.wst.jsdt.chromium_sdk.feature/target/org.eclipse.wst.jsdt.chromium_sdk.feature-0.6.0-SNAPSHOT.jar
[INFO] 
[INFO] --- tycho-p2-plugin:1.2.0:p2-metadata-default (default-p2-metadata-default) @ org.eclipse.wst.jsdt.chromium_sdk.feature ---
[INFO] 
[INFO] --- tycho-p2-plugin:1.2.0:feature-p2-metadata (default-feature-p2-metadata) @ org.eclipse.wst.jsdt.chromium_sdk.feature ---
[INFO] 
[INFO] --- tycho-pack200a-plugin:1.2.0:normalize (pack200-normalize) @ org.eclipse.wst.jsdt.chromium_sdk.feature ---
[INFO] 
[INFO] --- eclipse-jarsigner-plugin:1.1.4:sign (sign) @ org.eclipse.wst.jsdt.chromium_sdk.feature ---
[INFO] Signing jar: /jobs/genie.webtools/webtools-jsdt_master/workspace/features/org.eclipse.wst.jsdt.chromium_sdk.feature/target/org.eclipse.wst.jsdt.chromium_sdk.feature-0.6.0-SNAPSHOT.jar
[INFO] 
[INFO] --- tycho-pack200b-plugin:1.2.0:pack (pack200-pack) @ org.eclipse.wst.jsdt.chromium_sdk.feature ---
[INFO] 
[INFO] --- tycho-p2-plugin:1.2.0:p2-metadata (p2-metadata) @ org.eclipse.wst.jsdt.chromium_sdk.feature ---
[INFO] No baseline version MavenProject: org.eclipse.webtools.jsdt.features:org.eclipse.wst.jsdt.chromium_sdk.feature:0.6.0-SNAPSHOT @ /jobs/genie.webtools/webtools-jsdt_master/workspace/features/org.eclipse.wst.jsdt.chromium_sdk.feature/pom.xml
[INFO] 
[INFO] --- maven-install-plugin:2.3.1:install (default-install) @ org.eclipse.wst.jsdt.chromium_sdk.feature ---
[INFO] Installing /jobs/genie.webtools/webtools-jsdt_master/workspace/features/org.eclipse.wst.jsdt.chromium_sdk.feature/target/org.eclipse.wst.jsdt.chromium_sdk.feature-0.6.0-SNAPSHOT.jar to <https://ci.eclipse.org/webtools/job/webtools-jsdt_master/ws/.repository/org/eclipse/webtools/jsdt/features/org.eclipse.wst.jsdt.chromium_sdk.feature/0.6.0-SNAPSHOT/org.eclipse.wst.jsdt.chromium_sdk.feature-0.6.0-SNAPSHOT.jar>
[INFO] Installing /jobs/genie.webtools/webtools-jsdt_master/workspace/features/org.eclipse.wst.jsdt.chromium_sdk.feature/pom.xml to <https://ci.eclipse.org/webtools/job/webtools-jsdt_master/ws/.repository/org/eclipse/webtools/jsdt/features/org.eclipse.wst.jsdt.chromium_sdk.feature/0.6.0-SNAPSHOT/org.eclipse.wst.jsdt.chromium_sdk.feature-0.6.0-SNAPSHOT.pom>
[INFO] Installing /jobs/genie.webtools/webtools-jsdt_master/workspace/features/org.eclipse.wst.jsdt.chromium_sdk.feature/target/p2content.xml to <https://ci.eclipse.org/webtools/job/webtools-jsdt_master/ws/.repository/org/eclipse/webtools/jsdt/features/org.eclipse.wst.jsdt.chromium_sdk.feature/0.6.0-SNAPSHOT/org.eclipse.wst.jsdt.chromium_sdk.feature-0.6.0-SNAPSHOT-p2metadata.xml>
[INFO] Installing /jobs/genie.webtools/webtools-jsdt_master/workspace/features/org.eclipse.wst.jsdt.chromium_sdk.feature/target/p2artifacts.xml to <https://ci.eclipse.org/webtools/job/webtools-jsdt_master/ws/.repository/org/eclipse/webtools/jsdt/features/org.eclipse.wst.jsdt.chromium_sdk.feature/0.6.0-SNAPSHOT/org.eclipse.wst.jsdt.chromium_sdk.feature-0.6.0-SNAPSHOT-p2artifacts.xml>
[INFO] 
[INFO] --- tycho-p2-plugin:1.2.0:update-local-index (default-update-local-index) @ org.eclipse.wst.jsdt.chromium_sdk.feature ---
[INFO] 
[INFO] --< org.eclipse.webtools.jsdt.features:org.eclipse.wst.jsdt.chromium_tests.feature >--
[INFO] Building org.eclipse.wst.jsdt.chromium_tests.feature 0.6.0-SNAPSHOT [47/53]
[INFO] --------------------------[ eclipse-feature ]---------------------------
[INFO] 
[INFO] --- maven-clean-plugin:2.5:clean (default-clean) @ org.eclipse.wst.jsdt.chromium_tests.feature ---
[INFO] 
[INFO] --- tycho-packaging-plugin:1.2.0:build-qualifier-aggregator (default-build-qualifier-aggregator) @ org.eclipse.wst.jsdt.chromium_tests.feature ---
[INFO] The project's OSGi version is 0.6.0.v201802281510
[INFO] 
[INFO] --- tycho-packaging-plugin:1.2.0:validate-id (default-validate-id) @ org.eclipse.wst.jsdt.chromium_tests.feature ---
[INFO] 
[INFO] --- tycho-packaging-plugin:1.2.0:validate-version (default-validate-version) @ org.eclipse.wst.jsdt.chromium_tests.feature ---
[INFO] 
[INFO] --- build-helper-maven-plugin:3.0.0:regex-property (regex-property) @ org.eclipse.wst.jsdt.chromium_tests.feature ---
[INFO] 
[INFO] --- tycho-source-plugin:1.2.0:plugin-source (plugin-source) @ org.eclipse.wst.jsdt.chromium_tests.feature ---
[INFO] 
[INFO] --- target-platform-configuration:1.2.0:target-platform (default-target-platform) @ org.eclipse.wst.jsdt.chromium_tests.feature ---
[INFO] 
[INFO] --- tycho-packaging-plugin:1.2.0:package-feature (default-package-feature) @ org.eclipse.wst.jsdt.chromium_tests.feature ---
[INFO] Building jar: /jobs/genie.webtools/webtools-jsdt_master/workspace/features/org.eclipse.wst.jsdt.chromium_tests.feature/target/org.eclipse.wst.jsdt.chromium_tests.feature-0.6.0-SNAPSHOT.jar
[INFO] 
[INFO] --- tycho-p2-plugin:1.2.0:p2-metadata-default (default-p2-metadata-default) @ org.eclipse.wst.jsdt.chromium_tests.feature ---
[INFO] 
[INFO] --- tycho-p2-plugin:1.2.0:feature-p2-metadata (default-feature-p2-metadata) @ org.eclipse.wst.jsdt.chromium_tests.feature ---
[INFO] 
[INFO] --- tycho-pack200a-plugin:1.2.0:normalize (pack200-normalize) @ org.eclipse.wst.jsdt.chromium_tests.feature ---
[INFO] 
[INFO] --- eclipse-jarsigner-plugin:1.1.4:sign (sign) @ org.eclipse.wst.jsdt.chromium_tests.feature ---
[INFO] Signing jar: /jobs/genie.webtools/webtools-jsdt_master/workspace/features/org.eclipse.wst.jsdt.chromium_tests.feature/target/org.eclipse.wst.jsdt.chromium_tests.feature-0.6.0-SNAPSHOT.jar
[INFO] 
[INFO] --- tycho-pack200b-plugin:1.2.0:pack (pack200-pack) @ org.eclipse.wst.jsdt.chromium_tests.feature ---
[INFO] 
[INFO] --- tycho-p2-plugin:1.2.0:p2-metadata (p2-metadata) @ org.eclipse.wst.jsdt.chromium_tests.feature ---
[INFO] No baseline version MavenProject: org.eclipse.webtools.jsdt.features:org.eclipse.wst.jsdt.chromium_tests.feature:0.6.0-SNAPSHOT @ /jobs/genie.webtools/webtools-jsdt_master/workspace/features/org.eclipse.wst.jsdt.chromium_tests.feature/pom.xml
[INFO] 
[INFO] --- maven-install-plugin:2.3.1:install (default-install) @ org.eclipse.wst.jsdt.chromium_tests.feature ---
[INFO] Installing /jobs/genie.webtools/webtools-jsdt_master/workspace/features/org.eclipse.wst.jsdt.chromium_tests.feature/target/org.eclipse.wst.jsdt.chromium_tests.feature-0.6.0-SNAPSHOT.jar to <https://ci.eclipse.org/webtools/job/webtools-jsdt_master/ws/.repository/org/eclipse/webtools/jsdt/features/org.eclipse.wst.jsdt.chromium_tests.feature/0.6.0-SNAPSHOT/org.eclipse.wst.jsdt.chromium_tests.feature-0.6.0-SNAPSHOT.jar>
[INFO] Installing /jobs/genie.webtools/webtools-jsdt_master/workspace/features/org.eclipse.wst.jsdt.chromium_tests.feature/pom.xml to <https://ci.eclipse.org/webtools/job/webtools-jsdt_master/ws/.repository/org/eclipse/webtools/jsdt/features/org.eclipse.wst.jsdt.chromium_tests.feature/0.6.0-SNAPSHOT/org.eclipse.wst.jsdt.chromium_tests.feature-0.6.0-SNAPSHOT.pom>
[INFO] Installing /jobs/genie.webtools/webtools-jsdt_master/workspace/features/org.eclipse.wst.jsdt.chromium_tests.feature/target/p2content.xml to <https://ci.eclipse.org/webtools/job/webtools-jsdt_master/ws/.repository/org/eclipse/webtools/jsdt/features/org.eclipse.wst.jsdt.chromium_tests.feature/0.6.0-SNAPSHOT/org.eclipse.wst.jsdt.chromium_tests.feature-0.6.0-SNAPSHOT-p2metadata.xml>
[INFO] Installing /jobs/genie.webtools/webtools-jsdt_master/workspace/features/org.eclipse.wst.jsdt.chromium_tests.feature/target/p2artifacts.xml to <https://ci.eclipse.org/webtools/job/webtools-jsdt_master/ws/.repository/org/eclipse/webtools/jsdt/features/org.eclipse.wst.jsdt.chromium_tests.feature/0.6.0-SNAPSHOT/org.eclipse.wst.jsdt.chromium_tests.feature-0.6.0-SNAPSHOT-p2artifacts.xml>
[INFO] 
[INFO] --- tycho-p2-plugin:1.2.0:update-local-index (default-update-local-index) @ org.eclipse.wst.jsdt.chromium_tests.feature ---
[INFO] 
[INFO] --< org.eclipse.webtools.jsdt.features:org.eclipse.wst.jsdt_tests.feature >--
[INFO] Building org.eclipse.wst.jsdt_tests.feature 2.1.2-SNAPSHOT       [48/53]
[INFO] --------------------------[ eclipse-feature ]---------------------------
[INFO] 
[INFO] --- maven-clean-plugin:2.5:clean (default-clean) @ org.eclipse.wst.jsdt_tests.feature ---
[INFO] 
[INFO] --- tycho-packaging-plugin:1.2.0:build-qualifier-aggregator (default-build-qualifier-aggregator) @ org.eclipse.wst.jsdt_tests.feature ---
[INFO] The project's OSGi version is 2.1.2.v201802281510
[INFO] 
[INFO] --- tycho-packaging-plugin:1.2.0:validate-id (default-validate-id) @ org.eclipse.wst.jsdt_tests.feature ---
[INFO] 
[INFO] --- tycho-packaging-plugin:1.2.0:validate-version (default-validate-version) @ org.eclipse.wst.jsdt_tests.feature ---
[INFO] 
[INFO] --- build-helper-maven-plugin:3.0.0:regex-property (regex-property) @ org.eclipse.wst.jsdt_tests.feature ---
[INFO] 
[INFO] --- tycho-source-plugin:1.2.0:plugin-source (plugin-source) @ org.eclipse.wst.jsdt_tests.feature ---
[INFO] 
[INFO] --- target-platform-configuration:1.2.0:target-platform (default-target-platform) @ org.eclipse.wst.jsdt_tests.feature ---
[INFO] 
[INFO] --- tycho-packaging-plugin:1.2.0:package-feature (default-package-feature) @ org.eclipse.wst.jsdt_tests.feature ---
[INFO] Building jar: /jobs/genie.webtools/webtools-jsdt_master/workspace/features/org.eclipse.wst.jsdt_tests.feature/target/org.eclipse.wst.jsdt_tests.feature-2.1.2-SNAPSHOT.jar
[INFO] 
[INFO] --- tycho-p2-plugin:1.2.0:p2-metadata-default (default-p2-metadata-default) @ org.eclipse.wst.jsdt_tests.feature ---
[INFO] 
[INFO] --- tycho-p2-plugin:1.2.0:feature-p2-metadata (default-feature-p2-metadata) @ org.eclipse.wst.jsdt_tests.feature ---
[INFO] 
[INFO] --- tycho-pack200a-plugin:1.2.0:normalize (pack200-normalize) @ org.eclipse.wst.jsdt_tests.feature ---
[INFO] 
[INFO] --- eclipse-jarsigner-plugin:1.1.4:sign (sign) @ org.eclipse.wst.jsdt_tests.feature ---
[INFO] Signing jar: /jobs/genie.webtools/webtools-jsdt_master/workspace/features/org.eclipse.wst.jsdt_tests.feature/target/org.eclipse.wst.jsdt_tests.feature-2.1.2-SNAPSHOT.jar
[INFO] 
[INFO] --- tycho-pack200b-plugin:1.2.0:pack (pack200-pack) @ org.eclipse.wst.jsdt_tests.feature ---
[INFO] 
[INFO] --- tycho-p2-plugin:1.2.0:p2-metadata (p2-metadata) @ org.eclipse.wst.jsdt_tests.feature ---
[INFO] No baseline version MavenProject: org.eclipse.webtools.jsdt.features:org.eclipse.wst.jsdt_tests.feature:2.1.2-SNAPSHOT @ /jobs/genie.webtools/webtools-jsdt_master/workspace/features/org.eclipse.wst.jsdt_tests.feature/pom.xml
[INFO] 
[INFO] --- maven-install-plugin:2.3.1:install (default-install) @ org.eclipse.wst.jsdt_tests.feature ---
[INFO] Installing /jobs/genie.webtools/webtools-jsdt_master/workspace/features/org.eclipse.wst.jsdt_tests.feature/target/org.eclipse.wst.jsdt_tests.feature-2.1.2-SNAPSHOT.jar to <https://ci.eclipse.org/webtools/job/webtools-jsdt_master/ws/.repository/org/eclipse/webtools/jsdt/features/org.eclipse.wst.jsdt_tests.feature/2.1.2-SNAPSHOT/org.eclipse.wst.jsdt_tests.feature-2.1.2-SNAPSHOT.jar>
[INFO] Installing /jobs/genie.webtools/webtools-jsdt_master/workspace/features/org.eclipse.wst.jsdt_tests.feature/pom.xml to <https://ci.eclipse.org/webtools/job/webtools-jsdt_master/ws/.repository/org/eclipse/webtools/jsdt/features/org.eclipse.wst.jsdt_tests.feature/2.1.2-SNAPSHOT/org.eclipse.wst.jsdt_tests.feature-2.1.2-SNAPSHOT.pom>
[INFO] Installing /jobs/genie.webtools/webtools-jsdt_master/workspace/features/org.eclipse.wst.jsdt_tests.feature/target/p2content.xml to <https://ci.eclipse.org/webtools/job/webtools-jsdt_master/ws/.repository/org/eclipse/webtools/jsdt/features/org.eclipse.wst.jsdt_tests.feature/2.1.2-SNAPSHOT/org.eclipse.wst.jsdt_tests.feature-2.1.2-SNAPSHOT-p2metadata.xml>
[INFO] Installing /jobs/genie.webtools/webtools-jsdt_master/workspace/features/org.eclipse.wst.jsdt_tests.feature/target/p2artifacts.xml to <https://ci.eclipse.org/webtools/job/webtools-jsdt_master/ws/.repository/org/eclipse/webtools/jsdt/features/org.eclipse.wst.jsdt_tests.feature/2.1.2-SNAPSHOT/org.eclipse.wst.jsdt_tests.feature-2.1.2-SNAPSHOT-p2artifacts.xml>
[INFO] 
[INFO] --- tycho-p2-plugin:1.2.0:update-local-index (default-update-local-index) @ org.eclipse.wst.jsdt_tests.feature ---
[INFO] 
[INFO] ------------------------------------------------------------------------
[INFO] Skipping org.eclipse.wst.jsdt.nodejs.feature
[INFO] This project has been banned from the build due to previous failures.
[INFO] ------------------------------------------------------------------------
[INFO] 
[INFO] ------------------------------------------------------------------------
[INFO] Skipping org.eclipse.wst.jsdt.feature
[INFO] This project has been banned from the build due to previous failures.
[INFO] ------------------------------------------------------------------------
[INFO] 
[INFO] ------------------------------------------------------------------------
[INFO] Skipping org.eclipse.wst.jsdt_sdk.feature
[INFO] This project has been banned from the build due to previous failures.
[INFO] ------------------------------------------------------------------------
[INFO] 
[INFO] ------------------------------------------------------------------------
[INFO] Skipping org.eclipse.webtools.jsdt.site
[INFO] This project has been banned from the build due to previous failures.
[INFO] ------------------------------------------------------------------------
[INFO] ------------------------------------------------------------------------
[INFO] Reactor Summary:
[INFO] 
[INFO] jsdt-parent 3.6.0-SNAPSHOT ......................... SUCCESS [ 49.967 s]
[INFO] bundles ............................................ SUCCESS [  0.035 s]
[INFO] org.eclipse.wst.jsdt.core 2.0.302-SNAPSHOT ......... SUCCESS [01:03 min]
[INFO] org.eclipse.wst.jsdt.manipulation 1.0.601-SNAPSHOT . SUCCESS [  4.063 s]
[INFO] org.eclipse.wst.jsdt.ui 2.0.301-SNAPSHOT ........... SUCCESS [01:35 min]
[INFO] org.eclipse.wst.jsdt.support.firefox 1.0.501-SNAPSHOT SUCCESS [  5.512 s]
[INFO] org.eclipse.wst.jsdt.support.ie 1.0.601-SNAPSHOT ... SUCCESS [ 29.300 s]
[INFO] org.eclipse.wst.jsdt.debug.core 3.2.200-SNAPSHOT ... SUCCESS [ 14.249 s]
[INFO] org.eclipse.wst.jsdt.debug.transport 1.0.300-SNAPSHOT SUCCESS [  4.931 s]
[INFO] org.eclipse.wst.jsdt.debug.crossfire 1.0.500-SNAPSHOT SUCCESS [ 11.464 s]
[INFO] org.eclipse.wst.jsdt.debug.rhino.debugger 1.0.600-SNAPSHOT SUCCESS [  6.679 s]
[INFO] org.eclipse.wst.jsdt.debug.rhino 1.0.500-SNAPSHOT .. SUCCESS [  8.678 s]
[INFO] org.eclipse.wst.jsdt.debug.ui 1.0.600-SNAPSHOT ..... SUCCESS [ 18.629 s]
[INFO] org.eclipse.wst.jsdt.debug.rhino.ui 1.0.500-SNAPSHOT SUCCESS [  8.099 s]
[INFO] org.eclipse.wst.jsdt.chromium.debug 0.4.0-SNAPSHOT . SUCCESS [  2.770 s]
[INFO] org.eclipse.wst.jsdt.chromium 0.5.200-SNAPSHOT ..... SUCCESS [ 47.982 s]
[INFO] org.eclipse.wst.jsdt.chromium.debug.core 0.5.300-SNAPSHOT SUCCESS [  5.917 s]
[INFO] org.eclipse.wst.jsdt.chromium.debug.jsdtbridge 0.5.200-SNAPSHOT SUCCESS [  2.703 s]
[INFO] org.eclipse.wst.jsdt.chromium.wip.eclipse 0.5.200-SNAPSHOT SUCCESS [  2.568 s]
[INFO] org.eclipse.wst.jsdt.chromium.debug.ui 0.6.200-SNAPSHOT SUCCESS [  5.560 s]
[INFO] org.eclipse.wst.jsdt.chromium.debug.js 0.1.200-SNAPSHOT SUCCESS [  2.924 s]
[INFO] org.eclipse.wst.jsdt.chromium.wipbackend.dev 0.5.200-SNAPSHOT SUCCESS [ 15.021 s]
[INFO] org.eclipse.wst.jsdt.chromium.wipbackend.protocol_1_0 0.5.200-SNAPSHOT SUCCESS [  7.942 s]
[INFO] nodejs ............................................. SUCCESS [  0.034 s]
[INFO] org.eclipse.wst.jsdt.js.cli 1.0.0-SNAPSHOT ......... SUCCESS [  5.798 s]
[INFO] org.eclipse.wst.jsdt.js.common 1.0.200-SNAPSHOT .... SUCCESS [ 17.120 s]
[INFO] org.eclipse.wst.jsdt.js.bower 1.0.200-SNAPSHOT ..... SUCCESS [  4.190 s]
[INFO] org.eclipse.wst.jsdt.js.npm 1.0.300-SNAPSHOT ....... SUCCESS [  3.863 s]
[INFO] org.eclipse.wst.jsdt.js.grunt 1.0.200-SNAPSHOT ..... SUCCESS [  6.837 s]
[INFO] org.eclipse.wst.jsdt.js.gulp 1.0.200-SNAPSHOT ...... FAILURE [  4.262 s]
[INFO] org.eclipse.wst.jsdt.js.node.common 1.0.0-SNAPSHOT . SUCCESS [  4.822 s]
[INFO] org.eclipse.wst.jsdt.js.node 1.1.100-SNAPSHOT ...... SUCCESS [  9.572 s]
[INFO] docs ............................................... SUCCESS [  0.035 s]
[INFO] org.eclipse.wst.jsdt.doc 2.0.200-SNAPSHOT .......... SUCCESS [03:44 min]
[INFO] tests .............................................. SUCCESS [  0.044 s]
[INFO] org.eclipse.wst.jsdt.core.tests.compiler 2.0.201-SNAPSHOT SUCCESS [01:27 min]
[INFO] org.eclipse.wst.jsdt.core.tests.model 2.0.201-SNAPSHOT SUCCESS [04:02 min]
[INFO] org.eclipse.wst.jsdt.debug.core.tests 1.0.401-SNAPSHOT SUCCESS [ 10.329 s]
[INFO] org.eclipse.wst.jsdt.debug.rhino.tests 1.0.701-SNAPSHOT SUCCESS [ 32.241 s]
[INFO] org.eclipse.wst.jsdt.ui.tests 1.1.501-SNAPSHOT ..... SUCCESS [ 19.119 s]
[INFO] org.eclipse.wst.jsdt.chromium.tests 0.5.201-SNAPSHOT SUCCESS [ 13.573 s]
[INFO] org.eclipse.wst.jsdt.chromium.debug.core.tests 0.5.201-SNAPSHOT SUCCESS [  9.720 s]
[INFO] org.eclipse.wst.jsdt.js.common.tests 1.0.201-SNAPSHOT SKIPPED
[INFO] org.eclipse.wst.jsdt.js.node.common.tests 1.0.1-SNAPSHOT SUCCESS [  9.001 s]
[INFO] features ........................................... SUCCESS [  0.030 s]
[INFO] org.eclipse.wst.jsdt.chromium.debug.feature 0.6.0-SNAPSHOT SUCCESS [  2.710 s]
[INFO] org.eclipse.wst.jsdt.chromium_sdk.feature 0.6.0-SNAPSHOT SUCCESS [  1.024 s]
[INFO] org.eclipse.wst.jsdt.chromium_tests.feature 0.6.0-SNAPSHOT SUCCESS [  1.049 s]
[INFO] org.eclipse.wst.jsdt_tests.feature 2.1.2-SNAPSHOT .. SUCCESS [  1.142 s]
[INFO] org.eclipse.wst.jsdt.nodejs.feature 1.1.0-SNAPSHOT . SKIPPED
[INFO] org.eclipse.wst.jsdt.feature 2.1.1-SNAPSHOT ........ SKIPPED
[INFO] org.eclipse.wst.jsdt_sdk.feature 2.1.1-SNAPSHOT .... SKIPPED
[INFO] org.eclipse.webtools.jsdt.site 3.6.0-SNAPSHOT ...... SKIPPED
[INFO] ------------------------------------------------------------------------
[INFO] BUILD FAILURE
[INFO] ------------------------------------------------------------------------
[INFO] Total time: 24:05 min
[INFO] Finished at: 2018-10-13T01:11:58-04:00
[INFO] ------------------------------------------------------------------------
[ERROR] Failed to execute goal org.eclipse.tycho:tycho-p2-plugin:1.2.0:p2-metadata (p2-metadata) on project org.eclipse.wst.jsdt.js.gulp: Execution p2-metadata of goal org.eclipse.tycho:tycho-p2-plugin:1.2.0:p2-metadata failed: Error trying to download org.eclipse.wst.jsdt.js.gulp version 1.0.200.v201610211901 from http://archive.eclipse.org/webtools/downloads/drops/R3.8/R3.8.2/R-3.8.2-20170308000057/repository:
[ERROR] Retry another mirror:
[ERROR]    Unable to connect to repository http://archive.eclipse.org/webtools/downloads/drops/R3.8/R3.8.2/R-3.8.2-20170308000057/repository/plugins/org.eclipse.wst.jsdt.js.gulp_1.0.200.v201610211901.jar.pack.gz: Connection refused (Connection refused)
[ERROR] -> [Help 1]
[ERROR] 
[ERROR] To see the full stack trace of the errors, re-run Maven with the -e switch.
[ERROR] Re-run Maven using the -X switch to enable full debug logging.
[ERROR] 
[ERROR] For more information about the errors and possible solutions, please read the following articles:
[ERROR] [Help 1] http://cwiki.apache.org/confluence/display/MAVEN/PluginExecutionException
[ERROR] 
[ERROR] After correcting the problems, you can resume the build with the command
[ERROR]   mvn <goals> -rf :org.eclipse.wst.jsdt.js.gulp
Build step 'Invoke top-level Maven targets' marked build as failure
Taking screenshot.
[workspace] $ echo $XAUTHORITY
<https://ci.eclipse.org/webtools/job/webtools-jsdt_master/ws/.Xauthority-8162064675003183054>
[workspace] $ ls -l $XAUTHORITY
-rw-rw-r-- 1 genie.webtools webtools 0 Oct 13 00:47 <https://ci.eclipse.org/webtools/job/webtools-jsdt_master/ws/.Xauthority-8162064675003183054>
[workspace] $ import -window root -display :450 screenshot.jpg
Terminating xvnc.
[WARNINGS] Skipping publisher since build result is FAILURE
append disk usage
Started calculate disk usage of build
Finished Calculation of disk usage of build in 0 seconds
Started calculate disk usage of workspace
Finished Calculation of disk usage of workspace in 0 seconds