[Date Prev][Date Next][Thread Prev][Thread Next][Date Index][Thread Index] [List Home]
[virgo-build] Build failed in Jenkins: gemini-web-container.snapshot #2831

See <https://ci.eclipse.org/gemini/job/gemini-web-container.snapshot/2831/display/redirect>

------------------------------------------
[...truncated 292.88 KB...]
     [java] [ERROR] property - "background-position-horizontal" is not implemented yet.
     [java] [ERROR] property - "background-position-vertical" is not implemented yet.
     [java] Error creating background image: Error creating FopImage object (file:/jobs/genie.gemini/gemini-web-container.snapshot/workspace/org.eclipse.gemini.web.documentation/programmer-guide/target/docbook/docbook-xsl-1.74.0/images/draft.png) : Jimi image library not available
     [java] [ERROR] property - "background-position-horizontal" is not implemented yet.
     [java] [ERROR] property - "background-position-vertical" is not implemented yet.
     [java] Error creating background image: Error creating FopImage object (file:/jobs/genie.gemini/gemini-web-container.snapshot/workspace/org.eclipse.gemini.web.documentation/programmer-guide/target/docbook/docbook-xsl-1.74.0/images/draft.png) : Jimi image library not available
     [java] [ERROR] property - "background-position-horizontal" is not implemented yet.
     [java] [ERROR] property - "background-position-vertical" is not implemented yet.
     [java] Error creating background image: Error creating FopImage object (file:/jobs/genie.gemini/gemini-web-container.snapshot/workspace/org.eclipse.gemini.web.documentation/programmer-guide/target/docbook/docbook-xsl-1.74.0/images/draft.png) : Jimi image library not available
     [java] [INFO] [1]
     [java] [INFO] [2] (blank)
     [java] [INFO] [3]
     [java] [INFO] [4] (blank)
     [java] [INFO] [1]
     [java] [INFO] [2] (blank)
     [java] [INFO] Parsing of document complete, stopping renderer
     [move] Moving 1 file to /jobs/genie.gemini/gemini-web-container.snapshot/workspace/org.eclipse.gemini.web.documentation/programmer-guide/target/docbook/htmlsingle
[ivy:publish] :: delivering :: org.eclipse.gemini#gemini-web-programmer-guide;working@hipp7 :: 3.0.4.CI-2831 :: integration :: Thu Sep 20 01:54:29 EDT 2018
[ivy:publish] 	delivering ivy file to /jobs/genie.gemini/gemini-web-container.snapshot/workspace/org.eclipse.gemini.web.documentation/programmer-guide/target/gemini-web-programmer-guide/html/ivy.xml
[ivy:publish] :: publishing :: org.eclipse.gemini#gemini-web-programmer-guide
[ivy:publish] 	published gemini-web-programmer-guide to /opt/public/hipp/homes/genie.gemini/virgo-build-cache/integration-repo/org.eclipse.gemini/gemini-web-programmer-guide/3.0.4.CI-2831.part/gemini-web-programmer-guide-3.0.4.CI-2831.zip
[ivy:publish] 	published gemini-web-programmer-guide-single to /opt/public/hipp/homes/genie.gemini/virgo-build-cache/integration-repo/org.eclipse.gemini/gemini-web-programmer-guide/3.0.4.CI-2831.part/gemini-web-programmer-guide-single-3.0.4.CI-2831.zip
[ivy:publish] 	published ivy to /opt/public/hipp/homes/genie.gemini/virgo-build-cache/integration-repo/org.eclipse.gemini/gemini-web-programmer-guide/3.0.4.CI-2831.part/ivy-3.0.4.CI-2831.xml
[ivy:publish] 	publish commited: moved /opt/public/hipp/homes/genie.gemini/virgo-build-cache/integration-repo/org.eclipse.gemini/gemini-web-programmer-guide/3.0.4.CI-2831.part 
[ivy:publish] 		to /opt/public/hipp/homes/genie.gemini/virgo-build-cache/integration-repo/org.eclipse.gemini/gemini-web-programmer-guide/3.0.4.CI-2831
   [delete] Deleting directory /jobs/genie.gemini/gemini-web-container.snapshot/workspace/org.eclipse.gemini.web.documentation/programmer-guide/target/docbook
   [subant] Leaving directory: /jobs/genie.gemini/gemini-web-container.snapshot/workspace/org.eclipse.gemini.web.documentation/programmer-guide

ivy.init:

package:
    [mkdir] Created dir: /jobs/genie.gemini/gemini-web-container.snapshot/workspace/build-web-container/target/package-expanded/gemini-web-3.0.4.CI-2831
[ivy:resolve] :: Apache Ivy 2.3.0 - 20130110142753 :: http://ant.apache.org/ivy/ ::
[ivy:resolve] :: loading settings :: file = /jobs/genie.gemini/gemini-web-container.snapshot/workspace/virgo-build/common/ivysettings.xml
[ivy:resolve] DEPRECATED: 'checkUpToDate' is deprecated, use the 'overwriteMode' on the 'ivy:retrieve' task instead (file:/jobs/genie.gemini/gemini-web-container.snapshot/workspace/virgo-build/common/ivysettings.xml)
[ivy:resolve] :: resolving dependencies :: org.eclipse.gemini#build-web-container;working@hipp7 [not transitive]
[ivy:resolve] 	confs: [compile, optional, provided, server-provided, runtime, test, aspects, external, additional, package]
[ivy:resolve] 	found org.eclipse.gemini#org.eclipse.gemini.web.core;3.0.4.CI-2831 in integration
[ivy:resolve] 	[3.0.4.CI-2831] org.eclipse.gemini#org.eclipse.gemini.web.core;latest.integration
[ivy:resolve] 	found org.eclipse.gemini#org.eclipse.gemini.web.tomcat;3.0.4.CI-2831 in integration
[ivy:resolve] 	[3.0.4.CI-2831] org.eclipse.gemini#org.eclipse.gemini.web.tomcat;latest.integration
[ivy:resolve] 	found org.eclipse.gemini#org.eclipse.gemini.web.extender;3.0.4.CI-2831 in integration
[ivy:resolve] 	[3.0.4.CI-2831] org.eclipse.gemini#org.eclipse.gemini.web.extender;latest.integration
[ivy:resolve] 	found org.eclipse.gemini#org.eclipse.gemini.web.jaspic.fragment;3.0.4.CI-2831 in integration
[ivy:resolve] 	[3.0.4.CI-2831] org.eclipse.gemini#org.eclipse.gemini.web.jaspic.fragment;latest.integration
[ivy:resolve] :: resolution report :: resolve 145ms :: artifacts dl 9ms
	---------------------------------------------------------------------
	|                  |            modules            ||   artifacts   |
	|       conf       | number| search|dwnlded|evicted|| number|dwnlded|
	---------------------------------------------------------------------
	|      compile     |   0   |   0   |   0   |   0   ||   0   |   0   |
	|     optional     |   0   |   0   |   0   |   0   ||   0   |   0   |
	|     provided     |   0   |   0   |   0   |   0   ||   0   |   0   |
	|  server-provided |   0   |   0   |   0   |   0   ||   0   |   0   |
	|      runtime     |   0   |   0   |   0   |   0   ||   0   |   0   |
	|       test       |   0   |   0   |   0   |   0   ||   0   |   0   |
	|      aspects     |   0   |   0   |   0   |   0   ||   0   |   0   |
	|     external     |   0   |   0   |   0   |   0   ||   0   |   0   |
	|    additional    |   0   |   0   |   0   |   0   ||   0   |   0   |
	|      package     |   4   |   4   |   0   |   0   ||   8   |   0   |
	---------------------------------------------------------------------
[ivy:retrieve] :: retrieving :: org.eclipse.gemini#build-web-container
[ivy:retrieve] 	confs: [package]
[ivy:retrieve] 	4 artifacts copied (193kB/6ms)
[ivy:resolve] :: resolving dependencies :: org.eclipse.gemini#build-web-container;working@hipp7 [not transitive]
[ivy:resolve] 	confs: [compile, optional, provided, server-provided, runtime, test, aspects, external, additional, dep]
[ivy:resolve] 	found org.eclipse.virgo.util#org.eclipse.virgo.util.osgi;3.6.3.RELEASE in virgo-lookup
[ivy:resolve] 	found org.eclipse.virgo.util#org.eclipse.virgo.util.osgi.manifest;3.6.3.RELEASE in eclipse-bundle-release-repository-eclipse.build.read.resolver
[ivy:resolve] 	found org.eclipse.virgo.util#org.eclipse.virgo.util.common;3.6.3.RELEASE in eclipse-bundle-release-repository-eclipse.build.read.resolver
[ivy:resolve] 	found org.eclipse.virgo.util#org.eclipse.virgo.util.io;3.6.3.RELEASE in eclipse-bundle-release-repository-eclipse.build.read.resolver
[ivy:resolve] 	found org.eclipse.virgo.util#org.eclipse.virgo.util.math;3.6.3.RELEASE in eclipse-bundle-release-repository-eclipse.build.read.resolver
[ivy:resolve] 	found org.eclipse.virgo.util#org.eclipse.virgo.util.parser.manifest;3.6.3.RELEASE in eclipse-bundle-release-repository-eclipse.build.read.resolver
[ivy:resolve] 	found org.eclipse.virgo.mirrored#org.apache.catalina.ha;8.5.24 in eclipse-bundle-release-repository-eclipse.build.read.resolver
[ivy:resolve] 	found org.eclipse.virgo.mirrored#org.apache.catalina;8.5.24 in eclipse-bundle-release-repository-eclipse.build.read.resolver
[ivy:resolve] 	found org.eclipse.virgo.mirrored#org.apache.catalina.tribes;8.5.24 in eclipse-bundle-release-repository-eclipse.build.read.resolver
[ivy:resolve] 	found org.eclipse.virgo.mirrored#org.apache.coyote;8.5.24 in eclipse-bundle-release-repository-eclipse.build.read.resolver
[ivy:resolve] 	found org.eclipse.virgo.mirrored#org.apache.el;8.5.24 in eclipse-bundle-release-repository-eclipse.build.read.resolver
[ivy:resolve] 	found org.eclipse.virgo.mirrored#org.apache.jasper;8.5.24 in eclipse-bundle-release-repository-eclipse.build.read.resolver
[ivy:resolve] 	found org.eclipse.virgo.mirrored#org.apache.juli;8.5.24 in eclipse-bundle-release-repository-eclipse.build.read.resolver
[ivy:resolve] 	found org.eclipse.virgo.mirrored#org.apache.tomcat.api;8.5.24 in eclipse-bundle-release-repository-eclipse.build.read.resolver
[ivy:resolve] 	found org.eclipse.virgo.mirrored#org.apache.tomcat.util;8.5.24 in eclipse-bundle-release-repository-eclipse.build.read.resolver
[ivy:resolve] 	found org.eclipse.virgo.mirrored#org.apache.tomcat.websocket;8.5.24 in eclipse-bundle-release-repository-eclipse.build.read.resolver
[ivy:resolve] 	found org.eclipse.virgo.mirrored#org.apache.tomcat.util.scan;8.5.24 in eclipse-bundle-release-repository-eclipse.build.read.resolver
[ivy:resolve] 	found org.eclipse.virgo.mirrored#org.apache.tomcat.jni;8.5.24 in eclipse-bundle-release-repository-eclipse.build.read.resolver
[ivy:resolve] 	found org.eclipse.virgo.mirrored#org.eclipse.jdt.core.compiler.batch;3.12.3.v20170228-1205 in eclipse-bundle-release-repository-eclipse.build.read.resolver
[ivy:resolve] 	found javax.activation#com.springsource.javax.activation;1.1.1 in bundle-external-repository-s3.read.resolver
[ivy:resolve] 	found org.eclipse.virgo.mirrored#javax.annotation;1.2.0.v201401042248 in eclipse-bundle-release-repository-eclipse.build.read.resolver
[ivy:resolve] 	found org.eclipse.virgo.mirrored#javax.ejb;3.1.1.v201204261316 in eclipse-bundle-release-repository-eclipse.build.read.resolver
[ivy:resolve] 	found org.eclipse.virgo.mirrored#javax.el;3.0.0.20180121 in eclipse-bundle-release-repository-eclipse.build.read.resolver
[ivy:resolve] 	found org.eclipse.virgo.mirrored#javax.mail;1.4.0.v201005080615 in eclipse-bundle-release-repository-eclipse.build.read.resolver
[ivy:resolve] 	found org.eclipse.virgo.mirrored#javax.persistence;2.1.0.v201304241213 in eclipse-bundle-release-repository-eclipse.build.read.resolver
[ivy:resolve] 	found org.eclipse.virgo.mirrored#javax.security.auth.message;1.1.0.20180121 in eclipse-bundle-release-repository-eclipse.build.read.resolver
[ivy:resolve] 	found org.eclipse.virgo.mirrored#javax.servlet;3.1.0.20180121 in eclipse-bundle-release-repository-eclipse.build.read.resolver
[ivy:resolve] 	found org.eclipse.virgo.mirrored#javax.servlet.jsp;2.3.0.20180121 in eclipse-bundle-release-repository-eclipse.build.read.resolver
[ivy:resolve] 	found org.eclipse.virgo.mirrored#javax.transaction;1.1.0.v201205091237 in eclipse-bundle-release-repository-eclipse.build.read.resolver
[ivy:resolve] 	found org.eclipse.virgo.mirrored#javax.xml.rpc;1.1.0.v201005080400 in eclipse-bundle-release-repository-eclipse.build.read.resolver
[ivy:resolve] 	found org.eclipse.virgo.mirrored#javax.xml.soap;1.3.0.v201105210645 in eclipse-bundle-release-repository-eclipse.build.read.resolver
[ivy:resolve] 	found org.eclipse.virgo.mirrored#javax.websocket;1.1.0.20180121 in eclipse-bundle-release-repository-eclipse.build.read.resolver
[ivy:resolve] 	found org.eclipse.virgo.mirrored#org.slf4j.api;1.7.2.v20121108-1250 in eclipse-bundle-release-repository-eclipse.build.read.resolver
[ivy:resolve] 	found org.eclipse.virgo.mirrored#org.slf4j.nop;1.7.2.v201212060727 in eclipse-bundle-release-repository-eclipse.build.read.resolver
[ivy:resolve] :: resolution report :: resolve 481ms :: artifacts dl 37ms
	---------------------------------------------------------------------
	|                  |            modules            ||   artifacts   |
	|       conf       | number| search|dwnlded|evicted|| number|dwnlded|
	---------------------------------------------------------------------
	|      compile     |   0   |   0   |   0   |   0   ||   0   |   0   |
	|     optional     |   0   |   0   |   0   |   0   ||   0   |   0   |
	|     provided     |   0   |   0   |   0   |   0   ||   0   |   0   |
	|  server-provided |   0   |   0   |   0   |   0   ||   0   |   0   |
	|      runtime     |   0   |   0   |   0   |   0   ||   0   |   0   |
	|       test       |   0   |   0   |   0   |   0   ||   0   |   0   |
	|      aspects     |   0   |   0   |   0   |   0   ||   0   |   0   |
	|     external     |   0   |   0   |   0   |   0   ||   0   |   0   |
	|    additional    |   0   |   0   |   0   |   0   ||   0   |   0   |
	|        dep       |   34  |   0   |   0   |   0   ||   48  |   0   |
	---------------------------------------------------------------------
[ivy:retrieve] :: retrieving :: org.eclipse.gemini#build-web-container
[ivy:retrieve] 	confs: [dep]
[ivy:retrieve] 	34 artifacts copied (8052kB/373ms)
     [copy] Copying 7 files to /jobs/genie.gemini/gemini-web-container.snapshot/workspace/build-web-container/target/package-expanded/gemini-web-3.0.4.CI-2831
   [subant] Entering directory: /jobs/genie.gemini/gemini-web-container.snapshot/workspace/org.eclipse.gemini.web.documentation/user-guide

package:
    [mkdir] Created dir: /jobs/genie.gemini/gemini-web-container.snapshot/workspace/build-web-container/target/package-expanded/gemini-web-3.0.4.CI-2831/docs/gemini-web-user-guide
     [copy] Copying 216 files to /jobs/genie.gemini/gemini-web-container.snapshot/workspace/build-web-container/target/package-expanded/gemini-web-3.0.4.CI-2831/docs/gemini-web-user-guide
   [subant] Leaving directory: /jobs/genie.gemini/gemini-web-container.snapshot/workspace/org.eclipse.gemini.web.documentation/user-guide
   [subant] Entering directory: /jobs/genie.gemini/gemini-web-container.snapshot/workspace/org.eclipse.gemini.web.documentation/programmer-guide

package:
    [mkdir] Created dir: /jobs/genie.gemini/gemini-web-container.snapshot/workspace/build-web-container/target/package-expanded/gemini-web-3.0.4.CI-2831/docs/gemini-web-programmer-guide
     [copy] Copying 211 files to /jobs/genie.gemini/gemini-web-container.snapshot/workspace/build-web-container/target/package-expanded/gemini-web-3.0.4.CI-2831/docs/gemini-web-programmer-guide
   [subant] Leaving directory: /jobs/genie.gemini/gemini-web-container.snapshot/workspace/org.eclipse.gemini.web.documentation/programmer-guide
    [mkdir] Created dir: /jobs/genie.gemini/gemini-web-container.snapshot/workspace/build-web-container/target/artifacts
      [zip] Building zip: /jobs/genie.gemini/gemini-web-container.snapshot/workspace/build-web-container/target/artifacts/gemini-web-3.0.4.CI-2831.zip

ivy.init:

package:
   [delete] Deleting directory /jobs/genie.gemini/gemini-web-container.snapshot/workspace/build-web-container/target/package-expanded/gemini-web-3.0.4.CI-2831
    [mkdir] Created dir: /jobs/genie.gemini/gemini-web-container.snapshot/workspace/build-web-container/target/package-expanded/gemini-web-3.0.4.CI-2831
[ivy:resolve] :: resolving dependencies :: org.eclipse.gemini#build-web-container;working@hipp7 [not transitive]
[ivy:resolve] 	confs: [compile, optional, provided, server-provided, runtime, test, aspects, external, additional, package]
[ivy:resolve] 	found org.eclipse.gemini#org.eclipse.gemini.web.core;3.0.4.CI-2831 in integration
[ivy:resolve] 	[3.0.4.CI-2831] org.eclipse.gemini#org.eclipse.gemini.web.core;latest.integration
[ivy:resolve] 	found org.eclipse.gemini#org.eclipse.gemini.web.tomcat;3.0.4.CI-2831 in integration
[ivy:resolve] 	[3.0.4.CI-2831] org.eclipse.gemini#org.eclipse.gemini.web.tomcat;latest.integration
[ivy:resolve] 	found org.eclipse.gemini#org.eclipse.gemini.web.extender;3.0.4.CI-2831 in integration
[ivy:resolve] 	[3.0.4.CI-2831] org.eclipse.gemini#org.eclipse.gemini.web.extender;latest.integration
[ivy:resolve] 	found org.eclipse.gemini#org.eclipse.gemini.web.jaspic.fragment;3.0.4.CI-2831 in integration
[ivy:resolve] 	[3.0.4.CI-2831] org.eclipse.gemini#org.eclipse.gemini.web.jaspic.fragment;latest.integration
[ivy:resolve] :: resolution report :: resolve 36ms :: artifacts dl 6ms
	---------------------------------------------------------------------
	|                  |            modules            ||   artifacts   |
	|       conf       | number| search|dwnlded|evicted|| number|dwnlded|
	---------------------------------------------------------------------
	|      compile     |   0   |   0   |   0   |   0   ||   0   |   0   |
	|     optional     |   0   |   0   |   0   |   0   ||   0   |   0   |
	|     provided     |   0   |   0   |   0   |   0   ||   0   |   0   |
	|  server-provided |   0   |   0   |   0   |   0   ||   0   |   0   |
	|      runtime     |   0   |   0   |   0   |   0   ||   0   |   0   |
	|       test       |   0   |   0   |   0   |   0   ||   0   |   0   |
	|      aspects     |   0   |   0   |   0   |   0   ||   0   |   0   |
	|     external     |   0   |   0   |   0   |   0   ||   0   |   0   |
	|    additional    |   0   |   0   |   0   |   0   ||   0   |   0   |
	|      package     |   4   |   0   |   0   |   0   ||   8   |   0   |
	---------------------------------------------------------------------
[ivy:retrieve] :: retrieving :: org.eclipse.gemini#build-web-container
[ivy:retrieve] 	confs: [package]
[ivy:retrieve] 	4 artifacts copied (193kB/5ms)
[ivy:resolve] :: resolving dependencies :: org.eclipse.gemini#build-web-container;working@hipp7 [not transitive]
[ivy:resolve] 	confs: [compile, optional, provided, server-provided, runtime, test, aspects, external, additional, dep]
[ivy:resolve] 	found org.eclipse.virgo.util#org.eclipse.virgo.util.osgi;3.6.3.RELEASE in virgo-lookup
[ivy:resolve] 	found org.eclipse.virgo.util#org.eclipse.virgo.util.osgi.manifest;3.6.3.RELEASE in eclipse-bundle-release-repository-eclipse.build.read.resolver
[ivy:resolve] 	found org.eclipse.virgo.util#org.eclipse.virgo.util.common;3.6.3.RELEASE in eclipse-bundle-release-repository-eclipse.build.read.resolver
[ivy:resolve] 	found org.eclipse.virgo.util#org.eclipse.virgo.util.io;3.6.3.RELEASE in eclipse-bundle-release-repository-eclipse.build.read.resolver
[ivy:resolve] 	found org.eclipse.virgo.util#org.eclipse.virgo.util.math;3.6.3.RELEASE in eclipse-bundle-release-repository-eclipse.build.read.resolver
[ivy:resolve] 	found org.eclipse.virgo.util#org.eclipse.virgo.util.parser.manifest;3.6.3.RELEASE in eclipse-bundle-release-repository-eclipse.build.read.resolver
[ivy:resolve] 	found org.eclipse.virgo.mirrored#org.apache.catalina.ha;8.5.24 in eclipse-bundle-release-repository-eclipse.build.read.resolver
[ivy:resolve] 	found org.eclipse.virgo.mirrored#org.apache.catalina;8.5.24 in eclipse-bundle-release-repository-eclipse.build.read.resolver
[ivy:resolve] 	found org.eclipse.virgo.mirrored#org.apache.catalina.tribes;8.5.24 in eclipse-bundle-release-repository-eclipse.build.read.resolver
[ivy:resolve] 	found org.eclipse.virgo.mirrored#org.apache.coyote;8.5.24 in eclipse-bundle-release-repository-eclipse.build.read.resolver
[ivy:resolve] 	found org.eclipse.virgo.mirrored#org.apache.el;8.5.24 in eclipse-bundle-release-repository-eclipse.build.read.resolver
[ivy:resolve] 	found org.eclipse.virgo.mirrored#org.apache.jasper;8.5.24 in eclipse-bundle-release-repository-eclipse.build.read.resolver
[ivy:resolve] 	found org.eclipse.virgo.mirrored#org.apache.juli;8.5.24 in eclipse-bundle-release-repository-eclipse.build.read.resolver
[ivy:resolve] 	found org.eclipse.virgo.mirrored#org.apache.tomcat.api;8.5.24 in eclipse-bundle-release-repository-eclipse.build.read.resolver
[ivy:resolve] 	found org.eclipse.virgo.mirrored#org.apache.tomcat.util;8.5.24 in eclipse-bundle-release-repository-eclipse.build.read.resolver
[ivy:resolve] 	found org.eclipse.virgo.mirrored#org.apache.tomcat.websocket;8.5.24 in eclipse-bundle-release-repository-eclipse.build.read.resolver
[ivy:resolve] 	found org.eclipse.virgo.mirrored#org.apache.tomcat.util.scan;8.5.24 in eclipse-bundle-release-repository-eclipse.build.read.resolver
[ivy:resolve] 	found org.eclipse.virgo.mirrored#org.apache.tomcat.jni;8.5.24 in eclipse-bundle-release-repository-eclipse.build.read.resolver
[ivy:resolve] 	found org.eclipse.virgo.mirrored#org.eclipse.jdt.core.compiler.batch;3.12.3.v20170228-1205 in eclipse-bundle-release-repository-eclipse.build.read.resolver
[ivy:resolve] 	found javax.activation#com.springsource.javax.activation;1.1.1 in bundle-external-repository-s3.read.resolver
[ivy:resolve] 	found org.eclipse.virgo.mirrored#javax.annotation;1.2.0.v201401042248 in eclipse-bundle-release-repository-eclipse.build.read.resolver
[ivy:resolve] 	found org.eclipse.virgo.mirrored#javax.ejb;3.1.1.v201204261316 in eclipse-bundle-release-repository-eclipse.build.read.resolver
[ivy:resolve] 	found org.eclipse.virgo.mirrored#javax.el;3.0.0.20180121 in eclipse-bundle-release-repository-eclipse.build.read.resolver
[ivy:resolve] 	found org.eclipse.virgo.mirrored#javax.mail;1.4.0.v201005080615 in eclipse-bundle-release-repository-eclipse.build.read.resolver
[ivy:resolve] 	found org.eclipse.virgo.mirrored#javax.persistence;2.1.0.v201304241213 in eclipse-bundle-release-repository-eclipse.build.read.resolver
[ivy:resolve] 	found org.eclipse.virgo.mirrored#javax.security.auth.message;1.1.0.20180121 in eclipse-bundle-release-repository-eclipse.build.read.resolver
[ivy:resolve] 	found org.eclipse.virgo.mirrored#javax.servlet;3.1.0.20180121 in eclipse-bundle-release-repository-eclipse.build.read.resolver
[ivy:resolve] 	found org.eclipse.virgo.mirrored#javax.servlet.jsp;2.3.0.20180121 in eclipse-bundle-release-repository-eclipse.build.read.resolver
[ivy:resolve] 	found org.eclipse.virgo.mirrored#javax.transaction;1.1.0.v201205091237 in eclipse-bundle-release-repository-eclipse.build.read.resolver
[ivy:resolve] 	found org.eclipse.virgo.mirrored#javax.xml.rpc;1.1.0.v201005080400 in eclipse-bundle-release-repository-eclipse.build.read.resolver
[ivy:resolve] 	found org.eclipse.virgo.mirrored#javax.xml.soap;1.3.0.v201105210645 in eclipse-bundle-release-repository-eclipse.build.read.resolver
[ivy:resolve] 	found org.eclipse.virgo.mirrored#javax.websocket;1.1.0.20180121 in eclipse-bundle-release-repository-eclipse.build.read.resolver
[ivy:resolve] 	found org.eclipse.virgo.mirrored#org.slf4j.api;1.7.2.v20121108-1250 in eclipse-bundle-release-repository-eclipse.build.read.resolver
[ivy:resolve] 	found org.eclipse.virgo.mirrored#org.slf4j.nop;1.7.2.v201212060727 in eclipse-bundle-release-repository-eclipse.build.read.resolver
[ivy:resolve] :: resolution report :: resolve 214ms :: artifacts dl 33ms
	---------------------------------------------------------------------
	|                  |            modules            ||   artifacts   |
	|       conf       | number| search|dwnlded|evicted|| number|dwnlded|
	---------------------------------------------------------------------
	|      compile     |   0   |   0   |   0   |   0   ||   0   |   0   |
	|     optional     |   0   |   0   |   0   |   0   ||   0   |   0   |
	|     provided     |   0   |   0   |   0   |   0   ||   0   |   0   |
	|  server-provided |   0   |   0   |   0   |   0   ||   0   |   0   |
	|      runtime     |   0   |   0   |   0   |   0   ||   0   |   0   |
	|       test       |   0   |   0   |   0   |   0   ||   0   |   0   |
	|      aspects     |   0   |   0   |   0   |   0   ||   0   |   0   |
	|     external     |   0   |   0   |   0   |   0   ||   0   |   0   |
	|    additional    |   0   |   0   |   0   |   0   ||   0   |   0   |
	|        dep       |   34  |   0   |   0   |   0   ||   48  |   0   |
	---------------------------------------------------------------------
[ivy:retrieve] :: retrieving :: org.eclipse.gemini#build-web-container
[ivy:retrieve] 	confs: [dep]
[ivy:retrieve] 	34 artifacts copied (8052kB/32ms)
     [copy] Copying 7 files to /jobs/genie.gemini/gemini-web-container.snapshot/workspace/build-web-container/target/package-expanded/gemini-web-3.0.4.CI-2831
   [subant] Entering directory: /jobs/genie.gemini/gemini-web-container.snapshot/workspace/org.eclipse.gemini.web.documentation/user-guide

package:
    [mkdir] Created dir: /jobs/genie.gemini/gemini-web-container.snapshot/workspace/build-web-container/target/package-expanded/gemini-web-3.0.4.CI-2831/docs/gemini-web-user-guide
     [copy] Copying 216 files to /jobs/genie.gemini/gemini-web-container.snapshot/workspace/build-web-container/target/package-expanded/gemini-web-3.0.4.CI-2831/docs/gemini-web-user-guide
   [subant] Leaving directory: /jobs/genie.gemini/gemini-web-container.snapshot/workspace/org.eclipse.gemini.web.documentation/user-guide
   [subant] Entering directory: /jobs/genie.gemini/gemini-web-container.snapshot/workspace/org.eclipse.gemini.web.documentation/programmer-guide

package:
    [mkdir] Created dir: /jobs/genie.gemini/gemini-web-container.snapshot/workspace/build-web-container/target/package-expanded/gemini-web-3.0.4.CI-2831/docs/gemini-web-programmer-guide
     [copy] Copying 211 files to /jobs/genie.gemini/gemini-web-container.snapshot/workspace/build-web-container/target/package-expanded/gemini-web-3.0.4.CI-2831/docs/gemini-web-programmer-guide
   [subant] Leaving directory: /jobs/genie.gemini/gemini-web-container.snapshot/workspace/org.eclipse.gemini.web.documentation/programmer-guide

fetch-unzipped-virgo-build-tools:
      [get] Getting: http://build.eclipse.org/rt/virgo/zips/release/VB/1.4.1.RELEASE/virgo-build-tools-1.4.1.RELEASE.zip
      [get] To: /jobs/genie.gemini/gemini-web-container.snapshot/workspace/build-web-container/target/virgo-build-tools-1.4.1.RELEASE.zip
      [get] http://build.eclipse.org/rt/virgo/zips/release/VB/1.4.1.RELEASE/virgo-build-tools-1.4.1.RELEASE.zip permanently moved to https://www.eclipse.org/cognicrypt/
      [get] https://www.eclipse.org/cognicrypt/ moved to http://eclipse.org/projects/project.php?id=technology.cognicrypt

BUILD FAILED
/jobs/genie.gemini/gemini-web-container.snapshot/workspace/virgo-build/multi-bundle/p2tools.xml:446: Redirection detected from https to http. Protocol switch unsafe, not allowed.

Total time: 4 minutes 48 seconds
Build step 'Execute shell' marked build as failure