[Date Prev][Date Next][Thread Prev][Thread Next][Date Index][Thread Index] [List Home]
[rdf4j-dev] Build failed in Jenkins: rdf4j-storage-develop-verify #91

See <https://ci.eclipse.org/rdf4j/job/rdf4j-storage-develop-verify/91/display/redirect?page=changes>

Changes:

[Bart Hanssens] Patch level upgrades logback and slf4j

------------------------------------------
[...truncated 159.62 KB...]
14:19:46.400 [Time-limited test] DEBUG org.eclipse.rdf4j.sail.lucene.QuerySpecBuilder - Query variable 'null' has not rdf:type, assuming http://www.openrdf.org/contrib/lucenesail#LuceneQuery
14:19:46.401 [Time-limited test] DEBUG org.eclipse.rdf4j.sail.lucene.QuerySpecBuilder - Query variable 'null' has not rdf:type, assuming http://www.openrdf.org/contrib/lucenesail#LuceneQuery
14:19:46.401 [Time-limited test] DEBUG org.eclipse.rdf4j.sail.lucene.LuceneSailConnection - Committing Lucene transaction with 1 operations.
14:19:46.401 [Time-limited test] DEBUG org.eclipse.rdf4j.sail.lucene.LuceneSailConnection - clearing contexts...
14:19:46.401 [Time-limited test] DEBUG org.eclipse.rdf4j.sail.lucene.LuceneIndex - deleting contexts: [urn:context1]
14:19:46.402 [Time-limited test] DEBUG org.eclipse.rdf4j.sail.lucene.LuceneIndex - Deleting unused files from Lucene index
14:19:46.402 [Time-limited test] DEBUG org.eclipse.rdf4j.sail.lucene.LuceneSailConnection - Committing Lucene transaction with 0 operations.
14:19:46.403 [Time-limited test] DEBUG org.eclipse.rdf4j.sail.lucene.QuerySpecBuilder - Query variable 'null' has not rdf:type, assuming http://www.openrdf.org/contrib/lucenesail#LuceneQuery
14:19:46.404 [Time-limited test] DEBUG org.eclipse.rdf4j.sail.lucene.QuerySpecBuilder - Query variable 'null' has not rdf:type, assuming http://www.openrdf.org/contrib/lucenesail#LuceneQuery
14:19:46.405 [Time-limited test] DEBUG org.eclipse.rdf4j.sail.lucene.QuerySpecBuilder - Query variable 'null' has not rdf:type, assuming http://www.openrdf.org/contrib/lucenesail#LuceneQuery
14:19:46.405 [Time-limited test] DEBUG org.eclipse.rdf4j.sail.lucene.QuerySpecBuilder - Query variable 'null' has not rdf:type, assuming http://www.openrdf.org/contrib/lucenesail#LuceneQuery
14:19:46.407 [Time-limited test] DEBUG org.eclipse.rdf4j.sail.lucene.QuerySpecBuilder - Query variable 'null' has not rdf:type, assuming http://www.openrdf.org/contrib/lucenesail#LuceneQuery
14:19:46.407 [Time-limited test] DEBUG org.eclipse.rdf4j.sail.lucene.LuceneSail - LuceneSail shutdown
14:19:46.409 [Time-limited test] DEBUG org.eclipse.rdf4j.sail.lucene.LuceneIndex - creating new Lucene index in directory RAMDirectory@4e593397 lockFactory=org.apache.lucene.store.SingleInstanceLockFactory@409ec42c
14:19:46.409 [Time-limited test] DEBUG org.eclipse.rdf4j.sail.memory.MemoryStore - Initializing MemoryStore...
14:19:46.409 [Time-limited test] DEBUG org.eclipse.rdf4j.sail.memory.MemoryStore - MemoryStore initialized
14:19:46.410 [Time-limited test] DEBUG org.eclipse.rdf4j.sail.lucene.LuceneSailConnection - Committing Lucene transaction with 1 operations.
14:19:46.410 [Time-limited test] DEBUG org.eclipse.rdf4j.sail.lucene.LuceneSailConnection - indexing 7/removing 0 statements...
14:19:46.410 [Time-limited test] DEBUG org.eclipse.rdf4j.sail.lucene.LuceneIndex - Removing 0 statements, adding 7 statements
14:19:46.413 [Time-limited test] DEBUG org.eclipse.rdf4j.sail.lucene.LuceneIndex - Deleting unused files from Lucene index
14:19:46.413 [Time-limited test] INFO org.eclipse.rdf4j.sail.lucene.LuceneSail - Reindexing sail: clearing...
14:19:46.413 [Time-limited test] DEBUG org.eclipse.rdf4j.sail.lucene.LuceneIndex - Deleting unused files from Lucene index
14:19:46.413 [Time-limited test] INFO org.eclipse.rdf4j.sail.lucene.LuceneSail - Reindexing sail: adding...
14:19:46.455 [Time-limited test] DEBUG org.eclipse.rdf4j.sail.lucene.LuceneSail - reindexing resource urn:subject1
14:19:46.461 [Time-limited test] DEBUG org.eclipse.rdf4j.sail.lucene.LuceneSail - reindexing resource urn:subject2
14:19:46.465 [Time-limited test] DEBUG org.eclipse.rdf4j.sail.lucene.LuceneIndex - Deleting unused files from Lucene index
14:19:46.465 [Time-limited test] INFO org.eclipse.rdf4j.sail.lucene.LuceneSail - Reindexing sail: done.
14:19:46.465 [Time-limited test] DEBUG org.eclipse.rdf4j.sail.lucene.QuerySpecBuilder - Query variable 'null' has not rdf:type, assuming http://www.openrdf.org/contrib/lucenesail#LuceneQuery
14:19:46.467 [Time-limited test] DEBUG org.eclipse.rdf4j.sail.lucene.LuceneSail - LuceneSail shutdown
14:19:46.468 [Time-limited test] DEBUG org.eclipse.rdf4j.sail.lucene.LuceneIndex - creating new Lucene index in directory RAMDirectory@2e50b5c4 lockFactory=org.apache.lucene.store.SingleInstanceLockFactory@20975e7e
14:19:46.468 [Time-limited test] DEBUG org.eclipse.rdf4j.sail.memory.MemoryStore - Initializing MemoryStore...
14:19:46.468 [Time-limited test] DEBUG org.eclipse.rdf4j.sail.memory.MemoryStore - MemoryStore initialized
14:19:46.469 [Time-limited test] DEBUG org.eclipse.rdf4j.sail.lucene.LuceneSailConnection - Committing Lucene transaction with 1 operations.
14:19:46.469 [Time-limited test] DEBUG org.eclipse.rdf4j.sail.lucene.LuceneSailConnection - indexing 7/removing 0 statements...
14:19:46.469 [Time-limited test] DEBUG org.eclipse.rdf4j.sail.lucene.LuceneIndex - Removing 0 statements, adding 7 statements
14:19:46.471 [Time-limited test] DEBUG org.eclipse.rdf4j.sail.lucene.LuceneIndex - Deleting unused files from Lucene index
14:19:46.472 [Time-limited test] DEBUG org.eclipse.rdf4j.sail.lucene.QuerySpecBuilder - Query variable 'null' has not rdf:type, assuming http://www.openrdf.org/contrib/lucenesail#LuceneQuery
14:19:46.474 [Time-limited test] DEBUG org.eclipse.rdf4j.sail.lucene.LuceneSail - LuceneSail shutdown
14:19:46.475 [Time-limited test] DEBUG org.eclipse.rdf4j.sail.lucene.LuceneIndex - creating new Lucene index in directory RAMDirectory@29742551 lockFactory=org.apache.lucene.store.SingleInstanceLockFactory@27b3de0f
14:19:46.475 [Time-limited test] DEBUG org.eclipse.rdf4j.sail.memory.MemoryStore - Initializing MemoryStore...
14:19:46.475 [Time-limited test] DEBUG org.eclipse.rdf4j.sail.memory.MemoryStore - MemoryStore initialized
14:19:46.476 [Time-limited test] DEBUG org.eclipse.rdf4j.sail.lucene.LuceneSailConnection - Committing Lucene transaction with 1 operations.
14:19:46.476 [Time-limited test] DEBUG org.eclipse.rdf4j.sail.lucene.LuceneSailConnection - indexing 7/removing 0 statements...
14:19:46.476 [Time-limited test] DEBUG org.eclipse.rdf4j.sail.lucene.LuceneIndex - Removing 0 statements, adding 7 statements
14:19:46.478 [Time-limited test] DEBUG org.eclipse.rdf4j.sail.lucene.LuceneIndex - Deleting unused files from Lucene index
14:19:46.478 [Time-limited test] DEBUG org.eclipse.rdf4j.sail.lucene.LuceneSailConnection - Committing Lucene transaction with 1 operations.
14:19:46.478 [Time-limited test] DEBUG org.eclipse.rdf4j.sail.lucene.LuceneSailConnection - indexing 3/removing 0 statements...
14:19:46.478 [Time-limited test] DEBUG org.eclipse.rdf4j.sail.lucene.LuceneIndex - Removing 0 statements, adding 3 statements
14:19:46.480 [Time-limited test] DEBUG org.eclipse.rdf4j.sail.lucene.LuceneIndex - Deleting unused files from Lucene index
14:19:46.481 [Time-limited test] DEBUG org.eclipse.rdf4j.sail.lucene.QuerySpecBuilder - Query variable 'null' has not rdf:type, assuming http://www.openrdf.org/contrib/lucenesail#LuceneQuery
14:19:46.483 [Time-limited test] DEBUG org.eclipse.rdf4j.sail.lucene.LuceneSail - LuceneSail shutdown
14:19:46.484 [Time-limited test] DEBUG org.eclipse.rdf4j.sail.lucene.LuceneIndex - creating new Lucene index in directory RAMDirectory@57fb8eaa lockFactory=org.apache.lucene.store.SingleInstanceLockFactory@593c7a25
14:19:46.485 [Time-limited test] DEBUG org.eclipse.rdf4j.sail.memory.MemoryStore - Initializing MemoryStore...
14:19:46.485 [Time-limited test] DEBUG org.eclipse.rdf4j.sail.memory.MemoryStore - MemoryStore initialized
14:19:46.485 [Time-limited test] DEBUG org.eclipse.rdf4j.sail.lucene.LuceneSailConnection - Committing Lucene transaction with 1 operations.
14:19:46.485 [Time-limited test] DEBUG org.eclipse.rdf4j.sail.lucene.LuceneSailConnection - indexing 7/removing 0 statements...
14:19:46.485 [Time-limited test] DEBUG org.eclipse.rdf4j.sail.lucene.LuceneIndex - Removing 0 statements, adding 7 statements
14:19:46.487 [Time-limited test] DEBUG org.eclipse.rdf4j.sail.lucene.LuceneIndex - Deleting unused files from Lucene index
14:19:46.491 [Time-limited test] DEBUG org.eclipse.rdf4j.sail.lucene.QuerySpecBuilder - Query variable 'null' has not rdf:type, assuming http://www.openrdf.org/contrib/lucenesail#LuceneQuery
14:19:46.495 [Time-limited test] DEBUG org.eclipse.rdf4j.sail.lucene.LuceneSail - LuceneSail shutdown
14:19:46.496 [Time-limited test] DEBUG org.eclipse.rdf4j.sail.lucene.LuceneIndex - creating new Lucene index in directory RAMDirectory@3bf0d945 lockFactory=org.apache.lucene.store.SingleInstanceLockFactory@3537204b
14:19:46.496 [Time-limited test] DEBUG org.eclipse.rdf4j.sail.memory.MemoryStore - Initializing MemoryStore...
14:19:46.496 [Time-limited test] DEBUG org.eclipse.rdf4j.sail.memory.MemoryStore - MemoryStore initialized
14:19:46.497 [Time-limited test] DEBUG org.eclipse.rdf4j.sail.lucene.LuceneSailConnection - Committing Lucene transaction with 1 operations.
14:19:46.497 [Time-limited test] DEBUG org.eclipse.rdf4j.sail.lucene.LuceneSailConnection - indexing 7/removing 0 statements...
14:19:46.497 [Time-limited test] DEBUG org.eclipse.rdf4j.sail.lucene.LuceneIndex - Removing 0 statements, adding 7 statements
14:19:46.499 [Time-limited test] DEBUG org.eclipse.rdf4j.sail.lucene.LuceneIndex - Deleting unused files from Lucene index
14:19:46.499 [Time-limited test] DEBUG org.eclipse.rdf4j.sail.lucene.QuerySpecBuilder - Query variable 'null' has not rdf:type, assuming http://www.openrdf.org/contrib/lucenesail#LuceneQuery
14:19:46.507 [Time-limited test] DEBUG org.eclipse.rdf4j.sail.lucene.LuceneSail - LuceneSail shutdown
14:19:46.508 [Time-limited test] DEBUG org.eclipse.rdf4j.sail.lucene.LuceneIndex - creating new Lucene index in directory RAMDirectory@4d88ae74 lockFactory=org.apache.lucene.store.SingleInstanceLockFactory@434f59b5
14:19:46.508 [Time-limited test] DEBUG org.eclipse.rdf4j.sail.memory.MemoryStore - Initializing MemoryStore...
14:19:46.508 [Time-limited test] DEBUG org.eclipse.rdf4j.sail.memory.MemoryStore - MemoryStore initialized
14:19:46.509 [Time-limited test] DEBUG org.eclipse.rdf4j.sail.lucene.LuceneSailConnection - Committing Lucene transaction with 1 operations.
14:19:46.509 [Time-limited test] DEBUG org.eclipse.rdf4j.sail.lucene.LuceneSailConnection - indexing 7/removing 0 statements...
14:19:46.509 [Time-limited test] DEBUG org.eclipse.rdf4j.sail.lucene.LuceneIndex - Removing 0 statements, adding 7 statements
14:19:46.510 [Time-limited test] DEBUG org.eclipse.rdf4j.sail.lucene.LuceneIndex - Deleting unused files from Lucene index
14:19:46.515 [Time-limited test] DEBUG org.eclipse.rdf4j.sail.lucene.QuerySpecBuilder - Query variable 'null' has not rdf:type, assuming http://www.openrdf.org/contrib/lucenesail#LuceneQuery
14:19:46.515 [Time-limited test] DEBUG org.eclipse.rdf4j.sail.lucene.QuerySpecBuilder - Query variable 'null' has not rdf:type, assuming http://www.openrdf.org/contrib/lucenesail#LuceneQuery
[result=urn:subject2]
[result=urn:subject1]
14:19:46.518 [Time-limited test] DEBUG org.eclipse.rdf4j.sail.lucene.LuceneSail - LuceneSail shutdown
[INFO] Tests run: 15, Failures: 0, Errors: 0, Skipped: 0, Time elapsed: 0.802 s - in org.eclipse.rdf4j.sail.lucene.LuceneSailTest
[INFO] 
[INFO] Results:
[INFO] 
[INFO] Tests run: 21, Failures: 0, Errors: 0, Skipped: 0
[INFO] 
[INFO] 
[INFO] --- animal-sniffer-maven-plugin:1.16:check (default) @ rdf4j-sail-lucene ---
[INFO] Checking unresolved references to org.codehaus.mojo.signature:java18:1.0
[INFO] 
[INFO] --- maven-jar-plugin:2.3.1:jar (default-jar) @ rdf4j-sail-lucene ---
[INFO] 
[INFO] --------------------< org.eclipse.rdf4j:rdf4j-spin >--------------------
[INFO] Building RDF4J: SPIN 2.5-SNAPSHOT                                [14/30]
[INFO] --------------------------------[ jar ]---------------------------------
[INFO] 
[INFO] --- buildnumber-maven-plugin:1.4:create (default) @ rdf4j-spin ---
[INFO] ShortRevision tag detected. The value is '7'.
[INFO] Executing: /bin/sh -c cd '/jobs/genie.rdf4j/rdf4j-storage-develop-verify/workspace/spin' && 'git' 'rev-parse' '--verify' '--short=7' 'HEAD'
[INFO] Working directory: /jobs/genie.rdf4j/rdf4j-storage-develop-verify/workspace/spin
[INFO] Storing buildNumber: 6422267 at timestamp: 1539195587836
[WARNING] Cannot get the branch information from the git repository: 
Detecting the current branch failed: fatal: ref HEAD is not a symbolic ref

[INFO] ShortRevision tag detected. The value is '7'.
[INFO] Executing: /bin/sh -c cd '/jobs/genie.rdf4j/rdf4j-storage-develop-verify/workspace/spin' && 'git' 'rev-parse' '--verify' '--short=7' 'HEAD'
[INFO] Working directory: /jobs/genie.rdf4j/rdf4j-storage-develop-verify/workspace/spin
[INFO] Storing buildScmBranch: UNKNOWN
[INFO] 
[INFO] --- maven-enforcer-plugin:1.4.1:enforce (enforce-bytecode-version) @ rdf4j-spin ---
[INFO] 
[INFO] --- maven-resources-plugin:3.0.2:resources (default-resources) @ rdf4j-spin ---
[INFO] Using 'UTF-8' encoding to copy filtered resources.
[INFO] Copying 10 resources
[INFO] 
[INFO] --- maven-compiler-plugin:3.7.0:compile (default-compile) @ rdf4j-spin ---
[INFO] Changes detected - recompiling the module!
[INFO] Compiling 89 source files to /jobs/genie.rdf4j/rdf4j-storage-develop-verify/workspace/spin/target/classes
[INFO] 
[INFO] --- maven-resources-plugin:3.0.2:testResources (default-testResources) @ rdf4j-spin ---
[INFO] Using 'UTF-8' encoding to copy filtered resources.
[INFO] Copying 31 resources
[INFO] 
[INFO] --- maven-compiler-plugin:3.7.0:testCompile (default-testCompile) @ rdf4j-spin ---
[INFO] Changes detected - recompiling the module!
[INFO] Compiling 3 source files to /jobs/genie.rdf4j/rdf4j-storage-develop-verify/workspace/spin/target/test-classes
[INFO] 
[INFO] --- maven-surefire-plugin:2.21.0:test (default-test) @ rdf4j-spin ---
[INFO] 
[INFO] -------------------------------------------------------
[INFO]  T E S T S
[INFO] -------------------------------------------------------
[INFO] Running org.eclipse.rdf4j.spin.SpinParserTest
[INFO] Tests run: 31, Failures: 0, Errors: 0, Skipped: 0, Time elapsed: 0.417 s - in org.eclipse.rdf4j.spin.SpinParserTest
[INFO] Running org.eclipse.rdf4j.spin.SpinRendererTest
[INFO] Tests run: 31, Failures: 0, Errors: 0, Skipped: 0, Time elapsed: 0.11 s - in org.eclipse.rdf4j.spin.SpinRendererTest
[INFO] 
[INFO] Results:
[INFO] 
[INFO] Tests run: 62, Failures: 0, Errors: 0, Skipped: 0
[INFO] 
[INFO] 
[INFO] --- animal-sniffer-maven-plugin:1.16:check (default) @ rdf4j-spin ---
[INFO] Checking unresolved references to org.codehaus.mojo.signature:java18:1.0
[INFO] 
[INFO] --- maven-jar-plugin:2.3.1:jar (default-jar) @ rdf4j-spin ---
[INFO] Building jar: /jobs/genie.rdf4j/rdf4j-storage-develop-verify/workspace/spin/target/rdf4j-spin-2.5-SNAPSHOT.jar
[INFO] 
[INFO] -----------------< org.eclipse.rdf4j:rdf4j-sail-spin >------------------
[INFO] Building RDF4J: SPIN SAIL 2.5-SNAPSHOT                           [15/30]
[INFO] --------------------------------[ jar ]---------------------------------
[INFO] 
[INFO] --- buildnumber-maven-plugin:1.4:create (default) @ rdf4j-sail-spin ---
[INFO] ShortRevision tag detected. The value is '7'.
[INFO] Executing: /bin/sh -c cd '/jobs/genie.rdf4j/rdf4j-storage-develop-verify/workspace/sail-spin' && 'git' 'rev-parse' '--verify' '--short=7' 'HEAD'
[INFO] Working directory: /jobs/genie.rdf4j/rdf4j-storage-develop-verify/workspace/sail-spin
[INFO] Storing buildNumber: 6422267 at timestamp: 1539195593659
[WARNING] Cannot get the branch information from the git repository: 
Detecting the current branch failed: fatal: ref HEAD is not a symbolic ref

[INFO] ShortRevision tag detected. The value is '7'.
[INFO] Executing: /bin/sh -c cd '/jobs/genie.rdf4j/rdf4j-storage-develop-verify/workspace/sail-spin' && 'git' 'rev-parse' '--verify' '--short=7' 'HEAD'
[INFO] Working directory: /jobs/genie.rdf4j/rdf4j-storage-develop-verify/workspace/sail-spin
[INFO] Storing buildScmBranch: UNKNOWN
[INFO] 
[INFO] --- maven-enforcer-plugin:1.4.1:enforce (enforce-bytecode-version) @ rdf4j-sail-spin ---
[INFO] 
[INFO] --- maven-resources-plugin:3.0.2:resources (default-resources) @ rdf4j-sail-spin ---
[INFO] Using 'UTF-8' encoding to copy filtered resources.
[INFO] Copying 1 resource
[INFO] 
[INFO] --- maven-compiler-plugin:3.7.0:compile (default-compile) @ rdf4j-sail-spin ---
[INFO] Nothing to compile - all classes are up to date
[INFO] 
[INFO] --- maven-resources-plugin:3.0.2:testResources (default-testResources) @ rdf4j-sail-spin ---
[INFO] Using 'UTF-8' encoding to copy filtered resources.
[INFO] Copying 32 resources
[INFO] 
[INFO] --- maven-compiler-plugin:3.7.0:testCompile (default-testCompile) @ rdf4j-sail-spin ---
[INFO] Changes detected - recompiling the module!
[INFO] Compiling 6 source files to /jobs/genie.rdf4j/rdf4j-storage-develop-verify/workspace/sail-spin/target/test-classes
[INFO] -------------------------------------------------------------
[ERROR] COMPILATION ERROR : 
[INFO] -------------------------------------------------------------
[ERROR] Picked up JAVA_TOOL_OPTIONS: -Xmx2G -Djava.io.tmpdir=/tmp/genie.rdf4j
/jobs/genie.rdf4j/rdf4j-storage-develop-verify/workspace/sail-spin/src/test/java/org/eclipse/rdf4j/sail/spin/SpinSailWithoutRDFSInferencerTest.java:[222,7] error: cannot access Iteration
  bad class file: /opt/public/hipp/homes/genie.rdf4j/.m2/repository/org/eclipse/rdf4j/rdf4j-util/2.5-SNAPSHOT/rdf4j-util-2.5-SNAPSHOT.jar(org/eclipse/rdf4j/common/iteration/Iteration.class)
    unable to access file: corrupted zip file
    Please remove or make sure it appears in the correct subdirectory of the classpath.
[INFO] 1 error
[INFO] -------------------------------------------------------------
[INFO] ------------------------------------------------------------------------
[INFO] Reactor Summary:
[INFO] 
[INFO] RDF4J Storage 2.5-SNAPSHOT ......................... SUCCESS [  1.638 s]
[INFO] RDF4J: Sail API .................................... SUCCESS [  2.934 s]
[INFO] RDF4J: Sail Model .................................. SUCCESS [  0.817 s]
[INFO] RDF4J: Inferencer Sails ............................ SUCCESS [  1.164 s]
[INFO] RDF4J: Query algebra - evaluation .................. SUCCESS [ 11.124 s]
[INFO] RDF4J: Sail base implementations ................... SUCCESS [  0.929 s]
[INFO] RDF4J: MemoryStore ................................. SUCCESS [  3.399 s]
[INFO] RDF4J: SailRepository .............................. SUCCESS [  4.009 s]
[INFO] RDF4J Lucene Sail API .............................. SUCCESS [  2.347 s]
[INFO] RDF4J Elastic Search Sail Index .................... SUCCESS [  3.676 s]
[INFO] RDF4J: Federation SAIL ............................. SUCCESS [  3.957 s]
[INFO] RDF4J: Query algebra - GeoSPARQL ................... SUCCESS [  2.837 s]
[INFO] RDF4J Lucene Sail Index ............................ SUCCESS [  7.743 s]
[INFO] RDF4J: SPIN ........................................ SUCCESS [  5.817 s]
[INFO] RDF4J: SPIN SAIL ................................... FAILURE [  1.180 s]
[INFO] RDF4J: NativeStore ................................. SKIPPED
[INFO] RDF4J Lucene Sail Spin ............................. SKIPPED
[INFO] RDF4J: DatasetRepository (wrapper) ................. SKIPPED
[INFO] RDF4J Solr Sail Index .............................. SKIPPED
[INFO] RDF4J: SHACL ....................................... SKIPPED
[INFO] RDF4J: Storage ..................................... SKIPPED
[INFO] RDF4J compliance tests ............................. SKIPPED
[INFO] RDF4J Model compliance test ........................ SKIPPED
[INFO] RDF4J Lucene Sail Tests ............................ SKIPPED
[INFO] RDF4J Elasticsearch Sail Tests ..................... SKIPPED
[INFO] RDF4J Solr Sail Tests .............................. SKIPPED
[INFO] RDF4J SAIL and Repository compliance test .......... SKIPPED
[INFO] RDF4J SeRQL query parser compliance tests .......... SKIPPED
[INFO] RDF4J GeoSPARQL compliance tests ................... SKIPPED
[INFO] RDF4J SHACL compliance tests 2.5-SNAPSHOT .......... SKIPPED
[INFO] ------------------------------------------------------------------------
[INFO] BUILD FAILURE
[INFO] ------------------------------------------------------------------------
[INFO] Total time: 55.350 s
[INFO] Finished at: 2018-10-10T14:19:54-04:00
[INFO] ------------------------------------------------------------------------
[ERROR] Failed to execute goal org.apache.maven.plugins:maven-compiler-plugin:3.7.0:testCompile (default-testCompile) on project rdf4j-sail-spin: Compilation failure
[ERROR] Picked up JAVA_TOOL_OPTIONS: -Xmx2G -Djava.io.tmpdir=/tmp/genie.rdf4j
[ERROR] /jobs/genie.rdf4j/rdf4j-storage-develop-verify/workspace/sail-spin/src/test/java/org/eclipse/rdf4j/sail/spin/SpinSailWithoutRDFSInferencerTest.java:[222,7] error: cannot access Iteration
[ERROR]   bad class file: /opt/public/hipp/homes/genie.rdf4j/.m2/repository/org/eclipse/rdf4j/rdf4j-util/2.5-SNAPSHOT/rdf4j-util-2.5-SNAPSHOT.jar(org/eclipse/rdf4j/common/iteration/Iteration.class)
[ERROR]     unable to access file: corrupted zip file
[ERROR]     Please remove or make sure it appears in the correct subdirectory of the classpath.
[ERROR] -> [Help 1]
[ERROR] 
[ERROR] To see the full stack trace of the errors, re-run Maven with the -e switch.
[ERROR] Re-run Maven using the -X switch to enable full debug logging.
[ERROR] 
[ERROR] For more information about the errors and possible solutions, please read the following articles:
[ERROR] [Help 1] http://cwiki.apache.org/confluence/display/MAVEN/MojoFailureException
[ERROR] 
[ERROR] After correcting the problems, you can resume the build with the command
[ERROR]   mvn <goals> -rf :rdf4j-sail-spin
Build step 'Invoke top-level Maven targets' marked build as failure
Not sending mail to unregistered user bart.hanssens@xxxxxxxxxxxx