[Date Prev][Date Next][Thread Prev][Thread Next][Date Index][Thread Index] [List Home]
[pdt-dev] [Hudson] Build failed in Hudson: pdt-master #128

See <https://hudson.eclipse.org/hudson/job/pdt-master/128/changes>

Changes:

[Marek Maksimczyk] Add posibility of blocks without brackled and colon in AST Block node.

------------------------------------------
Started by an SCM change
Building remotely on hudson-slave2
Checkout:pdt-master / <https://hudson.eclipse.org/hudson/job/pdt-master/ws/> - hudson.remoting.Channel@589ba891:hudson-slave2
Using strategy: Default
Last Built Revision: Revision 18960b0617374ae7abbf957c228487fb9f956a12 (origin/master)
Checkout:pdt-master / <https://hudson.eclipse.org/hudson/job/pdt-master/ws/> - hudson.remoting.LocalChannel@6fe6badb
Cloning the remote Git repository
Cloning repository origin
Fetching upstream changes from http://git.eclipse.org/gitroot/pdt/org.eclipse.pdt.git
Commencing build of Revision 0be0c8386e0e840af876f895a543205942c88f86 (origin/master)
Checking out Revision 0be0c8386e0e840af876f895a543205942c88f86 (origin/master)
Starting xvnc
[pdt-master] $ Xvnc :100 -geometry 1024x768 -depth 24 -ac
[INFO] Using bundled Maven 3 installation
[INFO] Checking Maven 3 installation environment
[pdt-master] $ /opt/buildhomes/hudsonBuild/maven/slavebundle/bundled-maven/bin/mvn --help
[INFO] Checking Maven 3 installation version
[pdt-master] $ /opt/buildhomes/hudsonBuild/maven/slavebundle/bundled-maven/bin/mvn --version
_XSERVTransmkdir: Owner of /tmp/.X11-unix should be set to root
10/02/2014 15:11:35 Xvnc version X.org/xf4vnc custom version
10/02/2014 15:11:35 Copyright (C) 2001-2004 Alan Hourihane.
10/02/2014 15:11:35 Copyright (C) 2000-2004 Constantin Kaplinsky
10/02/2014 15:11:35 Copyright (C) 1999 AT&T Laboratories Cambridge
10/02/2014 15:11:35 All Rights Reserved.
10/02/2014 15:11:35 See http://www.tightvnc.com/ for information on TightVNC
10/02/2014 15:11:35 See http://xf4vnc.sf.net for xf4vnc-specific information
10/02/2014 15:11:35 Desktop name 'x11' (build:100)
10/02/2014 15:11:35 Protocol versions supported: 3.7, 3.3
10/02/2014 15:11:35 RGB format 8 8 8
10/02/2014 15:11:35 Listening for VNC connections on TCP port 6000
[dix] Could not init font path element /usr/share/fonts/TTF/, removing from list!
[dix] Could not init font path element /usr/share/fonts/OTF, removing from list!
(EE) config/hal: NewInputDeviceRequest failed (2)
(EE) config/hal: NewInputDeviceRequest failed (2)
[INFO] Detected Maven 3 installation version: 3.0.3
[DEBUG] Waiting for connection on port: 36473
[pdt-master] $ /opt/buildhomes/hudsonBuild/maven/slavebundle/bundled-maven/bin/mvn clean install -V -B -DskipPdtPerformanceTests=true -Dmaven.ext.class.path=/opt/buildhomes/hudsonBuild/maven/slavebundle/resources:/opt/buildhomes/hudsonBuild/maven/slavebundle/lib/maven3-eventspy-3.0.jar:/opt/buildhomes/hudsonBuild/slave.jar -Dhudson.eventspy.port=36473 -Dmaven.repo.local=<https://hudson.eclipse.org/hudson/job/pdt-master/ws/.maven/repo> -f org.eclipse.pdt.releng/pom.xml
Apache Maven 3.0.3 (r1075438; 2011-02-28 12:31:09-0500)
Maven home: /opt/buildhomes/hudsonBuild/maven/slavebundle/bundled-maven
Java version: 1.5.0, vendor: Free Software Foundation, Inc.
Java home: /usr/lib64/jvm/java-1.5.0-gcj-4.3-1.5.0.0/jre
Default locale: en_US, platform encoding: UTF-8
OS name: "linux", version: "3.0.101-0.8-default", arch: "x86_64", family: "unix"
10-Feb-14 3:11:40 PM com.google.inject.internal.MessageProcessor visit
INFO: An exception was caught and reported. Message: java.util.NoSuchElementException
java.util.NoSuchElementException
   at java.util.AbstractList$2.next(libgcj.so.9)
   at com.google.inject.spi.InjectionPoint.forMember(InjectionPoint.java:114)
   at com.google.inject.spi.InjectionPoint.<init>(InjectionPoint.java:71)
   at com.google.inject.spi.InjectionPoint$InjectableMethod.toInjectionPoint(InjectionPoint.java:457)
   at com.google.inject.spi.InjectionPoint.getInjectionPoints(InjectionPoint.java:723)
   at com.google.inject.spi.InjectionPoint.forInstanceMethodsAndFields(InjectionPoint.java:356)
   at com.google.inject.spi.InjectionPoint.forInstanceMethodsAndFields(InjectionPoint.java:375)
   at com.google.inject.internal.BindingBuilder.toInstance(BindingBuilder.java:82)
   at org.codehaus.plexus.DefaultPlexusContainer$ContainerModule.configure(DefaultPlexusContainer.java:785)
   at com.google.inject.AbstractModule.configure(AbstractModule.java:59)
   at com.google.inject.spi.Elements$RecordingBinder.install(Elements.java:223)
   at com.google.inject.spi.Elements.getElements(Elements.java:101)
   at com.google.inject.spi.Elements.getElements(Elements.java:78)
   at org.sonatype.guice.bean.binders.MergedModule.configure(MergedModule.java:54)
   at com.google.inject.spi.Elements$RecordingBinder.install(Elements.java:223)
   at com.google.inject.spi.Elements.getElements(Elements.java:101)
   at com.google.inject.internal.InjectorShell$Builder.build(InjectorShell.java:132)
   at com.google.inject.internal.InternalInjectorCreator.build(InternalInjectorCreator.java:103)
   at com.google.inject.Guice.createInjector(Guice.java:95)
   at com.google.inject.Guice.createInjector(Guice.java:72)
   at com.google.inject.Guice.createInjector(Guice.java:62)
   at org.codehaus.plexus.DefaultPlexusContainer.addPlexusInjector(DefaultPlexusContainer.java:450)
   at org.codehaus.plexus.DefaultPlexusContainer.<init>(DefaultPlexusContainer.java:186)
   at org.codehaus.plexus.DefaultPlexusContainer.<init>(DefaultPlexusContainer.java:153)
   at org.apache.maven.cli.MavenCli.container(MavenCli.java:375)
   at org.apache.maven.cli.MavenCli.doMain(MavenCli.java:191)
   at org.apache.maven.cli.MavenCli.main(MavenCli.java:141)
   at java.lang.reflect.Method.invoke(libgcj.so.9)
   at org.codehaus.plexus.classworlds.launcher.Launcher.launchEnhanced(Launcher.java:290)
   at org.codehaus.plexus.classworlds.launcher.Launcher.launch(Launcher.java:230)
   at org.codehaus.plexus.classworlds.launcher.Launcher.mainWithExitCode(Launcher.java:409)
   at org.codehaus.plexus.classworlds.launcher.Launcher.main(Launcher.java:352)
[ERROR] Error executing Maven.
[ERROR] null
[ERROR] Process did not initiate connection and appears to have died; exit code: 1
[ERROR] Failure: hudson.AbortException: Process did not initiate connection and appears to have died; exit code: 1
Terminating xvnc.
ERROR: Process did not initiate connection and appears to have died; exit code: 1
Archiving artifacts
Recording test results

--
This message is automatically generated by Hudson. 
For more information on Hudson, see: http://hudson-ci.org/