[Date Prev][Date Next][Thread Prev][Thread Next][Date Index][Thread Index] [List Home]
[pdt-dev] Build failed in Hudson: cbi-pdt-3.0-indigo #155

See <https://hudson.eclipse.org/hudson/job/cbi-pdt-3.0-indigo/155/changes>

Changes:

[zzhongwei] 349894: add ${line_selection} and ${word_selection} in php editor template content assist
https://bugs.eclipse.org/bugs/show_bug.cgi?id=349894

[zzhongwei] add NPE check

[zzhongwei] 275038: Block code - no selected "Enter description here..."
https://bugs.eclipse.org/bugs/show_bug.cgi?id=275038

[zzhongwei] 326677: [Regression] Wrong function name shown in Debug View
https://bugs.eclipse.org/bugs/show_bug.cgi?id=326677

[zzhongwei] use IConfigurationElement.createExecutableExtension to instance class,so we can load class in other plugin

[zzhongwei] An internal error occurred during: "Processing Dirty Regions". java.lang.NullPointerException

[zzhongwei] *** empty log message ***

[zzhongwei] 350337: Bad label in Preferences/General/Keys
https://bugs.eclipse.org/bugs/show_bug.cgi?id=350337

[zzhongwei] *** empty log message ***

[zzhongwei] pass IIndexingRequestor reference to PhpIndexingVisitorExtension

[zzhongwei] 349063: [CA] any CA for properties and methods in some cases in ZF, the order of methods call is important ( e.g. Zend_Dojo_Form_Element_DateTextBox and CA methods declared in Zend_Dojo_Form_Element_DateTextBox class )
https://bugs.eclipse.org/bugs/show_bug.cgi?id=349063

[zzhongwei] 343572: PDT reading incorrect tabs/spaces setting
https://bugs.eclipse.org/bugs/show_bug.cgi?id=343572

[zzhongwei] 350139: Cannot type HTML code inside of a PHP code block - can lead to file corruption.
https://bugs.eclipse.org/bugs/show_bug.cgi?id=350139

[zzhongwei] 350405: Incorrect default Launch URL when Run/Debug As PHP Web Page
https://bugs.eclipse.org/bugs/show_bug.cgi?id=350405

------------------------------------------
[...truncated 160 lines...]
genBuildCfg:
Trying to override old definition of task resolvepath

createBuildConfigFile:
Trying to override old definition of task resolvepath

initCommandlineArgsList:
Trying to override old definition of task resolvepath

load.properties:
     [echo] Load properties from <https://hudson.eclipse.org/hudson/job/cbi-pdt-3.0-indigo/ws/build/org.eclipse.pdt.releng/build.properties>
     [echo] 
     [echo] Loaded JAVA*_HOME and bootclasspath values:
     [echo]         JAVA_HOME = /shared/common/jdk-1.5.0-22.x86_64
     [echo]       JAVA14_HOME = /shared/common/jdk-1.5.0-22.x86_64, J2SE-1.4 = /shared/common/jdk-1.5.0-22.x86_64/lib/vm.jar:/shared/common/jdk-1.5.0-22.x86_64/jre/lib/vm.jar:/shared/common/jdk-1.5.0-22.x86_64/lib/dt.jar:/shared/common/jdk-1.5.0-22.x86_64/jre/lib/dt.jar:/shared/common/jdk-1.5.0-22.x86_64/lib/rt.jar:/shared/common/jdk-1.5.0-22.x86_64/jre/lib/rt.jar:/shared/common/jdk-1.5.0-22.x86_64/lib/core.jar:/shared/common/jdk-1.5.0-22.x86_64/jre/lib/core.jar:/shared/common/jdk-1.5.0-22.x86_64/lib/xml.jar:/shared/common/jdk-1.5.0-22.x86_64/jre/lib/xml.jar:/shared/common/jdk-1.5.0-22.x86_64/lib/graphics.jar:/shared/common/jdk-1.5.0-22.x86_64/jre/lib/graphics.jar:/shared/common/jdk-1.5.0-22.x86_64/lib/server.jar:/shared/common/jdk-1.5.0-22.x86_64/jre/lib/server.jar:/shared/common/jdk-1.5.0-22.x86_64/lib/ibmorbapi.jar:/shared/common/jdk-1.5.0-22.x86_64/jre/lib/ibmorbapi.jar:/shared/common/jdk-1.5.0-22.x86_64/lib/security.jar:/shared/common/jdk-1.5.0-22.x86_64/jre/lib/security.jar:/shared/common/jdk-1.5.0-22.x86_64/lib/classes.jar:/shared/common/jdk-1.5.0-22.x86_64/jre/lib/classes.jar:/shared/common/jdk-1.5.0-22.x86_64/jre/lib/jce.jar:/shared/common/jdk-1.5.0-22.x86_64/lib/jsse.jar:/shared/common/jdk-1.5.0-22.x86_64/jre/lib/jsse.jar:/shared/common/jdk-1.5.0-22.x86_64/../Classes/dt.jar:/shared/common/jdk-1.5.0-22.x86_64/../Classes/classes.jar:/shared/common/jdk-1.5.0-22.x86_64/../Classes/jsse.jar:/shared/common/jdk-1.5.0-22.x86_64/../Classes/jce.jar
     [echo]       JAVA50_HOME = /shared/common/jdk-1.5.0-22.x86_64, J2SE-1.5 = /shared/common/jdk-1.5.0-22.x86_64/jre/lib/rt.jar:/shared/common/jdk-1.5.0-22.x86_64/jre/lib/vm.jar:/shared/common/jdk-1.5.0-22.x86_64/jre/lib/core.jar:/shared/common/jdk-1.5.0-22.x86_64/jre/lib/xml.jar:/shared/common/jdk-1.5.0-22.x86_64/jre/lib/graphics.jar:/shared/common/jdk-1.5.0-22.x86_64/jre/lib/server.jar:/shared/common/jdk-1.5.0-22.x86_64/jre/lib/ibmorbapi.jar:/shared/common/jdk-1.5.0-22.x86_64/jre/lib/security.jar:/shared/common/jdk-1.5.0-22.x86_64/jre/lib/classes.jar:/shared/common/jdk-1.5.0-22.x86_64/jre/lib/jsse.jar:/shared/common/jdk-1.5.0-22.x86_64/jre/lib/jce.jar:/shared/common/jdk-1.5.0-22.x86_64/jre/lib/ibmjcefw.jar:/shared/common/jdk-1.5.0-22.x86_64/../Classes/dt.jar:/shared/common/jdk-1.5.0-22.x86_64/../Classes/classes.jar:/shared/common/jdk-1.5.0-22.x86_64/../Classes/jsse.jar:/shared/common/jdk-1.5.0-22.x86_64/../Classes/jce.jar
     [echo]       JAVA60_HOME = /shared/common/jdk-1.6.x86_64, JavaSE-1.6 = /shared/common/jdk-1.6.x86_64/jre/lib/rt.jar:/shared/common/jdk-1.6.x86_64/jre/lib/core.jar:/shared/common/jdk-1.6.x86_64/jre/lib/annotation.jar:/shared/common/jdk-1.6.x86_64/jre/lib/beans.jar:/shared/common/jdk-1.6.x86_64/jre/lib/ibmorbapi.jar:/shared/common/jdk-1.6.x86_64/jre/lib/java.util.jar:/shared/common/jdk-1.6.x86_64/jre/lib/jlm.jar:/shared/common/jdk-1.6.x86_64/jre/lib/logging.jar:/shared/common/jdk-1.6.x86_64/jre/lib/resources.jar:/shared/common/jdk-1.6.x86_64/jre/lib/security.jar:/shared/common/jdk-1.6.x86_64/jre/lib/sql.jar:/shared/common/jdk-1.6.x86_64/jre/lib/vm.jar:/shared/common/jdk-1.6.x86_64/jre/lib/xmldsigfw.jar:/shared/common/jdk-1.6.x86_64/jre/lib/xml.jar:/shared/common/jdk-1.6.x86_64/jre/lib/graphics.jar:/shared/common/jdk-1.6.x86_64/jre/lib/server.jar:/shared/common/jdk-1.6.x86_64/jre/lib/jce.jar:/shared/common/jdk-1.6.x86_64/jre/lib/jsse.jar:/shared/common/jdk-1.6.x86_64/jre/lib/ibmjcefw.jar:/shared/common/jdk-1.6.x86_64/lib/dt.jar:/shared/common/jdk-1.6.x86_64/../Classes/dt.jar:/shared/common/jdk-1.6.x86_64/../Classes/classes.jar:/shared/common/jdk-1.6.x86_64/../Classes/jsse.jar:/shared/common/jdk-1.6.x86_64/../Classes/jce.jar
     [echo] Created <https://hudson.eclipse.org/hudson/job/cbi-pdt-3.0-indigo/155/artifact/build/N201107010048/build.cfg>
Trying to override old definition of task resolvepath

collectMapTypes:
     [echo] Found these map entry types: CVS
Trying to override old definition of task resolvepath

collectURLs:

getZip:
      [get] Getting: http://download.eclipse.org/eclipse/downloads/drops/S-3.7M6-201103101119/eclipse-SDK-3.7M6-linux-gtk-x86_64.tar.gz
      [get] To: <https://hudson.eclipse.org/hudson/job/cbi-pdt-3.0-indigo/ws/build/downloads/eclipse-SDK-3.7M6-linux-gtk-x86_64.tar.gz>

getZip:
      [get] Getting: http://download.eclipse.org/technology/dltk/downloads/drops/R2.0/R-2.0-201006161315/dltk-core-Automated_Tests-R-2.0-201006161315.zip
      [get] To: <https://hudson.eclipse.org/hudson/job/cbi-pdt-3.0-indigo/ws/build/downloads/dltk-core-Automated_Tests-R-2.0-201006161315.zip>
     [echo] Found 2 dependency URLs
     [echo] Load properties from <https://hudson.eclipse.org/hudson/job/cbi-pdt-3.0-indigo/155/artifact/build/N201107010048/build.cfg>
     [echo] Got incubation = 

create.label.properties:
     [echo] subprojectName = pdt
     [echo] Base OS: linux; Base Window System: gtk

collectMaps:

run:

get.pde.build.svn:

get.ant4eclipse:

get.SWTBot.junit4:
     [echo] buildAll.xml#run :: build.step :: buildUpdate

buildUpdate:

buildMasterZip:

-timestamp:
     [echo] 12:49:29

main-init:

main:

main:

preBuild:

preSetup:
    [mkdir] Created dir: <https://hudson.eclipse.org/hudson/job/cbi-pdt-3.0-indigo/155/artifact/build/N201107010048/eclipse/N201107010048>

getMapFiles:
     [copy] Copying 1 file to <https://hudson.eclipse.org/hudson/job/cbi-pdt-3.0-indigo/155/artifact/build/N201107010048/eclipse>

init:

postSetup:

provision.eclipse.build.base:

provision.eclipse.base:
     [echo] Provision Eclipse base from eclipse-SDK-3.7M6-linux-gtk-x86_64.tar.gz into <https://hudson.eclipse.org/hudson/job/cbi-pdt-3.0-indigo/155/artifact/build/N201107010048...>

init:

getDep:

getBundle:

downloadFile:

unpackBundle:

unzipFile:

untarFile:
    [untar] Expanding: <https://hudson.eclipse.org/hudson/job/cbi-pdt-3.0-indigo/ws/build/downloads/eclipse-SDK-3.7M6-linux-gtk-x86_64.tar.gz> into <https://hudson.eclipse.org/hudson/job/cbi-pdt-3.0-indigo/155/artifact/build/N201107010048>
     [echo] Install org.eclipse.test+org.eclipse.wst.web_ui.feature+org.eclipse.dltk.core+org.eclipse.dltk.mylyn+org.eclipse.dltk.core.index+org.eclipse.wst.common.fproj to <https://hudson.eclipse.org/hudson/job/cbi-pdt-3.0-indigo/155/artifact/build/N201107010048/eclipse>

run.director:

-timestamp:
     [echo] 12:50:01
    [mkdir] Created dir: <https://hudson.eclipse.org/hudson/job/cbi-pdt-3.0-indigo/155/artifact/build/N201107010048/eclipse/p2repoZipsTmp>

init:

getDep:

getBundle:

downloadFile:
      [get] Getting: http://download.eclipse.org/eclipse/downloads/drops/S-3.7M6-201103101119/eclipse-test-framework-3.7M6.zip
      [get] To: <https://hudson.eclipse.org/hudson/job/cbi-pdt-3.0-indigo/ws/build/downloads/eclipse-test-framework-3.7M6.zip>

unpackBundle:

unzipFile:
    [unzip] Expanding: <https://hudson.eclipse.org/hudson/job/cbi-pdt-3.0-indigo/ws/build/downloads/eclipse-test-framework-3.7M6.zip> into <https://hudson.eclipse.org/hudson/job/cbi-pdt-3.0-indigo/155/artifact/build/N201107010048/eclipse/p2repoZipsTmp/eclipse-test-framework-3.7M6.zip_>

untarFile:
      [zip] Building zip: <https://hudson.eclipse.org/hudson/job/cbi-pdt-3.0-indigo/155/artifact/build/N201107010048/eclipse/p2repoZipsTmp/eclipse-test-framework-3.7M6.zip>
   [delete] Deleting directory <https://hudson.eclipse.org/hudson/job/cbi-pdt-3.0-indigo/155/artifact/build/N201107010048/eclipse/p2repoZipsTmp/eclipse-test-framework-3.7M6.zip_>

init:

getDep:

getBundle:

downloadFile:
      [get] Getting: http://download.eclipse.org/modeling/emf/emf/downloads/drops/2.7.0/S201103101804/emf-xsd-Update-2.7.0M6.zip
      [get] To: <https://hudson.eclipse.org/hudson/job/cbi-pdt-3.0-indigo/ws/build/downloads/emf-xsd-Update-2.7.0M6.zip>

unpackBundle:

unzipFile:
    [unzip] Expanding: <https://hudson.eclipse.org/hudson/job/cbi-pdt-3.0-indigo/ws/build/downloads/emf-xsd-Update-2.7.0M6.zip> into <https://hudson.eclipse.org/hudson/job/cbi-pdt-3.0-indigo/155/artifact/build/N201107010048/eclipse/p2repoZipsTmp/emf-xsd-Update-2.7.0M6.zip_>

untarFile:
      [zip] Building zip: <https://hudson.eclipse.org/hudson/job/cbi-pdt-3.0-indigo/155/artifact/build/N201107010048/eclipse/p2repoZipsTmp/emf-xsd-Update-2.7.0M6.zip>
   [delete] Deleting directory <https://hudson.eclipse.org/hudson/job/cbi-pdt-3.0-indigo/155/artifact/build/N201107010048/eclipse/p2repoZipsTmp/emf-xsd-Update-2.7.0M6.zip_>

init:

getDep:

getBundle:

downloadFile:
      [get] Getting: http://download.eclipse.org/webtools/downloads/drops/R3.3.0/S-3.3.0M6-20110311022618/wtp-repo-S-3.3.0M6-20110311022618.zip
      [get] To: <https://hudson.eclipse.org/hudson/job/cbi-pdt-3.0-indigo/ws/build/downloads/wtp-repo-S-3.3.0M6-20110311022618.zip>
      [get] Error opening connection java.io.FileNotFoundException: http://download.eclipse.org/webtools/downloads/drops/R3.3.0/S-3.3.0M6-20110311022618/wtp-repo-S-3.3.0M6-20110311022618.zip
      [get] Error opening connection java.io.FileNotFoundException: http://download.eclipse.org/webtools/downloads/drops/R3.3.0/S-3.3.0M6-20110311022618/wtp-repo-S-3.3.0M6-20110311022618.zip
      [get] Error opening connection java.io.FileNotFoundException: http://download.eclipse.org/webtools/downloads/drops/R3.3.0/S-3.3.0M6-20110311022618/wtp-repo-S-3.3.0M6-20110311022618.zip
      [get] Can't get http://download.eclipse.org/webtools/downloads/drops/R3.3.0/S-3.3.0M6-20110311022618/wtp-repo-S-3.3.0M6-20110311022618.zip to <https://hudson.eclipse.org/hudson/job/cbi-pdt-3.0-indigo/ws/build/downloads/wtp-repo-S-3.3.0M6-20110311022618.zip>
      [for] org.eclipse.test+org.eclipse.wst.web_ui.feature+org.eclipse.dltk.core+org.eclipse.dltk.mylyn+org.eclipse.dltk.core.index+org.eclipse.wst.common.fproj: The following error occurred while executing this line:
      [for] <https://hudson.eclipse.org/hudson/job/cbi-pdt-3.0-indigo/ws/build/org.eclipse.dash.common.releng/builder/all/customTargets.xml>:257: The following error occurred while executing this line:
      [for] <https://hudson.eclipse.org/hudson/job/cbi-pdt-3.0-indigo/ws/build/org.eclipse.dash.common.releng/tools/scripts/buildAllHelper.xml>:1377: The following error occurred while executing this line:
      [for] <https://hudson.eclipse.org/hudson/job/cbi-pdt-3.0-indigo/ws/build/org.eclipse.dash.common.releng/tools/scripts/buildAllHelper.xml>:1398: The following error occurred while executing this line:
      [for] <https://hudson.eclipse.org/hudson/job/cbi-pdt-3.0-indigo/ws/build/org.eclipse.dash.common.releng/tools/scripts/getDependencies.xml>:41: The following error occurred while executing this line:
      [for] <https://hudson.eclipse.org/hudson/job/cbi-pdt-3.0-indigo/ws/build/org.eclipse.dash.common.releng/tools/scripts/getDependenciesHelper.xml>:13: The following error occurred while executing this line:
      [for] <https://hudson.eclipse.org/hudson/job/cbi-pdt-3.0-indigo/ws/build/org.eclipse.dash.common.releng/tools/scripts/getDependenciesHelper.xml>:78: Can't get http://download.eclipse.org/webtools/downloads/drops/R3.3.0/S-3.3.0M6-20110311022618/wtp-repo-S-3.3.0M6-20110311022618.zip to <https://hudson.eclipse.org/hudson/job/cbi-pdt-3.0-indigo/ws/build/downloads/wtp-repo-S-3.3.0M6-20110311022618.zip>
      [for] featureIDsToInstall: The following error occurred while executing this line:
      [for] <https://hudson.eclipse.org/hudson/job/cbi-pdt-3.0-indigo/ws/build/org.eclipse.dash.common.releng/builder/all/customTargets.xml>:230: Keepgoing execution: 1 of 1 iterations failed.
     [echo] Install org.apache.commons.lang+org.h2 to <https://hudson.eclipse.org/hudson/job/cbi-pdt-3.0-indigo/155/artifact/build/N201107010048/eclipse>

run.director:

-timestamp:
     [echo] 12:50:23

init:

getDep:

getBundle:

downloadFile:

unpackBundle:

unzipFile:
    [unzip] Expanding: <https://hudson.eclipse.org/hudson/job/cbi-pdt-3.0-indigo/ws/build/downloads/eclipse-test-framework-3.7M6.zip> into <https://hudson.eclipse.org/hudson/job/cbi-pdt-3.0-indigo/155/artifact/build/N201107010048/eclipse/p2repoZipsTmp/eclipse-test-framework-3.7M6.zip_>

untarFile:
      [zip] Building zip: <https://hudson.eclipse.org/hudson/job/cbi-pdt-3.0-indigo/155/artifact/build/N201107010048/eclipse/p2repoZipsTmp/eclipse-test-framework-3.7M6.zip>
   [delete] Deleting directory <https://hudson.eclipse.org/hudson/job/cbi-pdt-3.0-indigo/155/artifact/build/N201107010048/eclipse/p2repoZipsTmp/eclipse-test-framework-3.7M6.zip_>

init:

getDep:

getBundle:

downloadFile:

unpackBundle:

unzipFile:
    [unzip] Expanding: <https://hudson.eclipse.org/hudson/job/cbi-pdt-3.0-indigo/ws/build/downloads/emf-xsd-Update-2.7.0M6.zip> into <https://hudson.eclipse.org/hudson/job/cbi-pdt-3.0-indigo/155/artifact/build/N201107010048/eclipse/p2repoZipsTmp/emf-xsd-Update-2.7.0M6.zip_>

untarFile:
      [zip] Building zip: <https://hudson.eclipse.org/hudson/job/cbi-pdt-3.0-indigo/155/artifact/build/N201107010048/eclipse/p2repoZipsTmp/emf-xsd-Update-2.7.0M6.zip>
   [delete] Deleting directory <https://hudson.eclipse.org/hudson/job/cbi-pdt-3.0-indigo/155/artifact/build/N201107010048/eclipse/p2repoZipsTmp/emf-xsd-Update-2.7.0M6.zip_>

init:

getDep:

getBundle:

downloadFile:
      [get] Getting: http://download.eclipse.org/webtools/downloads/drops/R3.3.0/S-3.3.0M6-20110311022618/wtp-repo-S-3.3.0M6-20110311022618.zip
      [get] To: <https://hudson.eclipse.org/hudson/job/cbi-pdt-3.0-indigo/ws/build/downloads/wtp-repo-S-3.3.0M6-20110311022618.zip>
      [get] Error opening connection java.io.FileNotFoundException: http://download.eclipse.org/webtools/downloads/drops/R3.3.0/S-3.3.0M6-20110311022618/wtp-repo-S-3.3.0M6-20110311022618.zip
      [get] Error opening connection java.io.FileNotFoundException: http://download.eclipse.org/webtools/downloads/drops/R3.3.0/S-3.3.0M6-20110311022618/wtp-repo-S-3.3.0M6-20110311022618.zip
      [get] Error opening connection java.io.FileNotFoundException: http://download.eclipse.org/webtools/downloads/drops/R3.3.0/S-3.3.0M6-20110311022618/wtp-repo-S-3.3.0M6-20110311022618.zip
      [get] Can't get http://download.eclipse.org/webtools/downloads/drops/R3.3.0/S-3.3.0M6-20110311022618/wtp-repo-S-3.3.0M6-20110311022618.zip to <https://hudson.eclipse.org/hudson/job/cbi-pdt-3.0-indigo/ws/build/downloads/wtp-repo-S-3.3.0M6-20110311022618.zip>
      [for] org.apache.commons.lang+org.h2: The following error occurred while executing this line:
      [for] <https://hudson.eclipse.org/hudson/job/cbi-pdt-3.0-indigo/ws/build/org.eclipse.dash.common.releng/builder/all/customTargets.xml>:257: The following error occurred while executing this line:
      [for] <https://hudson.eclipse.org/hudson/job/cbi-pdt-3.0-indigo/ws/build/org.eclipse.dash.common.releng/tools/scripts/buildAllHelper.xml>:1377: The following error occurred while executing this line:
      [for] <https://hudson.eclipse.org/hudson/job/cbi-pdt-3.0-indigo/ws/build/org.eclipse.dash.common.releng/tools/scripts/buildAllHelper.xml>:1398: The following error occurred while executing this line:
      [for] <https://hudson.eclipse.org/hudson/job/cbi-pdt-3.0-indigo/ws/build/org.eclipse.dash.common.releng/tools/scripts/getDependencies.xml>:41: The following error occurred while executing this line:
      [for] <https://hudson.eclipse.org/hudson/job/cbi-pdt-3.0-indigo/ws/build/org.eclipse.dash.common.releng/tools/scripts/getDependenciesHelper.xml>:13: The following error occurred while executing this line:
      [for] <https://hudson.eclipse.org/hudson/job/cbi-pdt-3.0-indigo/ws/build/org.eclipse.dash.common.releng/tools/scripts/getDependenciesHelper.xml>:78: Can't get http://download.eclipse.org/webtools/downloads/drops/R3.3.0/S-3.3.0M6-20110311022618/wtp-repo-S-3.3.0M6-20110311022618.zip to <https://hudson.eclipse.org/hudson/job/cbi-pdt-3.0-indigo/ws/build/downloads/wtp-repo-S-3.3.0M6-20110311022618.zip>
      [for] pluginIDsToInstall: The following error occurred while executing this line:
      [for] <https://hudson.eclipse.org/hudson/job/cbi-pdt-3.0-indigo/ws/build/org.eclipse.dash.common.releng/builder/all/customTargets.xml>:230: Keepgoing execution: 1 of 1 iterations failed.

BUILD FAILED
<https://hudson.eclipse.org/hudson/job/cbi-pdt-3.0-indigo/ws/build/org.eclipse.dash.common.releng/buildAll.xml>:378: The following error occurred while executing this line:
<https://hudson.eclipse.org/hudson/job/cbi-pdt-3.0-indigo/ws/build/org.eclipse.dash.common.releng/buildAll.xml>:419: The following error occurred while executing this line:
<https://hudson.eclipse.org/hudson/job/cbi-pdt-3.0-indigo/ws/build/org.eclipse.dash.common.releng/tools/scripts/buildAllHelper.xml>:833: The following error occurred while executing this line:
<https://hudson.eclipse.org/hudson/job/cbi-pdt-3.0-indigo/ws/build/org.eclipse.dash.common.releng/tools/scripts/buildAllHelper.xml>:1242: The following error occurred while executing this line:
<https://hudson.eclipse.org/hudson/job/cbi-pdt-3.0-indigo/ws/build/org.eclipse.dash.common.releng/build.xml>:199: The following error occurred while executing this line:
/opt/public/cbi/build/org.eclipse.releng.basebuilder_r35x_v20090811/plugins/org.eclipse.pde.build_3.5.0.v20090527-1800/scripts/build.xml:32: The following error occurred while executing this line:
/opt/public/cbi/build/org.eclipse.releng.basebuilder_r35x_v20090811/plugins/org.eclipse.pde.build_3.5.0.v20090527-1800/scripts/build.xml:53: The following error occurred while executing this line:
<https://hudson.eclipse.org/hudson/job/cbi-pdt-3.0-indigo/ws/build/org.eclipse.dash.common.releng/builder/all/customTargets.xml>:208: Keepgoing execution: 2 of 3 iterations failed.

Total time: 1 minute 29 seconds
[start] [00:50:38] start.sh finished.

++ rm -f <https://hudson.eclipse.org/hudson/job/cbi-pdt-3.0-indigo/ws/build/.cvspass>
+++ date '+%Y/%m/%d %H:%M'
++ echo '[2011/07/01 00:50] Hudson job  build #155 (2011-07-01_00-37-44) done.'
[2011/07/01 00:50] Hudson job  build #155 (2011-07-01_00-37-44) done.
Terminating xvnc.
Archiving artifacts
Recording test results
No test report files were found. Configuration error?