[Date Prev][Date Next][Thread Prev][Thread Next][Date Index][Thread Index] [List Home]
[pdt-dev] Build failed in Hudson: cbi-pdt-3.0-indigo #41

See <https://hudson.eclipse.org/hudson/job/cbi-pdt-3.0-indigo/41/changes>

Changes:

[rganor] update promotion script to upload to indigo sites

------------------------------------------
[...truncated 54441 lines...]

all.children:

init:

gather.logs:

init:

all.features:

all.plugins:

properties:

init:

gather.logs:
    [mkdir] Created dir: <https://hudson.eclipse.org/hudson/job/cbi-pdt-3.0-indigo/41/artifact/build/M201012150947/eclipse/features/org.eclipse.php.all/feature.temp.folder/plugins/org.eclipse.php.mylyn.ui_1.0.0.v20101215-1700>
     [copy] Copying 1 file to <https://hudson.eclipse.org/hudson/job/cbi-pdt-3.0-indigo/41/artifact/build/M201012150947/eclipse/features/org.eclipse.php.all/feature.temp.folder/plugins/org.eclipse.php.mylyn.ui_1.0.0.v20101215-1700>

update.feature:

all.children:

all.plugins:

update.feature:

all.children:
      [zip] Building zip: <https://hudson.eclipse.org/hudson/job/cbi-pdt-3.0-indigo/41/artifact/build/M201012150947/eclipse/features/org.eclipse.php.all/org.eclipse.php.all_2.2.0.v20101215-1700-53-7A51J1WEU6OJWtObd_jXFYemM.log.zip>
   [delete] Deleting directory <https://hudson.eclipse.org/hudson/job/cbi-pdt-3.0-indigo/41/artifact/build/M201012150947/eclipse/features/org.eclipse.php.all/feature.temp.folder>
    [unzip] Expanding: <https://hudson.eclipse.org/hudson/job/cbi-pdt-3.0-indigo/41/artifact/build/M201012150947/eclipse/features/org.eclipse.php.all/org.eclipse.php.all_2.2.0.v20101215-1700-53-7A51J1WEU6OJWtObd_jXFYemM.log.zip> into <https://hudson.eclipse.org/hudson/job/cbi-pdt-3.0-indigo/41/artifact/build/M201012150947/eclipse/M201012150947/compilelogs>

buildExtra.xml:

-timestamp:
     [echo] 09:52:31
     [echo] Signing control properties:
     [echo] 	sign = true
     [echo] 	skipSign = ${skipSign}
     [echo] 	domainNamespace = org.eclipse

signMasterZip:

-timestamp:
     [echo] 09:52:31

-timestamp:
     [echo] 09:52:31
    [mkdir] Created dir: <https://hudson.eclipse.org/hudson/job/cbi-pdt-3.0-indigo/41/artifact/build/M201012150947/eclipse/packtmp>
     [move] Moving 1 file to <https://hudson.eclipse.org/hudson/job/cbi-pdt-3.0-indigo/41/artifact/build/M201012150947/eclipse/packtmp>
      [zip] Updating zip: <https://hudson.eclipse.org/hudson/job/cbi-pdt-3.0-indigo/41/artifact/build/M201012150947/eclipse/packtmp/pdt-Master-M201012150947.zip>
     [echo] Signing pdt-Master-M201012150947.zip in <https://hudson.eclipse.org/hudson/job/cbi-pdt-3.0-indigo/ws/build/signing> on localhost ...

-timestamp:
     [echo] 09:52:33
     [echo] Push pdt-Master-M201012150947.zip to staging directory
     [copy] Copying 1 file to <https://hudson.eclipse.org/hudson/job/cbi-pdt-3.0-indigo/ws/build/signing>

-timestamp:
     [echo] 09:52:34
     [echo] Invoke sign script and wait 15 x 180 seconds
     [echo] Sleep for 180 seconds...

-timestamp:
     [echo] 09:55:34
Trying to override old definition of task resolvepath

checkForSignedZip:
     [exec] Result: 2
     [echo] /bin/ls: cannot access <https://hudson.eclipse.org/hudson/job/cbi-pdt-3.0-indigo/ws/build/signing/M201012150947-out/pdt-Master-M201012150947.zip>: No such file or directory
    [retry] Attempt [0]: error occurred; retrying...
     [echo] Sleep for 180 seconds...

-timestamp:
     [echo] 09:58:34
Trying to override old definition of task resolvepath

checkForSignedZip:
     [exec] Result: 2
     [echo] /bin/ls: cannot access <https://hudson.eclipse.org/hudson/job/cbi-pdt-3.0-indigo/ws/build/signing/M201012150947-out/pdt-Master-M201012150947.zip>: No such file or directory
    [retry] Attempt [1]: error occurred; retrying...
     [echo] Sleep for 180 seconds...

-timestamp:
     [echo] 10:01:34
Trying to override old definition of task resolvepath

checkForSignedZip:
     [exec] Result: 2
     [echo] /bin/ls: cannot access <https://hudson.eclipse.org/hudson/job/cbi-pdt-3.0-indigo/ws/build/signing/M201012150947-out/pdt-Master-M201012150947.zip>: No such file or directory
    [retry] Attempt [2]: error occurred; retrying...
     [echo] Sleep for 180 seconds...

-timestamp:
     [echo] 10:04:34
Trying to override old definition of task resolvepath

checkForSignedZip:
     [exec] Result: 2
     [echo] /bin/ls: cannot access <https://hudson.eclipse.org/hudson/job/cbi-pdt-3.0-indigo/ws/build/signing/M201012150947-out/pdt-Master-M201012150947.zip>: No such file or directory
    [retry] Attempt [3]: error occurred; retrying...
     [echo] Sleep for 180 seconds...

-timestamp:
     [echo] 10:07:35
Trying to override old definition of task resolvepath

checkForSignedZip:
     [exec] Result: 2
     [echo] /bin/ls: cannot access <https://hudson.eclipse.org/hudson/job/cbi-pdt-3.0-indigo/ws/build/signing/M201012150947-out/pdt-Master-M201012150947.zip>: No such file or directory
    [retry] Attempt [4]: error occurred; retrying...
     [echo] Sleep for 180 seconds...

-timestamp:
     [echo] 10:10:35
Trying to override old definition of task resolvepath

checkForSignedZip:
     [exec] Result: 2
     [echo] /bin/ls: cannot access <https://hudson.eclipse.org/hudson/job/cbi-pdt-3.0-indigo/ws/build/signing/M201012150947-out/pdt-Master-M201012150947.zip>: No such file or directory
    [retry] Attempt [5]: error occurred; retrying...
     [echo] Sleep for 180 seconds...

-timestamp:
     [echo] 10:13:36
Trying to override old definition of task resolvepath

checkForSignedZip:
     [exec] Result: 2
     [echo] /bin/ls: cannot access <https://hudson.eclipse.org/hudson/job/cbi-pdt-3.0-indigo/ws/build/signing/M201012150947-out/pdt-Master-M201012150947.zip>: No such file or directory
    [retry] Attempt [6]: error occurred; retrying...
     [echo] Sleep for 180 seconds...

-timestamp:
     [echo] 10:16:36
Trying to override old definition of task resolvepath

checkForSignedZip:
     [exec] Result: 2
     [echo] /bin/ls: cannot access <https://hudson.eclipse.org/hudson/job/cbi-pdt-3.0-indigo/ws/build/signing/M201012150947-out/pdt-Master-M201012150947.zip>: No such file or directory
    [retry] Attempt [7]: error occurred; retrying...
     [echo] Sleep for 180 seconds...

-timestamp:
     [echo] 10:19:36
Trying to override old definition of task resolvepath

checkForSignedZip:
     [exec] Result: 2
     [echo] /bin/ls: cannot access <https://hudson.eclipse.org/hudson/job/cbi-pdt-3.0-indigo/ws/build/signing/M201012150947-out/pdt-Master-M201012150947.zip>: No such file or directory
    [retry] Attempt [8]: error occurred; retrying...
     [echo] Sleep for 180 seconds...

-timestamp:
     [echo] 10:22:36
Trying to override old definition of task resolvepath

checkForSignedZip:
     [exec] Result: 2
     [echo] /bin/ls: cannot access <https://hudson.eclipse.org/hudson/job/cbi-pdt-3.0-indigo/ws/build/signing/M201012150947-out/pdt-Master-M201012150947.zip>: No such file or directory
    [retry] Attempt [9]: error occurred; retrying...
     [echo] Sleep for 180 seconds...

-timestamp:
     [echo] 10:25:36
Trying to override old definition of task resolvepath

checkForSignedZip:
     [exec] Result: 2
     [echo] /bin/ls: cannot access <https://hudson.eclipse.org/hudson/job/cbi-pdt-3.0-indigo/ws/build/signing/M201012150947-out/pdt-Master-M201012150947.zip>: No such file or directory
    [retry] Attempt [10]: error occurred; retrying...
     [echo] Sleep for 180 seconds...

-timestamp:
     [echo] 10:28:36
Trying to override old definition of task resolvepath

checkForSignedZip:
     [exec] Result: 2
     [echo] /bin/ls: cannot access <https://hudson.eclipse.org/hudson/job/cbi-pdt-3.0-indigo/ws/build/signing/M201012150947-out/pdt-Master-M201012150947.zip>: No such file or directory
    [retry] Attempt [11]: error occurred; retrying...
     [echo] Sleep for 180 seconds...

-timestamp:
     [echo] 10:31:37
Trying to override old definition of task resolvepath

checkForSignedZip:
     [exec] Result: 2
     [echo] /bin/ls: cannot access <https://hudson.eclipse.org/hudson/job/cbi-pdt-3.0-indigo/ws/build/signing/M201012150947-out/pdt-Master-M201012150947.zip>: No such file or directory
    [retry] Attempt [12]: error occurred; retrying...
     [echo] Sleep for 180 seconds...

-timestamp:
     [echo] 10:34:37
Trying to override old definition of task resolvepath

checkForSignedZip:
     [exec] Result: 2
     [echo] /bin/ls: cannot access <https://hudson.eclipse.org/hudson/job/cbi-pdt-3.0-indigo/ws/build/signing/M201012150947-out/pdt-Master-M201012150947.zip>: No such file or directory
    [retry] Attempt [13]: error occurred; retrying...
     [echo] Sleep for 180 seconds...

-timestamp:
     [echo] 10:37:37
Trying to override old definition of task resolvepath

checkForSignedZip:
     [exec] Result: 2
     [echo] /bin/ls: cannot access <https://hudson.eclipse.org/hudson/job/cbi-pdt-3.0-indigo/ws/build/signing/M201012150947-out/pdt-Master-M201012150947.zip>: No such file or directory
    [retry] Attempt [14]: error occurred; retrying...
     [echo] Sleep for 180 seconds...

-timestamp:
     [echo] 10:40:37
Trying to override old definition of task resolvepath

checkForSignedZip:
     [exec] Result: 2
     [echo] /bin/ls: cannot access <https://hudson.eclipse.org/hudson/job/cbi-pdt-3.0-indigo/ws/build/signing/M201012150947-out/pdt-Master-M201012150947.zip>: No such file or directory
     [echo] Warning!
     [echo] Signed zip check failed after 15 checks every 180 seconds.
     [echo] Check <https://hudson.eclipse.org/hudson/job/cbi-pdt-3.0-indigo/41/artifact/build/M201012150947/eclipse/signing.txt> for any signs of error which might explain this failure.

signMasterZipHasFailed:
     [echo] Build will proceed w/ unsigned, unprocessed Master zip, pdt-Master-M201012150947.zip
     [copy] Copying 1 file to <https://hudson.eclipse.org/hudson/job/cbi-pdt-3.0-indigo/41/artifact/build/M201012150947/eclipse/M201012150947>

BUILD FAILED
<https://hudson.eclipse.org/hudson/job/cbi-pdt-3.0-indigo/ws/build/org.eclipse.dash.common.releng/buildAll.xml>:378: The following error occurred while executing this line:
<https://hudson.eclipse.org/hudson/job/cbi-pdt-3.0-indigo/ws/build/org.eclipse.dash.common.releng/buildAll.xml>:419: The following error occurred while executing this line:
<https://hudson.eclipse.org/hudson/job/cbi-pdt-3.0-indigo/ws/build/org.eclipse.dash.common.releng/tools/scripts/buildAllHelper.xml>:833: The following error occurred while executing this line:
<https://hudson.eclipse.org/hudson/job/cbi-pdt-3.0-indigo/ws/build/org.eclipse.dash.common.releng/tools/scripts/buildAllHelper.xml>:1252: The following error occurred while executing this line:
<https://hudson.eclipse.org/hudson/job/cbi-pdt-3.0-indigo/ws/build/org.eclipse.dash.common.releng/tools/scripts/buildAllHelper.xml>:684: The following error occurred while executing this line:
<https://hudson.eclipse.org/hudson/job/cbi-pdt-3.0-indigo/ws/build/org.eclipse.dash.common.releng/tools/scripts/buildAllHelper.xml>:702: Directory does not exist:<https://hudson.eclipse.org/hudson/job/cbi-pdt-3.0-indigo/ws/build/signing/M201012150947-out>

Total time: 53 minutes 8 seconds
[start] [10:40:39] start.sh finished.

++ rm -f <https://hudson.eclipse.org/hudson/job/cbi-pdt-3.0-indigo/ws/build/.cvspass>
+++ date '+%Y/%m/%d %H:%M'
++ echo '[2010/12/15 10:40] Hudson job  build #41 (2010-12-15_09-44-55) done.'
[2010/12/15 10:40] Hudson job  build #41 (2010-12-15_09-44-55) done.
Terminating xvnc.
Archiving artifacts
Recording test results
No test report files were found. Configuration error?