[Date Prev][Date Next][Thread Prev][Thread Next][Date Index][Thread Index] [List Home]
[pdt-dev] Build failed in Hudson: cbi-pdt-3.0-indigo #14

See <https://hudson.eclipse.org/hudson/job/cbi-pdt-3.0-indigo/14/changes>

Changes:

[zzhongwei] *** empty log message ***

------------------------------------------
[...truncated 83 lines...]
05/11/2010 11:59:30 RGB format 8 8 8
05/11/2010 11:59:30 Listening for VNC connections on TCP port 5913
Could not init font path element /usr/share/fonts/TTF/, removing from list!
Could not init font path element /usr/share/fonts/OTF, removing from list!
Found vncserver in PATH=
/bin:/usr/bin/:/usr/local/bin
Found Xvfb in PATH=
/bin:/usr/bin/:/usr/local/bin
Found Xvnc in PATH=
/bin:/usr/bin/:/usr/local/bin
WARNING: You may require 1 or more of the following tools for this build to proceed:
  javac
[start] [11:59:31] Started on 20101105 with these options:
   -projectid tools.pdt
   -version 3.0.0
   -buildType N
   -buildTimestamp 201011051159
   -writableBuildRoot <https://hudson.eclipse.org/hudson/job/cbi-pdt-3.0-indigo/ws/build>
   -thirdPartyJarsDir <https://hudson.eclipse.org/hudson/job/cbi-pdt-3.0-indigo/ws/build/3rdPartyJars>
   -downloadsDir <https://hudson.eclipse.org/hudson/job/cbi-pdt-3.0-indigo/ws/build/downloads>
   -buildDir <https://hudson.eclipse.org/hudson/job/cbi-pdt-3.0-indigo/14/artifact/build/N201011051159>
   -projRelengRoot :pserver:anonymous@xxxxxxxxxxxxxxx:/cvsroot/tools
   -projRelengPath org.eclipse.pdt/org.eclipse.pdt.releng
   -forceContextQualifier
   -fetchTag HEAD

[start] Create build directory <https://hudson.eclipse.org/hudson/job/cbi-pdt-3.0-indigo/14/artifact/build/N201011051159>

  cvs -d :pserver:anonymous@xxxxxxxxxxxxxxx:/cvsroot/tools -Q ex -r HEAD -d org.eclipse.pdt.releng org.eclipse.pdt/org.eclipse.pdt.releng
[start] [11:59:31] Export done.

[start] Export skipped: org.eclipse.dash.common.releng already exists.

[start] Export skipped: org.eclipse.releng.basebuilder already exists.

Environment variables:
  HOME      = <https://hudson.eclipse.org/hudson/job/cbi-pdt-3.0-indigo/ws/build>
  JAVA_HOME = /shared/common/jdk-1.5.0-22.x86_64
  ANT_HOME  = /opt/public/common/apache-ant-1.7.1
  ANT       = /opt/public/common/apache-ant-1.7.1/bin/ant

[start] mapVersionTag: HEAD
[start] [11:59:31] Invoke Eclipse build
 
[11:59:31]
  /shared/common/jdk-1.5.0-22.x86_64/bin/java 
  -enableassertions
  -cp <https://hudson.eclipse.org/hudson/job/cbi-pdt-3.0-indigo/ws/build/org.eclipse.releng.basebuilder/plugins/org.eclipse.equinox.launcher.jar> org.eclipse.equinox.launcher.Main
  -application org.eclipse.ant.core.antRunner
  -f <https://hudson.eclipse.org/hudson/job/cbi-pdt-3.0-indigo/ws/build/org.eclipse.dash.common.releng/buildAll.xml> run
  -Dprojectid=tools.pdt
  -DbuildTimestamp=201011051159
  -DbuildType=N
  -Dversion=3.0.0
  -DwritableBuildRoot=<https://hudson.eclipse.org/hudson/job/cbi-pdt-3.0-indigo/ws/build>
  -DdownloadsDir=<https://hudson.eclipse.org/hudson/job/cbi-pdt-3.0-indigo/ws/build/downloads>
  -DthirdPartyJarsDir=<https://hudson.eclipse.org/hudson/job/cbi-pdt-3.0-indigo/ws/build/3rdPartyJars>
  -DbuildDir=<https://hudson.eclipse.org/hudson/job/cbi-pdt-3.0-indigo/14/artifact/build/N201011051159>
  -DrelengBuilderDir=<https://hudson.eclipse.org/hudson/job/cbi-pdt-3.0-indigo/ws/build/org.eclipse.pdt.releng>
  -DrelengCommonBuilderDir=<https://hudson.eclipse.org/hudson/job/cbi-pdt-3.0-indigo/ws/build/org.eclipse.dash.common.releng>
  -DrelengBaseBuilderDir=<https://hudson.eclipse.org/hudson/job/cbi-pdt-3.0-indigo/ws/build/org.eclipse.releng.basebuilder>
  -DJAVA_HOME=/shared/common/jdk-1.5.0-22.x86_64
  -DmapVersionTag=HEAD
  -DforceContextQualifier=v201011051159
  -DfetchTag=HEAD
Buildfile: <https://hudson.eclipse.org/hudson/job/cbi-pdt-3.0-indigo/ws/build/org.eclipse.dash.common.releng/buildAll.xml>

init:

check.ant-contrib:

resolvepaths:

init:

genBuildCfgInit:
Trying to override old definition of task resolvepath

projectid2names:

genBuildCfg:
Trying to override old definition of task resolvepath

createBuildConfigFile:
Trying to override old definition of task resolvepath

initCommandlineArgsList:
Trying to override old definition of task resolvepath

load.properties:
     [echo] Load properties from <https://hudson.eclipse.org/hudson/job/cbi-pdt-3.0-indigo/ws/build/org.eclipse.pdt.releng/build.properties>
     [echo] 
     [echo] Loaded JAVA*_HOME and bootclasspath values:
     [echo]         JAVA_HOME = /shared/common/jdk-1.5.0-22.x86_64
     [echo]       JAVA14_HOME = /shared/common/jdk-1.5.0-22.x86_64, J2SE-1.4 = /shared/common/jdk-1.5.0-22.x86_64/lib/vm.jar:/shared/common/jdk-1.5.0-22.x86_64/jre/lib/vm.jar:/shared/common/jdk-1.5.0-22.x86_64/lib/dt.jar:/shared/common/jdk-1.5.0-22.x86_64/jre/lib/dt.jar:/shared/common/jdk-1.5.0-22.x86_64/lib/rt.jar:/shared/common/jdk-1.5.0-22.x86_64/jre/lib/rt.jar:/shared/common/jdk-1.5.0-22.x86_64/lib/core.jar:/shared/common/jdk-1.5.0-22.x86_64/jre/lib/core.jar:/shared/common/jdk-1.5.0-22.x86_64/lib/xml.jar:/shared/common/jdk-1.5.0-22.x86_64/jre/lib/xml.jar:/shared/common/jdk-1.5.0-22.x86_64/lib/graphics.jar:/shared/common/jdk-1.5.0-22.x86_64/jre/lib/graphics.jar:/shared/common/jdk-1.5.0-22.x86_64/lib/server.jar:/shared/common/jdk-1.5.0-22.x86_64/jre/lib/server.jar:/shared/common/jdk-1.5.0-22.x86_64/lib/ibmorbapi.jar:/shared/common/jdk-1.5.0-22.x86_64/jre/lib/ibmorbapi.jar:/shared/common/jdk-1.5.0-22.x86_64/lib/security.jar:/shared/common/jdk-1.5.0-22.x86_64/jre/lib/security.jar:/shared/common/jdk-1.5.0-22.x86_64/lib/classes.jar:/shared/common/jdk-1.5.0-22.x86_64/jre/lib/classes.jar:/shared/common/jdk-1.5.0-22.x86_64/jre/lib/jce.jar:/shared/common/jdk-1.5.0-22.x86_64/lib/jsse.jar:/shared/common/jdk-1.5.0-22.x86_64/jre/lib/jsse.jar:/shared/common/jdk-1.5.0-22.x86_64/../Classes/dt.jar:/shared/common/jdk-1.5.0-22.x86_64/../Classes/classes.jar:/shared/common/jdk-1.5.0-22.x86_64/../Classes/jsse.jar:/shared/common/jdk-1.5.0-22.x86_64/../Classes/jce.jar
     [echo]       JAVA50_HOME = /shared/common/jdk-1.5.0-22.x86_64, J2SE-1.5 = /shared/common/jdk-1.5.0-22.x86_64/jre/lib/rt.jar:/shared/common/jdk-1.5.0-22.x86_64/jre/lib/vm.jar:/shared/common/jdk-1.5.0-22.x86_64/jre/lib/core.jar:/shared/common/jdk-1.5.0-22.x86_64/jre/lib/xml.jar:/shared/common/jdk-1.5.0-22.x86_64/jre/lib/graphics.jar:/shared/common/jdk-1.5.0-22.x86_64/jre/lib/server.jar:/shared/common/jdk-1.5.0-22.x86_64/jre/lib/ibmorbapi.jar:/shared/common/jdk-1.5.0-22.x86_64/jre/lib/security.jar:/shared/common/jdk-1.5.0-22.x86_64/jre/lib/classes.jar:/shared/common/jdk-1.5.0-22.x86_64/jre/lib/jsse.jar:/shared/common/jdk-1.5.0-22.x86_64/jre/lib/jce.jar:/shared/common/jdk-1.5.0-22.x86_64/jre/lib/ibmjcefw.jar:/shared/common/jdk-1.5.0-22.x86_64/../Classes/dt.jar:/shared/common/jdk-1.5.0-22.x86_64/../Classes/classes.jar:/shared/common/jdk-1.5.0-22.x86_64/../Classes/jsse.jar:/shared/common/jdk-1.5.0-22.x86_64/../Classes/jce.jar
     [echo]       JAVA60_HOME = /shared/common/jdk-1.6.x86_64, JavaSE-1.6 = /shared/common/jdk-1.6.x86_64/jre/lib/rt.jar:/shared/common/jdk-1.6.x86_64/jre/lib/core.jar:/shared/common/jdk-1.6.x86_64/jre/lib/annotation.jar:/shared/common/jdk-1.6.x86_64/jre/lib/beans.jar:/shared/common/jdk-1.6.x86_64/jre/lib/ibmorbapi.jar:/shared/common/jdk-1.6.x86_64/jre/lib/java.util.jar:/shared/common/jdk-1.6.x86_64/jre/lib/jlm.jar:/shared/common/jdk-1.6.x86_64/jre/lib/logging.jar:/shared/common/jdk-1.6.x86_64/jre/lib/resources.jar:/shared/common/jdk-1.6.x86_64/jre/lib/security.jar:/shared/common/jdk-1.6.x86_64/jre/lib/sql.jar:/shared/common/jdk-1.6.x86_64/jre/lib/vm.jar:/shared/common/jdk-1.6.x86_64/jre/lib/xmldsigfw.jar:/shared/common/jdk-1.6.x86_64/jre/lib/xml.jar:/shared/common/jdk-1.6.x86_64/jre/lib/graphics.jar:/shared/common/jdk-1.6.x86_64/jre/lib/server.jar:/shared/common/jdk-1.6.x86_64/jre/lib/jce.jar:/shared/common/jdk-1.6.x86_64/jre/lib/jsse.jar:/shared/common/jdk-1.6.x86_64/jre/lib/ibmjcefw.jar:/shared/common/jdk-1.6.x86_64/lib/dt.jar:/shared/common/jdk-1.6.x86_64/../Classes/dt.jar:/shared/common/jdk-1.6.x86_64/../Classes/classes.jar:/shared/common/jdk-1.6.x86_64/../Classes/jsse.jar:/shared/common/jdk-1.6.x86_64/../Classes/jce.jar
     [echo] Created <https://hudson.eclipse.org/hudson/job/cbi-pdt-3.0-indigo/14/artifact/build/N201011051159/build.cfg>
Trying to override old definition of task resolvepath

collectMapTypes:
     [echo] Found these map entry types: CVS
Trying to override old definition of task resolvepath

collectURLs:

getZip:
      [get] Getting: http://download.eclipse.org/eclipse/downloads/drops/S-3.7M3-201010281441/eclipse-SDK-3.7M3-linux-gtk-x86_64.tar.gz
      [get] To: <https://hudson.eclipse.org/hudson/job/cbi-pdt-3.0-indigo/ws/build/downloads/eclipse-SDK-3.7M3-linux-gtk-x86_64.tar.gz>

getZip:
      [get] Getting: http://download.eclipse.org/technology/dltk/downloads/drops/R2.0/R-2.0-201006161315/dltk-core-Automated_Tests-R-2.0-201006161315.zip
      [get] To: <https://hudson.eclipse.org/hudson/job/cbi-pdt-3.0-indigo/ws/build/downloads/dltk-core-Automated_Tests-R-2.0-201006161315.zip>

getZip:
      [get] Getting: http://download.eclipse.org/eclipse/downloads/drops/R-3.6-201006080911/eclipse-test-framework-3.6.zip
      [get] To: <https://hudson.eclipse.org/hudson/job/cbi-pdt-3.0-indigo/ws/build/downloads/eclipse-test-framework-3.6.zip>
     [echo] Found 3 dependency URLs
     [echo] Load properties from <https://hudson.eclipse.org/hudson/job/cbi-pdt-3.0-indigo/14/artifact/build/N201011051159/build.cfg>
     [echo] Got incubation = 

create.label.properties:
     [echo] subprojectName = pdt
     [echo] Base OS: linux; Base Window System: gtk

collectMaps:

run:

get.pde.build.svn:

get.ant4eclipse:

get.SWTBot.junit4:
     [echo] buildAll.xml#run :: build.step :: buildUpdate

buildUpdate:

buildMasterZip:

-timestamp:
     [echo] 11:59:40

main-init:

main:

main:

preBuild:

preSetup:
    [mkdir] Created dir: <https://hudson.eclipse.org/hudson/job/cbi-pdt-3.0-indigo/14/artifact/build/N201011051159/eclipse/N201011051159>

getMapFiles:
     [copy] Copying 1 file to <https://hudson.eclipse.org/hudson/job/cbi-pdt-3.0-indigo/14/artifact/build/N201011051159/eclipse>

init:

postSetup:

provision.eclipse.build.base:

provision.eclipse.base:
     [echo] Provision Eclipse base from eclipse-SDK-3.7M3-linux-gtk-x86_64.tar.gz into <https://hudson.eclipse.org/hudson/job/cbi-pdt-3.0-indigo/14/artifact/build/N201011051159...>

init:

getDep:

getBundle:

downloadFile:

unpackBundle:

unzipFile:

untarFile:
    [untar] Expanding: <https://hudson.eclipse.org/hudson/job/cbi-pdt-3.0-indigo/ws/build/downloads/eclipse-SDK-3.7M3-linux-gtk-x86_64.tar.gz> into <https://hudson.eclipse.org/hudson/job/cbi-pdt-3.0-indigo/14/artifact/build/N201011051159>
     [echo] Install org.eclipse.wst.web_ui.feature+org.eclipse.dltk.core+org.eclipse.dltk.mylyn+org.eclipse.wst.xsl.feature+org.eclipse.dltk.core.index+org.eclipse.wst.common.fproj to <https://hudson.eclipse.org/hudson/job/cbi-pdt-3.0-indigo/14/artifact/build/N201011051159/eclipse>

run.director:

-timestamp:
     [echo] 11:59:51
    [mkdir] Created dir: <https://hudson.eclipse.org/hudson/job/cbi-pdt-3.0-indigo/14/artifact/build/N201011051159/eclipse/p2repoZipsTmp>

init:

getDep:

getBundle:

downloadFile:
      [for] org.eclipse.wst.web_ui.feature+org.eclipse.dltk.core+org.eclipse.dltk.mylyn+org.eclipse.wst.xsl.feature+org.eclipse.dltk.core.index+org.eclipse.wst.common.fproj: The following error occurred while executing this line:
      [for] <https://hudson.eclipse.org/hudson/job/cbi-pdt-3.0-indigo/ws/build/org.eclipse.dash.common.releng/builder/all/customTargets.xml>:257: The following error occurred while executing this line:
      [for] <https://hudson.eclipse.org/hudson/job/cbi-pdt-3.0-indigo/ws/build/org.eclipse.dash.common.releng/tools/scripts/buildAllHelper.xml>:1377: The following error occurred while executing this line:
      [for] <https://hudson.eclipse.org/hudson/job/cbi-pdt-3.0-indigo/ws/build/org.eclipse.dash.common.releng/tools/scripts/buildAllHelper.xml>:1398: The following error occurred while executing this line:
      [for] <https://hudson.eclipse.org/hudson/job/cbi-pdt-3.0-indigo/ws/build/org.eclipse.dash.common.releng/tools/scripts/getDependencies.xml>:41: The following error occurred while executing this line:
      [for] <https://hudson.eclipse.org/hudson/job/cbi-pdt-3.0-indigo/ws/build/org.eclipse.dash.common.releng/tools/scripts/getDependenciesHelper.xml>:13: The following error occurred while executing this line:
      [for] <https://hudson.eclipse.org/hudson/job/cbi-pdt-3.0-indigo/ws/build/org.eclipse.dash.common.releng/tools/scripts/getDependenciesHelper.xml>:78: java.net.MalformedURLException: no !/ in spec
      [for] featureIDsToInstall: The following error occurred while executing this line:
      [for] <https://hudson.eclipse.org/hudson/job/cbi-pdt-3.0-indigo/ws/build/org.eclipse.dash.common.releng/builder/all/customTargets.xml>:230: Keepgoing execution: 1 of 1 iterations failed.
     [echo] Install org.apache.commons.lang+org.h2 to <https://hudson.eclipse.org/hudson/job/cbi-pdt-3.0-indigo/14/artifact/build/N201011051159/eclipse>

run.director:

-timestamp:
     [echo] 11:59:51

init:

getDep:

getBundle:

downloadFile:
      [for] org.apache.commons.lang+org.h2: The following error occurred while executing this line:
      [for] <https://hudson.eclipse.org/hudson/job/cbi-pdt-3.0-indigo/ws/build/org.eclipse.dash.common.releng/builder/all/customTargets.xml>:257: The following error occurred while executing this line:
      [for] <https://hudson.eclipse.org/hudson/job/cbi-pdt-3.0-indigo/ws/build/org.eclipse.dash.common.releng/tools/scripts/buildAllHelper.xml>:1377: The following error occurred while executing this line:
      [for] <https://hudson.eclipse.org/hudson/job/cbi-pdt-3.0-indigo/ws/build/org.eclipse.dash.common.releng/tools/scripts/buildAllHelper.xml>:1398: The following error occurred while executing this line:
      [for] <https://hudson.eclipse.org/hudson/job/cbi-pdt-3.0-indigo/ws/build/org.eclipse.dash.common.releng/tools/scripts/getDependencies.xml>:41: The following error occurred while executing this line:
      [for] <https://hudson.eclipse.org/hudson/job/cbi-pdt-3.0-indigo/ws/build/org.eclipse.dash.common.releng/tools/scripts/getDependenciesHelper.xml>:13: The following error occurred while executing this line:
      [for] <https://hudson.eclipse.org/hudson/job/cbi-pdt-3.0-indigo/ws/build/org.eclipse.dash.common.releng/tools/scripts/getDependenciesHelper.xml>:78: java.net.MalformedURLException: no !/ in spec
      [for] pluginIDsToInstall: The following error occurred while executing this line:
      [for] <https://hudson.eclipse.org/hudson/job/cbi-pdt-3.0-indigo/ws/build/org.eclipse.dash.common.releng/builder/all/customTargets.xml>:230: Keepgoing execution: 1 of 1 iterations failed.

BUILD FAILED
<https://hudson.eclipse.org/hudson/job/cbi-pdt-3.0-indigo/ws/build/org.eclipse.dash.common.releng/buildAll.xml>:378: The following error occurred while executing this line:
<https://hudson.eclipse.org/hudson/job/cbi-pdt-3.0-indigo/ws/build/org.eclipse.dash.common.releng/buildAll.xml>:419: The following error occurred while executing this line:
<https://hudson.eclipse.org/hudson/job/cbi-pdt-3.0-indigo/ws/build/org.eclipse.dash.common.releng/tools/scripts/buildAllHelper.xml>:833: The following error occurred while executing this line:
<https://hudson.eclipse.org/hudson/job/cbi-pdt-3.0-indigo/ws/build/org.eclipse.dash.common.releng/tools/scripts/buildAllHelper.xml>:1242: The following error occurred while executing this line:
<https://hudson.eclipse.org/hudson/job/cbi-pdt-3.0-indigo/ws/build/org.eclipse.dash.common.releng/build.xml>:199: The following error occurred while executing this line:
/opt/public/cbi/build/org.eclipse.releng.basebuilder_r35x_v20090811/plugins/org.eclipse.pde.build_3.5.0.v20090527-1800/scripts/build.xml:32: The following error occurred while executing this line:
/opt/public/cbi/build/org.eclipse.releng.basebuilder_r35x_v20090811/plugins/org.eclipse.pde.build_3.5.0.v20090527-1800/scripts/build.xml:53: The following error occurred while executing this line:
<https://hudson.eclipse.org/hudson/job/cbi-pdt-3.0-indigo/ws/build/org.eclipse.dash.common.releng/builder/all/customTargets.xml>:208: Keepgoing execution: 2 of 3 iterations failed.

Total time: 18 seconds
[start] [11:59:52] start.sh finished.

++ rm -f <https://hudson.eclipse.org/hudson/job/cbi-pdt-3.0-indigo/ws/build/.cvspass>
+++ date '+%Y/%m/%d %H:%M'
++ echo '[2010/11/05 11:59] Hudson job  build #14 (2010-11-05_11-58-36) done.'
[2010/11/05 11:59] Hudson job  build #14 (2010-11-05_11-58-36) done.
Terminating xvnc.
Archiving artifacts
Recording test results
No test report files were found. Configuration error?