[Date Prev][Date Next][Thread Prev][Thread Next][Date Index][Thread Index] [List Home]
[pdt-dev] Build failed in Hudson: cbi-pdt-2.2-helios #525

See <https://hudson.eclipse.org/hudson/job/cbi-pdt-2.2-helios/525/changes>

Changes:

[rganor] update tags for milestone

------------------------------------------
[...truncated 54072 lines...]

all.children:

init:

gather.logs:

init:

all.features:

all.plugins:

properties:

init:

gather.logs:
    [mkdir] Created dir: <https://hudson.eclipse.org/hudson/job/cbi-pdt-2.2-helios/525/artifact/build/M201010020444/eclipse/features/org.eclipse.php.all/feature.temp.folder/plugins/org.eclipse.php.mylyn.ui_1.0.0.v20100410-0300>
     [copy] Copying 1 file to <https://hudson.eclipse.org/hudson/job/cbi-pdt-2.2-helios/525/artifact/build/M201010020444/eclipse/features/org.eclipse.php.all/feature.temp.folder/plugins/org.eclipse.php.mylyn.ui_1.0.0.v20100410-0300>

update.feature:

all.children:

all.plugins:

update.feature:

all.children:
      [zip] Building zip: <https://hudson.eclipse.org/hudson/job/cbi-pdt-2.2-helios/525/artifact/build/M201010020444/eclipse/features/org.eclipse.php.all/org.eclipse.php.all_2.2.1.v20101001-2300-5307A53J1WES8NJVkObW_QMdYo7O.log.zip>
   [delete] Deleting directory <https://hudson.eclipse.org/hudson/job/cbi-pdt-2.2-helios/525/artifact/build/M201010020444/eclipse/features/org.eclipse.php.all/feature.temp.folder>
    [unzip] Expanding: <https://hudson.eclipse.org/hudson/job/cbi-pdt-2.2-helios/525/artifact/build/M201010020444/eclipse/features/org.eclipse.php.all/org.eclipse.php.all_2.2.1.v20101001-2300-5307A53J1WES8NJVkObW_QMdYo7O.log.zip> into <https://hudson.eclipse.org/hudson/job/cbi-pdt-2.2-helios/525/artifact/build/M201010020444/eclipse/M201010020444/compilelogs>

buildExtra.xml:

-timestamp:
     [echo] 04:48:15
     [echo] Signing control properties:
     [echo] 	sign = true
     [echo] 	skipSign = ${skipSign}
     [echo] 	domainNamespace = org.eclipse

signMasterZip:

-timestamp:
     [echo] 04:48:15

-timestamp:
     [echo] 04:48:15
    [mkdir] Created dir: <https://hudson.eclipse.org/hudson/job/cbi-pdt-2.2-helios/525/artifact/build/M201010020444/eclipse/packtmp>
     [move] Moving 1 file to <https://hudson.eclipse.org/hudson/job/cbi-pdt-2.2-helios/525/artifact/build/M201010020444/eclipse/packtmp>
      [zip] Updating zip: <https://hudson.eclipse.org/hudson/job/cbi-pdt-2.2-helios/525/artifact/build/M201010020444/eclipse/packtmp/pdt-Master-M201010020444.zip>
     [echo] Signing pdt-Master-M201010020444.zip in <https://hudson.eclipse.org/hudson/job/cbi-pdt-2.2-helios/ws/build/signing> on localhost ...

-timestamp:
     [echo] 04:48:17
     [echo] Push pdt-Master-M201010020444.zip to staging directory
     [copy] Copying 1 file to <https://hudson.eclipse.org/hudson/job/cbi-pdt-2.2-helios/ws/build/signing>

-timestamp:
     [echo] 04:48:18
     [echo] Invoke sign script and wait 15 x 180 seconds
     [echo] Sleep for 180 seconds...

-timestamp:
     [echo] 04:51:18
Trying to override old definition of task resolvepath

checkForSignedZip:
     [exec] Result: 2
     [echo] /bin/ls: cannot access <https://hudson.eclipse.org/hudson/job/cbi-pdt-2.2-helios/ws/build/signing/M201010020444-out/pdt-Master-M201010020444.zip>: No such file or directory
    [retry] Attempt [0]: error occurred; retrying...
     [echo] Sleep for 180 seconds...

-timestamp:
     [echo] 04:54:18
Trying to override old definition of task resolvepath

checkForSignedZip:
     [exec] Result: 2
     [echo] /bin/ls: cannot access <https://hudson.eclipse.org/hudson/job/cbi-pdt-2.2-helios/ws/build/signing/M201010020444-out/pdt-Master-M201010020444.zip>: No such file or directory
    [retry] Attempt [1]: error occurred; retrying...
     [echo] Sleep for 180 seconds...

-timestamp:
     [echo] 04:57:18
Trying to override old definition of task resolvepath

checkForSignedZip:
     [exec] Result: 2
     [echo] /bin/ls: cannot access <https://hudson.eclipse.org/hudson/job/cbi-pdt-2.2-helios/ws/build/signing/M201010020444-out/pdt-Master-M201010020444.zip>: No such file or directory
    [retry] Attempt [2]: error occurred; retrying...
     [echo] Sleep for 180 seconds...

-timestamp:
     [echo] 05:00:18
Trying to override old definition of task resolvepath

checkForSignedZip:
     [exec] Result: 2
     [echo] /bin/ls: cannot access <https://hudson.eclipse.org/hudson/job/cbi-pdt-2.2-helios/ws/build/signing/M201010020444-out/pdt-Master-M201010020444.zip>: No such file or directory
    [retry] Attempt [3]: error occurred; retrying...
     [echo] Sleep for 180 seconds...

-timestamp:
     [echo] 05:03:18
Trying to override old definition of task resolvepath

checkForSignedZip:
     [exec] Result: 2
     [echo] /bin/ls: cannot access <https://hudson.eclipse.org/hudson/job/cbi-pdt-2.2-helios/ws/build/signing/M201010020444-out/pdt-Master-M201010020444.zip>: No such file or directory
    [retry] Attempt [4]: error occurred; retrying...
     [echo] Sleep for 180 seconds...

-timestamp:
     [echo] 05:06:18
Trying to override old definition of task resolvepath

checkForSignedZip:
     [exec] Result: 2
     [echo] /bin/ls: cannot access <https://hudson.eclipse.org/hudson/job/cbi-pdt-2.2-helios/ws/build/signing/M201010020444-out/pdt-Master-M201010020444.zip>: No such file or directory
    [retry] Attempt [5]: error occurred; retrying...
     [echo] Sleep for 180 seconds...

-timestamp:
     [echo] 05:09:18
Trying to override old definition of task resolvepath

checkForSignedZip:
     [exec] Result: 2
     [echo] /bin/ls: cannot access <https://hudson.eclipse.org/hudson/job/cbi-pdt-2.2-helios/ws/build/signing/M201010020444-out/pdt-Master-M201010020444.zip>: No such file or directory
    [retry] Attempt [6]: error occurred; retrying...
     [echo] Sleep for 180 seconds...

-timestamp:
     [echo] 05:12:19
Trying to override old definition of task resolvepath

checkForSignedZip:
     [exec] Result: 2
     [echo] /bin/ls: cannot access <https://hudson.eclipse.org/hudson/job/cbi-pdt-2.2-helios/ws/build/signing/M201010020444-out/pdt-Master-M201010020444.zip>: No such file or directory
    [retry] Attempt [7]: error occurred; retrying...
     [echo] Sleep for 180 seconds...

-timestamp:
     [echo] 05:15:19
Trying to override old definition of task resolvepath

checkForSignedZip:
     [exec] Result: 2
     [echo] /bin/ls: cannot access <https://hudson.eclipse.org/hudson/job/cbi-pdt-2.2-helios/ws/build/signing/M201010020444-out/pdt-Master-M201010020444.zip>: No such file or directory
    [retry] Attempt [8]: error occurred; retrying...
     [echo] Sleep for 180 seconds...

-timestamp:
     [echo] 05:18:19
Trying to override old definition of task resolvepath

checkForSignedZip:
     [exec] Result: 2
     [echo] /bin/ls: cannot access <https://hudson.eclipse.org/hudson/job/cbi-pdt-2.2-helios/ws/build/signing/M201010020444-out/pdt-Master-M201010020444.zip>: No such file or directory
    [retry] Attempt [9]: error occurred; retrying...
     [echo] Sleep for 180 seconds...

-timestamp:
     [echo] 05:21:19
Trying to override old definition of task resolvepath

checkForSignedZip:
     [exec] Result: 2
     [echo] /bin/ls: cannot access <https://hudson.eclipse.org/hudson/job/cbi-pdt-2.2-helios/ws/build/signing/M201010020444-out/pdt-Master-M201010020444.zip>: No such file or directory
    [retry] Attempt [10]: error occurred; retrying...
     [echo] Sleep for 180 seconds...

-timestamp:
     [echo] 05:24:19
Trying to override old definition of task resolvepath

checkForSignedZip:
     [exec] Result: 2
     [echo] /bin/ls: cannot access <https://hudson.eclipse.org/hudson/job/cbi-pdt-2.2-helios/ws/build/signing/M201010020444-out/pdt-Master-M201010020444.zip>: No such file or directory
    [retry] Attempt [11]: error occurred; retrying...
     [echo] Sleep for 180 seconds...

-timestamp:
     [echo] 05:27:19
Trying to override old definition of task resolvepath

checkForSignedZip:
     [exec] Result: 2
     [echo] /bin/ls: cannot access <https://hudson.eclipse.org/hudson/job/cbi-pdt-2.2-helios/ws/build/signing/M201010020444-out/pdt-Master-M201010020444.zip>: No such file or directory
    [retry] Attempt [12]: error occurred; retrying...
     [echo] Sleep for 180 seconds...

-timestamp:
     [echo] 05:30:19
Trying to override old definition of task resolvepath

checkForSignedZip:
     [exec] Result: 2
     [echo] /bin/ls: cannot access <https://hudson.eclipse.org/hudson/job/cbi-pdt-2.2-helios/ws/build/signing/M201010020444-out/pdt-Master-M201010020444.zip>: No such file or directory
    [retry] Attempt [13]: error occurred; retrying...
     [echo] Sleep for 180 seconds...

-timestamp:
     [echo] 05:33:19
Trying to override old definition of task resolvepath

checkForSignedZip:
     [exec] Result: 2
     [echo] /bin/ls: cannot access <https://hudson.eclipse.org/hudson/job/cbi-pdt-2.2-helios/ws/build/signing/M201010020444-out/pdt-Master-M201010020444.zip>: No such file or directory
    [retry] Attempt [14]: error occurred; retrying...
     [echo] Sleep for 180 seconds...

-timestamp:
     [echo] 05:36:20
Trying to override old definition of task resolvepath

checkForSignedZip:
     [exec] Result: 2
     [echo] /bin/ls: cannot access <https://hudson.eclipse.org/hudson/job/cbi-pdt-2.2-helios/ws/build/signing/M201010020444-out/pdt-Master-M201010020444.zip>: No such file or directory
     [echo] Warning!
     [echo] Signed zip check failed after 15 checks every 180 seconds.
     [echo] Check <https://hudson.eclipse.org/hudson/job/cbi-pdt-2.2-helios/525/artifact/build/M201010020444/eclipse/signing.txt> for any signs of error which might explain this failure.

signMasterZipHasFailed:
     [echo] Build will proceed w/ unsigned, unprocessed Master zip, pdt-Master-M201010020444.zip
     [copy] Copying 1 file to <https://hudson.eclipse.org/hudson/job/cbi-pdt-2.2-helios/525/artifact/build/M201010020444/eclipse/M201010020444>

BUILD FAILED
<https://hudson.eclipse.org/hudson/job/cbi-pdt-2.2-helios/ws/build/org.eclipse.dash.common.releng/buildAll.xml>:378: The following error occurred while executing this line:
<https://hudson.eclipse.org/hudson/job/cbi-pdt-2.2-helios/ws/build/org.eclipse.dash.common.releng/buildAll.xml>:419: The following error occurred while executing this line:
<https://hudson.eclipse.org/hudson/job/cbi-pdt-2.2-helios/ws/build/org.eclipse.dash.common.releng/tools/scripts/buildAllHelper.xml>:833: The following error occurred while executing this line:
<https://hudson.eclipse.org/hudson/job/cbi-pdt-2.2-helios/ws/build/org.eclipse.dash.common.releng/tools/scripts/buildAllHelper.xml>:1252: The following error occurred while executing this line:
<https://hudson.eclipse.org/hudson/job/cbi-pdt-2.2-helios/ws/build/org.eclipse.dash.common.releng/tools/scripts/buildAllHelper.xml>:684: The following error occurred while executing this line:
<https://hudson.eclipse.org/hudson/job/cbi-pdt-2.2-helios/ws/build/org.eclipse.dash.common.releng/tools/scripts/buildAllHelper.xml>:702: Directory does not exist:<https://hudson.eclipse.org/hudson/job/cbi-pdt-2.2-helios/ws/build/signing/M201010020444-out>

Total time: 51 minutes 40 seconds
[start] [05:36:21] start.sh finished.

++ rm -f <https://hudson.eclipse.org/hudson/job/cbi-pdt-2.2-helios/ws/build/.cvspass>
+++ date '+%Y/%m/%d %H:%M'
++ echo '[2010/10/02 05:36] Hudson job  build #525 (2010-10-02_04-43-14) done.'
[2010/10/02 05:36] Hudson job  build #525 (2010-10-02_04-43-14) done.
Terminating xvnc.
Archiving artifacts
Recording test results
No test report files were found. Configuration error?