[Date Prev][Date Next][Thread Prev][Thread Next][Date Index][Thread Index] [List Home]
[pdt-dev] Build failed in Hudson: cbi-pdt-2.2-helios #521

See <https://hudson.eclipse.org/hudson/job/cbi-pdt-2.2-helios/521/>

------------------------------------------
[...truncated 54073 lines...]

all.children:

init:

gather.logs:

init:

all.features:

all.plugins:

properties:

init:

gather.logs:
    [mkdir] Created dir: <https://hudson.eclipse.org/hudson/job/cbi-pdt-2.2-helios/521/artifact/build/M201010011750/eclipse/features/org.eclipse.php.all/feature.temp.folder/plugins/org.eclipse.php.mylyn.ui_1.0.0.R2_2_WAVE_7_3>
     [copy] Copying 1 file to <https://hudson.eclipse.org/hudson/job/cbi-pdt-2.2-helios/521/artifact/build/M201010011750/eclipse/features/org.eclipse.php.all/feature.temp.folder/plugins/org.eclipse.php.mylyn.ui_1.0.0.R2_2_WAVE_7_3>

update.feature:

all.children:

all.plugins:

update.feature:

all.children:
      [zip] Building zip: <https://hudson.eclipse.org/hudson/job/cbi-pdt-2.2-helios/521/artifact/build/M201010011750/eclipse/features/org.eclipse.php.all/org.eclipse.php.all_2.2.1.R2_2_WAVE_7_3-5307A53I3XLVGHymPwGU79jFeCrD.log.zip>
   [delete] Deleting directory <https://hudson.eclipse.org/hudson/job/cbi-pdt-2.2-helios/521/artifact/build/M201010011750/eclipse/features/org.eclipse.php.all/feature.temp.folder>
    [unzip] Expanding: <https://hudson.eclipse.org/hudson/job/cbi-pdt-2.2-helios/521/artifact/build/M201010011750/eclipse/features/org.eclipse.php.all/org.eclipse.php.all_2.2.1.R2_2_WAVE_7_3-5307A53I3XLVGHymPwGU79jFeCrD.log.zip> into <https://hudson.eclipse.org/hudson/job/cbi-pdt-2.2-helios/521/artifact/build/M201010011750/eclipse/M201010011750/compilelogs>

buildExtra.xml:

-timestamp:
     [echo] 05:54:33
     [echo] Signing control properties:
     [echo] 	sign = true
     [echo] 	skipSign = ${skipSign}
     [echo] 	domainNamespace = org.eclipse

signMasterZip:

-timestamp:
     [echo] 05:54:33

-timestamp:
     [echo] 05:54:33
    [mkdir] Created dir: <https://hudson.eclipse.org/hudson/job/cbi-pdt-2.2-helios/521/artifact/build/M201010011750/eclipse/packtmp>
     [move] Moving 1 file to <https://hudson.eclipse.org/hudson/job/cbi-pdt-2.2-helios/521/artifact/build/M201010011750/eclipse/packtmp>
      [zip] Updating zip: <https://hudson.eclipse.org/hudson/job/cbi-pdt-2.2-helios/521/artifact/build/M201010011750/eclipse/packtmp/pdt-Master-M201010011750.zip>
     [echo] Signing pdt-Master-M201010011750.zip in <https://hudson.eclipse.org/hudson/job/cbi-pdt-2.2-helios/ws/build/signing> on localhost ...

-timestamp:
     [echo] 05:54:35
     [echo] Push pdt-Master-M201010011750.zip to staging directory
     [copy] Copying 1 file to <https://hudson.eclipse.org/hudson/job/cbi-pdt-2.2-helios/ws/build/signing>

-timestamp:
     [echo] 05:54:35
     [echo] Invoke sign script and wait 15 x 180 seconds
     [echo] Sleep for 180 seconds...

-timestamp:
     [echo] 05:57:36
Trying to override old definition of task resolvepath

checkForSignedZip:
     [exec] Result: 2
     [echo] /bin/ls: cannot access <https://hudson.eclipse.org/hudson/job/cbi-pdt-2.2-helios/ws/build/signing/M201010011750-out/pdt-Master-M201010011750.zip>: No such file or directory
    [retry] Attempt [0]: error occurred; retrying...
     [echo] Sleep for 180 seconds...

-timestamp:
     [echo] 06:00:36
Trying to override old definition of task resolvepath

checkForSignedZip:
     [exec] Result: 2
     [echo] /bin/ls: cannot access <https://hudson.eclipse.org/hudson/job/cbi-pdt-2.2-helios/ws/build/signing/M201010011750-out/pdt-Master-M201010011750.zip>: No such file or directory
    [retry] Attempt [1]: error occurred; retrying...
     [echo] Sleep for 180 seconds...

-timestamp:
     [echo] 06:03:36
Trying to override old definition of task resolvepath

checkForSignedZip:
     [exec] Result: 2
     [echo] /bin/ls: cannot access <https://hudson.eclipse.org/hudson/job/cbi-pdt-2.2-helios/ws/build/signing/M201010011750-out/pdt-Master-M201010011750.zip>: No such file or directory
    [retry] Attempt [2]: error occurred; retrying...
     [echo] Sleep for 180 seconds...

-timestamp:
     [echo] 06:06:36
Trying to override old definition of task resolvepath

checkForSignedZip:
     [exec] Result: 2
     [echo] /bin/ls: cannot access <https://hudson.eclipse.org/hudson/job/cbi-pdt-2.2-helios/ws/build/signing/M201010011750-out/pdt-Master-M201010011750.zip>: No such file or directory
    [retry] Attempt [3]: error occurred; retrying...
     [echo] Sleep for 180 seconds...

-timestamp:
     [echo] 06:09:36
Trying to override old definition of task resolvepath

checkForSignedZip:
     [exec] Result: 2
     [echo] /bin/ls: cannot access <https://hudson.eclipse.org/hudson/job/cbi-pdt-2.2-helios/ws/build/signing/M201010011750-out/pdt-Master-M201010011750.zip>: No such file or directory
    [retry] Attempt [4]: error occurred; retrying...
     [echo] Sleep for 180 seconds...

-timestamp:
     [echo] 06:12:36
Trying to override old definition of task resolvepath

checkForSignedZip:
     [exec] Result: 2
     [echo] /bin/ls: cannot access <https://hudson.eclipse.org/hudson/job/cbi-pdt-2.2-helios/ws/build/signing/M201010011750-out/pdt-Master-M201010011750.zip>: No such file or directory
    [retry] Attempt [5]: error occurred; retrying...
     [echo] Sleep for 180 seconds...

-timestamp:
     [echo] 06:15:36
Trying to override old definition of task resolvepath

checkForSignedZip:
     [exec] Result: 2
     [echo] /bin/ls: cannot access <https://hudson.eclipse.org/hudson/job/cbi-pdt-2.2-helios/ws/build/signing/M201010011750-out/pdt-Master-M201010011750.zip>: No such file or directory
    [retry] Attempt [6]: error occurred; retrying...
     [echo] Sleep for 180 seconds...

-timestamp:
     [echo] 06:18:36
Trying to override old definition of task resolvepath

checkForSignedZip:
     [exec] Result: 2
     [echo] /bin/ls: cannot access <https://hudson.eclipse.org/hudson/job/cbi-pdt-2.2-helios/ws/build/signing/M201010011750-out/pdt-Master-M201010011750.zip>: No such file or directory
    [retry] Attempt [7]: error occurred; retrying...
     [echo] Sleep for 180 seconds...

-timestamp:
     [echo] 06:21:37
Trying to override old definition of task resolvepath

checkForSignedZip:
     [exec] Result: 2
     [echo] /bin/ls: cannot access <https://hudson.eclipse.org/hudson/job/cbi-pdt-2.2-helios/ws/build/signing/M201010011750-out/pdt-Master-M201010011750.zip>: No such file or directory
    [retry] Attempt [8]: error occurred; retrying...
     [echo] Sleep for 180 seconds...

-timestamp:
     [echo] 06:24:37
Trying to override old definition of task resolvepath

checkForSignedZip:
     [exec] Result: 2
     [echo] /bin/ls: cannot access <https://hudson.eclipse.org/hudson/job/cbi-pdt-2.2-helios/ws/build/signing/M201010011750-out/pdt-Master-M201010011750.zip>: No such file or directory
    [retry] Attempt [9]: error occurred; retrying...
     [echo] Sleep for 180 seconds...

-timestamp:
     [echo] 06:27:37
Trying to override old definition of task resolvepath

checkForSignedZip:
     [exec] Result: 2
     [echo] /bin/ls: cannot access <https://hudson.eclipse.org/hudson/job/cbi-pdt-2.2-helios/ws/build/signing/M201010011750-out/pdt-Master-M201010011750.zip>: No such file or directory
    [retry] Attempt [10]: error occurred; retrying...
     [echo] Sleep for 180 seconds...

-timestamp:
     [echo] 06:30:37
Trying to override old definition of task resolvepath

checkForSignedZip:
     [exec] Result: 2
     [echo] /bin/ls: cannot access <https://hudson.eclipse.org/hudson/job/cbi-pdt-2.2-helios/ws/build/signing/M201010011750-out/pdt-Master-M201010011750.zip>: No such file or directory
    [retry] Attempt [11]: error occurred; retrying...
     [echo] Sleep for 180 seconds...

-timestamp:
     [echo] 06:33:37
Trying to override old definition of task resolvepath

checkForSignedZip:
     [exec] Result: 2
     [echo] /bin/ls: cannot access <https://hudson.eclipse.org/hudson/job/cbi-pdt-2.2-helios/ws/build/signing/M201010011750-out/pdt-Master-M201010011750.zip>: No such file or directory
    [retry] Attempt [12]: error occurred; retrying...
     [echo] Sleep for 180 seconds...

-timestamp:
     [echo] 06:36:37
Trying to override old definition of task resolvepath

checkForSignedZip:
     [exec] Result: 2
     [echo] /bin/ls: cannot access <https://hudson.eclipse.org/hudson/job/cbi-pdt-2.2-helios/ws/build/signing/M201010011750-out/pdt-Master-M201010011750.zip>: No such file or directory
    [retry] Attempt [13]: error occurred; retrying...
     [echo] Sleep for 180 seconds...

-timestamp:
     [echo] 06:39:37
Trying to override old definition of task resolvepath

checkForSignedZip:
     [exec] Result: 2
     [echo] /bin/ls: cannot access <https://hudson.eclipse.org/hudson/job/cbi-pdt-2.2-helios/ws/build/signing/M201010011750-out/pdt-Master-M201010011750.zip>: No such file or directory
    [retry] Attempt [14]: error occurred; retrying...
     [echo] Sleep for 180 seconds...

-timestamp:
     [echo] 06:42:37
Trying to override old definition of task resolvepath

checkForSignedZip:
     [exec] Result: 2
     [echo] /bin/ls: cannot access <https://hudson.eclipse.org/hudson/job/cbi-pdt-2.2-helios/ws/build/signing/M201010011750-out/pdt-Master-M201010011750.zip>: No such file or directory
     [echo] Warning!
     [echo] Signed zip check failed after 15 checks every 180 seconds.
     [echo] Check <https://hudson.eclipse.org/hudson/job/cbi-pdt-2.2-helios/521/artifact/build/M201010011750/eclipse/signing.txt> for any signs of error which might explain this failure.

signMasterZipHasFailed:
     [echo] Build will proceed w/ unsigned, unprocessed Master zip, pdt-Master-M201010011750.zip
     [copy] Copying 1 file to <https://hudson.eclipse.org/hudson/job/cbi-pdt-2.2-helios/521/artifact/build/M201010011750/eclipse/M201010011750>

BUILD FAILED
<https://hudson.eclipse.org/hudson/job/cbi-pdt-2.2-helios/ws/build/org.eclipse.dash.common.releng/buildAll.xml>:378: The following error occurred while executing this line:
<https://hudson.eclipse.org/hudson/job/cbi-pdt-2.2-helios/ws/build/org.eclipse.dash.common.releng/buildAll.xml>:419: The following error occurred while executing this line:
<https://hudson.eclipse.org/hudson/job/cbi-pdt-2.2-helios/ws/build/org.eclipse.dash.common.releng/tools/scripts/buildAllHelper.xml>:833: The following error occurred while executing this line:
<https://hudson.eclipse.org/hudson/job/cbi-pdt-2.2-helios/ws/build/org.eclipse.dash.common.releng/tools/scripts/buildAllHelper.xml>:1252: The following error occurred while executing this line:
<https://hudson.eclipse.org/hudson/job/cbi-pdt-2.2-helios/ws/build/org.eclipse.dash.common.releng/tools/scripts/buildAllHelper.xml>:684: The following error occurred while executing this line:
<https://hudson.eclipse.org/hudson/job/cbi-pdt-2.2-helios/ws/build/org.eclipse.dash.common.releng/tools/scripts/buildAllHelper.xml>:702: Directory does not exist:<https://hudson.eclipse.org/hudson/job/cbi-pdt-2.2-helios/ws/build/signing/M201010011750-out>

Total time: 51 minutes 35 seconds
[start] [18:42:40] start.sh finished.

++ rm -f <https://hudson.eclipse.org/hudson/job/cbi-pdt-2.2-helios/ws/build/.cvspass>
+++ date '+%Y/%m/%d %H:%M'
++ echo '[2010/10/01 18:42] Hudson job  build #521 (2010-10-01_17-49-58) done.'
[2010/10/01 18:42] Hudson job  build #521 (2010-10-01_17-49-58) done.
Terminating xvnc.
Archiving artifacts
Recording test results
No test report files were found. Configuration error?