[Date Prev][Date Next][Thread Prev][Thread Next][Date Index][Thread Index] [List Home]
[pdt-dev] Build failed in Hudson: cbi-pdt-2.2-helios #460

See <https://hudson.eclipse.org/hudson/job/cbi-pdt-2.2-helios/460/changes>

Changes:

[jpospycha] updates to follow hudson.eclipse.org architecture change

------------------------------------------
Started by user jpospycha
Building on master
[org.eclipse.pdt] $ cvs -q -z3 update -PdC -D "Tuesday, September 21, 2010 10:55:49 AM UTC"
P org.eclipse.pdt.releng/build.properties
$ computing changelog
Deleting old artifacts from #458
Starting xvnc
[workspace] $ Xvnc :10 -geometry 1024x768 -depth 24 -ac
[workspace] $ /bin/sh -xe /tmp/hudson4756862581650242205.sh
21/09/2010 06:56:58 Xvnc version X.org/xf4vnc custom version
21/09/2010 06:56:58 Copyright (C) 2001-2004 Alan Hourihane.
21/09/2010 06:56:58 Copyright (C) 2000-2004 Constantin Kaplinsky
21/09/2010 06:56:58 Copyright (C) 1999 AT&T Laboratories Cambridge
21/09/2010 06:56:58 All Rights Reserved.
21/09/2010 06:56:58 See http://www.tightvnc.com/ for information on TightVNC
21/09/2010 06:56:58 See http://xf4vnc.sf.net for xf4vnc-specific information
21/09/2010 06:56:58 Desktop name 'x11' (hudson:10)
21/09/2010 06:56:58 Protocol versions supported: 3.7, 3.3
21/09/2010 06:56:58 RGB format 8 8 8
21/09/2010 06:56:58 Listening for VNC connections on TCP port 5910
Could not init font path element /usr/share/fonts/TTF/, removing from list!
Could not init font path element /usr/share/fonts/OTF, removing from list!
+ export 'PROJRELENGROOT=-projRelengRoot :pserver:anonymous@xxxxxxxxxxxxxxx:/cvsroot/tools'
+ PROJRELENGROOT='-projRelengRoot :pserver:anonymous@xxxxxxxxxxxxxxx:/cvsroot/tools'
+ export 'PROJRELENGPATH=-projRelengPath org.eclipse.pdt/org.eclipse.pdt.releng'
+ PROJRELENGPATH='-projRelengPath org.eclipse.pdt/org.eclipse.pdt.releng'
+ . /opt/public/cbi/build/org.eclipse.dash.common.releng/hudson/run.sh
+++ date '+%Y/%m/%d %H:%M'
++ echo '[2010/09/21 06:56] Hudson job  build #460 (2010-09-21_06-55-49) started.'
[2010/09/21 06:56] Hudson job  build #460 (2010-09-21_06-55-49) started.
+++ date +%Y%m%d%H%M
++ buildTimestamp=201009210656
++ cvsProjectBaseDir=/opt/public/cbi/build
++ [[ ! -d /opt/public/cbi/build ]]
++ [[ ! -d /opt/public/cbi/build ]]
++ thirdPartyJarsDir=/opt/public/cbi/build/3rdPartyJars
++ [[ ! -d /opt/public/cbi/build/3rdPartyJars ]]
++ [[ ! -d /opt/public/cbi/build/3rdPartyJars ]]
++ [[ -n N ]]
++ buildType=N
++ haderror=0
++ [[ -n tools.pdt ]]
++ projectid=tools.pdt
++ [[ -n 2.2.0 ]]
++ version=2.2.0
++ [[ -n -projRelengRoot :pserver:anonymous@xxxxxxxxxxxxxxx:/cvsroot/tools ]]
++ projRelengRoot='-projRelengRoot :pserver:anonymous@xxxxxxxxxxxxxxx:/cvsroot/tools'
++ [[ -n -projRelengPath org.eclipse.pdt/org.eclipse.pdt.releng ]]
++ projRelengPath='-projRelengPath org.eclipse.pdt/org.eclipse.pdt.releng'
++ [[ -n '' ]]
++ projRelengBranch=
++ [[ 0 -gt 0 ]]
++ writableBuildRoot=<https://hudson.eclipse.org/hudson/job/cbi-pdt-2.2-helios/ws/build>
++ [[ -d <https://hudson.eclipse.org/hudson/job/cbi-pdt-2.2-helios/ws/build> ]]
++ rm -fr <https://hudson.eclipse.org/hudson/job/cbi-pdt-2.2-helios/ws/build>
++ downloadsDir=<https://hudson.eclipse.org/hudson/job/cbi-pdt-2.2-helios/ws/build/downloads>
++ signingDir=<https://hudson.eclipse.org/hudson/job/cbi-pdt-2.2-helios/ws/build/signing>
++ [[ -n '' ]]
++ buildDir=<https://hudson.eclipse.org/hudson/job/cbi-pdt-2.2-helios/460/artifact/build/N201009210656>
++ mkdir -p <https://hudson.eclipse.org/hudson/job/cbi-pdt-2.2-helios/ws/build/downloads> <https://hudson.eclipse.org/hudson/job/cbi-pdt-2.2-helios/ws/build/signing> <https://hudson.eclipse.org/hudson/job/cbi-pdt-2.2-helios/460/artifact/build/N201009210656>
++ touch <https://hudson.eclipse.org/hudson/job/cbi-pdt-2.2-helios/ws/build/.cvspass>
++ relengBaseBuilderDir=<https://hudson.eclipse.org/hudson/job/cbi-pdt-2.2-helios/ws/build/org.eclipse.releng.basebuilder>
++ relengCommonBuilderDir=<https://hudson.eclipse.org/hudson/job/cbi-pdt-2.2-helios/ws/build/org.eclipse.dash.common.releng>
++ ln -s /opt/public/cbi/build/org.eclipse.releng.basebuilder <https://hudson.eclipse.org/hudson/job/cbi-pdt-2.2-helios/ws/build/>
++ ln -s /opt/public/cbi/build/org.eclipse.dash.common.releng <https://hudson.eclipse.org/hudson/job/cbi-pdt-2.2-helios/ws/build/>
++ ln -s /opt/public/cbi/build/3rdPartyJars <https://hudson.eclipse.org/hudson/job/cbi-pdt-2.2-helios/ws/build/>
++ thirdPartyJarsDir=<https://hudson.eclipse.org/hudson/job/cbi-pdt-2.2-helios/ws/build/3rdPartyJars>
++ find <https://hudson.eclipse.org/hudson/job/cbi-pdt-2.2-helios/ws/build/downloads> -maxdepth 1 -type f -name '*-SNAPSHOT.zip' -exec rm -f '{}' ';'
++ cd <https://hudson.eclipse.org/hudson/job/cbi-pdt-2.2-helios/ws/build/org.eclipse.dash.common.releng/tools/scripts>
++ ./start.sh -projectid tools.pdt -version 2.2.0 -buildType N -buildTimestamp 201009210656 -writableBuildRoot <https://hudson.eclipse.org/hudson/job/cbi-pdt-2.2-helios/ws/build> -thirdPartyJarsDir <https://hudson.eclipse.org/hudson/job/cbi-pdt-2.2-helios/ws/build/3rdPartyJars> -downloadsDir <https://hudson.eclipse.org/hudson/job/cbi-pdt-2.2-helios/ws/build/downloads> -buildDir <https://hudson.eclipse.org/hudson/job/cbi-pdt-2.2-helios/460/artifact/build/N201009210656> -projRelengRoot :pserver:anonymous@xxxxxxxxxxxxxxx:/cvsroot/tools -projRelengPath org.eclipse.pdt/org.eclipse.pdt.releng -forceContextQualifier -fetchTag HEAD
Found cvs: /usr/bin/cvs /usr/bin/X11/cvs /usr/share/cvs /usr/share/man/man1/cvs.1.gz /usr/share/man/man5/cvs.5.gz
Found svn in PATH=
/bin:/usr/bin/:/usr/local/bin
Found wget: /usr/bin/wget /usr/bin/X11/wget /usr/share/man/man1/wget.1.gz
21/09/2010 06:56:59 Xvnc version X.org/xf4vnc custom version
21/09/2010 06:56:59 Copyright (C) 2001-2004 Alan Hourihane.
21/09/2010 06:56:59 Copyright (C) 2000-2004 Constantin Kaplinsky
21/09/2010 06:56:59 Copyright (C) 1999 AT&T Laboratories Cambridge
21/09/2010 06:56:59 All Rights Reserved.
21/09/2010 06:56:59 See http://www.tightvnc.com/ for information on TightVNC
21/09/2010 06:56:59 See http://xf4vnc.sf.net for xf4vnc-specific information
21/09/2010 06:56:59 Desktop name 'x11' (hudson:10)
21/09/2010 06:56:59 Protocol versions supported: 3.7, 3.3
21/09/2010 06:56:59 RGB format 8 8 8
21/09/2010 06:56:59 Listening for VNC connections on TCP port 5910
Could not init font path element /usr/share/fonts/TTF/, removing from list!
Could not init font path element /usr/share/fonts/OTF, removing from list!
Found vncserver in PATH=
/bin:/usr/bin/:/usr/local/bin
Found Xvfb in PATH=
/bin:/usr/bin/:/usr/local/bin
Found Xvnc in PATH=
/bin:/usr/bin/:/usr/local/bin
WARNING: You may require 1 or more of the following tools for this build to proceed:
  javac
[start] [06:57:00] Started on 20100921 with these options:
   -projectid tools.pdt
   -version 2.2.0
   -buildType N
   -buildTimestamp 201009210656
   -writableBuildRoot <https://hudson.eclipse.org/hudson/job/cbi-pdt-2.2-helios/ws/build>
   -thirdPartyJarsDir <https://hudson.eclipse.org/hudson/job/cbi-pdt-2.2-helios/ws/build/3rdPartyJars>
   -downloadsDir <https://hudson.eclipse.org/hudson/job/cbi-pdt-2.2-helios/ws/build/downloads>
   -buildDir <https://hudson.eclipse.org/hudson/job/cbi-pdt-2.2-helios/460/artifact/build/N201009210656>
   -projRelengRoot :pserver:anonymous@xxxxxxxxxxxxxxx:/cvsroot/tools
   -projRelengPath org.eclipse.pdt/org.eclipse.pdt.releng
   -forceContextQualifier
   -fetchTag HEAD

[start] Create build directory <https://hudson.eclipse.org/hudson/job/cbi-pdt-2.2-helios/460/artifact/build/N201009210656>

  cvs -d :pserver:anonymous@xxxxxxxxxxxxxxx:/cvsroot/tools -Q ex -r HEAD -d org.eclipse.pdt.releng org.eclipse.pdt/org.eclipse.pdt.releng
[start] [06:57:00] Export done.

[start] Export skipped: org.eclipse.dash.common.releng already exists.

[start] Export skipped: org.eclipse.releng.basebuilder already exists.

Environment variables:
  HOME      = <https://hudson.eclipse.org/hudson/job/cbi-pdt-2.2-helios/ws/build>
  JAVA_HOME = /shared/common/jdk-1.5.0-22.x86_64
  ANT_HOME  = /opt/public/common/apache-ant-1.7.1
  ANT       = /opt/public/common/apache-ant-1.7.1/bin/ant

[start] mapVersionTag: HEAD
[start] [06:57:00] Invoke Eclipse build
 
[06:57:00]
  /shared/common/jdk-1.5.0-22.x86_64/bin/java 
  -enableassertions
  -cp <https://hudson.eclipse.org/hudson/job/cbi-pdt-2.2-helios/ws/build/org.eclipse.releng.basebuilder/plugins/org.eclipse.equinox.launcher.jar> org.eclipse.equinox.launcher.Main
  -application org.eclipse.ant.core.antRunner
  -f <https://hudson.eclipse.org/hudson/job/cbi-pdt-2.2-helios/ws/build/org.eclipse.dash.common.releng/buildAll.xml> run
  -Dprojectid=tools.pdt
  -DbuildTimestamp=201009210656
  -DbuildType=N
  -Dversion=2.2.0
  -DwritableBuildRoot=<https://hudson.eclipse.org/hudson/job/cbi-pdt-2.2-helios/ws/build>
  -DdownloadsDir=<https://hudson.eclipse.org/hudson/job/cbi-pdt-2.2-helios/ws/build/downloads>
  -DthirdPartyJarsDir=<https://hudson.eclipse.org/hudson/job/cbi-pdt-2.2-helios/ws/build/3rdPartyJars>
  -DbuildDir=<https://hudson.eclipse.org/hudson/job/cbi-pdt-2.2-helios/460/artifact/build/N201009210656>
  -DrelengBuilderDir=<https://hudson.eclipse.org/hudson/job/cbi-pdt-2.2-helios/ws/build/org.eclipse.pdt.releng>
  -DrelengCommonBuilderDir=<https://hudson.eclipse.org/hudson/job/cbi-pdt-2.2-helios/ws/build/org.eclipse.dash.common.releng>
  -DrelengBaseBuilderDir=<https://hudson.eclipse.org/hudson/job/cbi-pdt-2.2-helios/ws/build/org.eclipse.releng.basebuilder>
  -DJAVA_HOME=/shared/common/jdk-1.5.0-22.x86_64
  -DmapVersionTag=HEAD
  -DforceContextQualifier=v201009210656
  -DfetchTag=HEAD
Buildfile: <https://hudson.eclipse.org/hudson/job/cbi-pdt-2.2-helios/ws/build/org.eclipse.dash.common.releng/buildAll.xml>

init:

check.ant-contrib:

resolvepaths:

init:

genBuildCfgInit:
Trying to override old definition of task resolvepath

projectid2names:

genBuildCfg:
Trying to override old definition of task resolvepath

createBuildConfigFile:
Trying to override old definition of task resolvepath

initCommandlineArgsList:
Trying to override old definition of task resolvepath

load.properties:
     [echo] Load properties from <https://hudson.eclipse.org/hudson/job/cbi-pdt-2.2-helios/ws/build/org.eclipse.pdt.releng/build.properties>
     [echo] 
     [echo] Loaded JAVA*_HOME and bootclasspath values:
     [echo]         JAVA_HOME = /shared/common/jdk-1.5.0-22.x86_64
     [echo]       JAVA14_HOME = /shared/common/jdk-1.5.0-22.x86_64, J2SE-1.4 = /shared/common/jdk-1.5.0-22.x86_64/lib/vm.jar:/shared/common/jdk-1.5.0-22.x86_64/jre/lib/vm.jar:/shared/common/jdk-1.5.0-22.x86_64/lib/dt.jar:/shared/common/jdk-1.5.0-22.x86_64/jre/lib/dt.jar:/shared/common/jdk-1.5.0-22.x86_64/lib/rt.jar:/shared/common/jdk-1.5.0-22.x86_64/jre/lib/rt.jar:/shared/common/jdk-1.5.0-22.x86_64/lib/core.jar:/shared/common/jdk-1.5.0-22.x86_64/jre/lib/core.jar:/shared/common/jdk-1.5.0-22.x86_64/lib/xml.jar:/shared/common/jdk-1.5.0-22.x86_64/jre/lib/xml.jar:/shared/common/jdk-1.5.0-22.x86_64/lib/graphics.jar:/shared/common/jdk-1.5.0-22.x86_64/jre/lib/graphics.jar:/shared/common/jdk-1.5.0-22.x86_64/lib/server.jar:/shared/common/jdk-1.5.0-22.x86_64/jre/lib/server.jar:/shared/common/jdk-1.5.0-22.x86_64/lib/ibmorbapi.jar:/shared/common/jdk-1.5.0-22.x86_64/jre/lib/ibmorbapi.jar:/shared/common/jdk-1.5.0-22.x86_64/lib/security.jar:/shared/common/jdk-1.5.0-22.x86_64/jre/lib/security.jar:/shared/common/jdk-1.5.0-22.x86_64/lib/classes.jar:/shared/common/jdk-1.5.0-22.x86_64/jre/lib/classes.jar:/shared/common/jdk-1.5.0-22.x86_64/jre/lib/jce.jar:/shared/common/jdk-1.5.0-22.x86_64/lib/jsse.jar:/shared/common/jdk-1.5.0-22.x86_64/jre/lib/jsse.jar:/shared/common/jdk-1.5.0-22.x86_64/../Classes/dt.jar:/shared/common/jdk-1.5.0-22.x86_64/../Classes/classes.jar:/shared/common/jdk-1.5.0-22.x86_64/../Classes/jsse.jar:/shared/common/jdk-1.5.0-22.x86_64/../Classes/jce.jar
     [echo]       JAVA50_HOME = /shared/common/jdk-1.5.0-22.x86_64, J2SE-1.5 = /shared/common/jdk-1.5.0-22.x86_64/jre/lib/rt.jar:/shared/common/jdk-1.5.0-22.x86_64/jre/lib/vm.jar:/shared/common/jdk-1.5.0-22.x86_64/jre/lib/core.jar:/shared/common/jdk-1.5.0-22.x86_64/jre/lib/xml.jar:/shared/common/jdk-1.5.0-22.x86_64/jre/lib/graphics.jar:/shared/common/jdk-1.5.0-22.x86_64/jre/lib/server.jar:/shared/common/jdk-1.5.0-22.x86_64/jre/lib/ibmorbapi.jar:/shared/common/jdk-1.5.0-22.x86_64/jre/lib/security.jar:/shared/common/jdk-1.5.0-22.x86_64/jre/lib/classes.jar:/shared/common/jdk-1.5.0-22.x86_64/jre/lib/jsse.jar:/shared/common/jdk-1.5.0-22.x86_64/jre/lib/jce.jar:/shared/common/jdk-1.5.0-22.x86_64/jre/lib/ibmjcefw.jar:/shared/common/jdk-1.5.0-22.x86_64/../Classes/dt.jar:/shared/common/jdk-1.5.0-22.x86_64/../Classes/classes.jar:/shared/common/jdk-1.5.0-22.x86_64/../Classes/jsse.jar:/shared/common/jdk-1.5.0-22.x86_64/../Classes/jce.jar
     [echo]       JAVA60_HOME = /shared/common/jdk-1.6.x86_64, JavaSE-1.6 = /shared/common/jdk-1.6.x86_64/jre/lib/rt.jar:/shared/common/jdk-1.6.x86_64/jre/lib/core.jar:/shared/common/jdk-1.6.x86_64/jre/lib/annotation.jar:/shared/common/jdk-1.6.x86_64/jre/lib/beans.jar:/shared/common/jdk-1.6.x86_64/jre/lib/ibmorbapi.jar:/shared/common/jdk-1.6.x86_64/jre/lib/java.util.jar:/shared/common/jdk-1.6.x86_64/jre/lib/jlm.jar:/shared/common/jdk-1.6.x86_64/jre/lib/logging.jar:/shared/common/jdk-1.6.x86_64/jre/lib/resources.jar:/shared/common/jdk-1.6.x86_64/jre/lib/security.jar:/shared/common/jdk-1.6.x86_64/jre/lib/sql.jar:/shared/common/jdk-1.6.x86_64/jre/lib/vm.jar:/shared/common/jdk-1.6.x86_64/jre/lib/xmldsigfw.jar:/shared/common/jdk-1.6.x86_64/jre/lib/xml.jar:/shared/common/jdk-1.6.x86_64/jre/lib/graphics.jar:/shared/common/jdk-1.6.x86_64/jre/lib/server.jar:/shared/common/jdk-1.6.x86_64/jre/lib/jce.jar:/shared/common/jdk-1.6.x86_64/jre/lib/jsse.jar:/shared/common/jdk-1.6.x86_64/jre/lib/ibmjcefw.jar:/shared/common/jdk-1.6.x86_64/lib/dt.jar:/shared/common/jdk-1.6.x86_64/../Classes/dt.jar:/shared/common/jdk-1.6.x86_64/../Classes/classes.jar:/shared/common/jdk-1.6.x86_64/../Classes/jsse.jar:/shared/common/jdk-1.6.x86_64/../Classes/jce.jar
     [echo] Created <https://hudson.eclipse.org/hudson/job/cbi-pdt-2.2-helios/460/artifact/build/N201009210656/build.cfg>
Trying to override old definition of task resolvepath

collectMapTypes:
     [echo] Found these map entry types: CVS
Trying to override old definition of task resolvepath

collectURLs:

getZip:
      [get] Getting: http://archive.eclipse.org/eclipse/downloads/drops/S-3.6RC3-201005271700/eclipse-SDK-3.6RC3-linux-gtk-x86_64.tar.gz
      [get] To: <https://hudson.eclipse.org/hudson/job/cbi-pdt-2.2-helios/ws/build/downloads/eclipse-SDK-3.6RC3-linux-gtk-x86_64.tar.gz>

getZip:
      [get] Getting: http://download.eclipse.org/technology/dltk/downloads/drops/R2.0/S-2.0M6-201003160541/dltk-core-Automated_Tests-S-2.0M6-201003160541.zip
      [get] To: <https://hudson.eclipse.org/hudson/job/cbi-pdt-2.2-helios/ws/build/downloads/dltk-core-Automated_Tests-S-2.0M6-201003160541.zip>
      [get] Error opening connection java.io.FileNotFoundException: http://download.eclipse.org/technology/dltk/downloads/drops/R2.0/S-2.0M6-201003160541/dltk-core-Automated_Tests-S-2.0M6-201003160541.zip
      [get] Error opening connection java.io.FileNotFoundException: http://download.eclipse.org/technology/dltk/downloads/drops/R2.0/S-2.0M6-201003160541/dltk-core-Automated_Tests-S-2.0M6-201003160541.zip
      [get] Error opening connection java.io.FileNotFoundException: http://download.eclipse.org/technology/dltk/downloads/drops/R2.0/S-2.0M6-201003160541/dltk-core-Automated_Tests-S-2.0M6-201003160541.zip
      [get] Can't get http://download.eclipse.org/technology/dltk/downloads/drops/R2.0/S-2.0M6-201003160541/dltk-core-Automated_Tests-S-2.0M6-201003160541.zip to <https://hudson.eclipse.org/hudson/job/cbi-pdt-2.2-helios/ws/build/downloads/dltk-core-Automated_Tests-S-2.0M6-201003160541.zip>

BUILD FAILED
<https://hudson.eclipse.org/hudson/job/cbi-pdt-2.2-helios/ws/build/org.eclipse.dash.common.releng/tools/scripts/buildAllHelper.xml>:2831: The following error occurred while executing this line:
<https://hudson.eclipse.org/hudson/job/cbi-pdt-2.2-helios/ws/build/org.eclipse.dash.common.releng/tools/scripts/buildAllHelper.xml>:3035: The following error occurred while executing this line:
<https://hudson.eclipse.org/hudson/job/cbi-pdt-2.2-helios/ws/build/org.eclipse.dash.common.releng/tools/scripts/buildAllHelper.xml>:3202: Can't get http://download.eclipse.org/technology/dltk/downloads/drops/R2.0/S-2.0M6-201003160541/dltk-core-Automated_Tests-S-2.0M6-201003160541.zip to <https://hudson.eclipse.org/hudson/job/cbi-pdt-2.2-helios/ws/build/downloads/dltk-core-Automated_Tests-S-2.0M6-201003160541.zip>

Total time: 6 seconds
[start] [06:57:09] start.sh finished.

++ rm -f <https://hudson.eclipse.org/hudson/job/cbi-pdt-2.2-helios/ws/build/.cvspass>
+++ date '+%Y/%m/%d %H:%M'
++ echo '[2010/09/21 06:57] Hudson job  build #460 (2010-09-21_06-55-49) done.'
[2010/09/21 06:57] Hudson job  build #460 (2010-09-21_06-55-49) done.
Terminating xvnc.
Archiving artifacts
Recording test results
No test report files were found. Configuration error?