[Date Prev][Date Next][Thread Prev][Thread Next][Date Index][Thread Index] [List Home]
[pdt-dev] Build failed in Hudson: cbi-pdt-2.2-helios #303

See <https://build.eclipse.org/hudson/job/cbi-pdt-2.2-helios/303/changes>

Changes:

[rganor] Bug 316220 - Deprecated members not crossed out within for loops

contributed by Ronen H.

------------------------------------------
Started by an SCM change
ln -s 2010-06-13_09-11-52 /opt/users/hudsonbuild/.hudson/jobs/cbi-pdt-2.2-helios/builds/303 failed: -1
Building on master
[org.eclipse.pdt] $ cvs -q -z3 update -PdC -D "Sunday, June 13, 2010 1:11:52 PM UTC"
P plugins/org.eclipse.php.core/src/org/eclipse/php/internal/core/compiler/ast/nodes/ForStatement.java
U tests/org.eclipse.php.ui.tests/workspace/semantic_highlighting/php5/deprecated.pdtt
$ computing changelog
Deleting old artifacts from #301
Starting xvnc
[workspace] $ Xvnc :21 -geometry 1024x768 -depth 24 -ac
[workspace] $ /bin/sh -xe /tmp/hudson1629896737428160874.sh
13/06/2010 09:12:20 Xvnc version XF4VNC-4.4.0.0
13/06/2010 09:12:20 Copyright (C) 2001-2004 Alan Hourihane.
13/06/2010 09:12:20 Copyright (C) 2000-2004 Constantin Kaplinsky
13/06/2010 09:12:20 Copyright (C) 1999 AT&T Laboratories Cambridge
13/06/2010 09:12:20 All Rights Reserved.
13/06/2010 09:12:20 See http://www.tightvnc.com/ for information on TightVNC
13/06/2010 09:12:20 See http://xf4vnc.sf.net for xf4vnc-specific information
13/06/2010 09:12:20 Desktop name 'x11' (build:21)
13/06/2010 09:12:20 Protocol versions supported: 3.7, 3.3
13/06/2010 09:12:20 RGB format 8 8 8
13/06/2010 09:12:20 Listening for VNC connections on TCP port 5921
Could not init font path element /usr/X11R6/lib/X11/fonts/TTF/, removing from list!
Could not init font path element /usr/X11R6/lib/X11/fonts/CID/, removing from list!
Could not init font path element /usr/X11R6/lib/X11/fonts/100dpi/, removing from list!
+ export 'PROJRELENGROOT=-projRelengRoot :pserver:anonymous@xxxxxxxxxxxxxxx:/cvsroot/tools'
+ PROJRELENGROOT='-projRelengRoot :pserver:anonymous@xxxxxxxxxxxxxxx:/cvsroot/tools'
+ export 'PROJRELENGPATH=-projRelengPath org.eclipse.pdt/org.eclipse.pdt.releng'
+ PROJRELENGPATH='-projRelengPath org.eclipse.pdt/org.eclipse.pdt.releng'
+ . /opt/public/cbi/build/org.eclipse.dash.common.releng/hudson/run.sh
+++ date '+%Y/%m/%d %H:%M'
++ echo '[2010/06/13 09:12] Hudson job  build #303 (2010-06-13_09-11-52) started.'
[2010/06/13 09:12] Hudson job  build #303 (2010-06-13_09-11-52) started.
+++ date +%Y%m%d%H%M
++ buildTimestamp=201006130912
++ cvsProjectBaseDir=/opt/public/cbi/build
++ [[ ! -d /opt/public/cbi/build ]]
++ [[ ! -d /opt/public/cbi/build ]]
++ thirdPartyJarsDir=/opt/public/cbi/build/3rdPartyJars
++ [[ ! -d /opt/public/cbi/build/3rdPartyJars ]]
++ [[ ! -d /opt/public/cbi/build/3rdPartyJars ]]
++ [[ -n N ]]
++ buildType=N
++ haderror=0
++ [[ -n tools.pdt ]]
++ projectid=tools.pdt
++ [[ -n 2.2.0 ]]
++ version=2.2.0
++ [[ -n -projRelengRoot :pserver:anonymous@xxxxxxxxxxxxxxx:/cvsroot/tools ]]
++ projRelengRoot='-projRelengRoot :pserver:anonymous@xxxxxxxxxxxxxxx:/cvsroot/tools'
++ [[ -n -projRelengPath org.eclipse.pdt/org.eclipse.pdt.releng ]]
++ projRelengPath='-projRelengPath org.eclipse.pdt/org.eclipse.pdt.releng'
++ [[ -n '' ]]
++ projRelengBranch=
++ [[ 0 -gt 0 ]]
++ writableBuildRoot=<https://build.eclipse.org/hudson/job/cbi-pdt-2.2-helios/ws/build>
++ [[ -d <https://build.eclipse.org/hudson/job/cbi-pdt-2.2-helios/ws/build> ]]
++ rm -fr <https://build.eclipse.org/hudson/job/cbi-pdt-2.2-helios/ws/build>
++ downloadsDir=<https://build.eclipse.org/hudson/job/cbi-pdt-2.2-helios/ws/build/downloads>
++ signingDir=<https://build.eclipse.org/hudson/job/cbi-pdt-2.2-helios/ws/build/signing>
++ [[ -n '' ]]
++ buildDir=<https://build.eclipse.org/hudson/job/cbi-pdt-2.2-helios/303/artifact/build/N201006130912>
++ mkdir -p <https://build.eclipse.org/hudson/job/cbi-pdt-2.2-helios/ws/build/downloads> <https://build.eclipse.org/hudson/job/cbi-pdt-2.2-helios/ws/build/signing> <https://build.eclipse.org/hudson/job/cbi-pdt-2.2-helios/303/artifact/build/N201006130912>
++ touch <https://build.eclipse.org/hudson/job/cbi-pdt-2.2-helios/ws/build/.cvspass>
++ relengBaseBuilderDir=<https://build.eclipse.org/hudson/job/cbi-pdt-2.2-helios/ws/build/org.eclipse.releng.basebuilder>
++ relengCommonBuilderDir=<https://build.eclipse.org/hudson/job/cbi-pdt-2.2-helios/ws/build/org.eclipse.dash.common.releng>
++ ln -s /opt/public/cbi/build/org.eclipse.releng.basebuilder <https://build.eclipse.org/hudson/job/cbi-pdt-2.2-helios/ws/build/>
++ ln -s /opt/public/cbi/build/org.eclipse.dash.common.releng <https://build.eclipse.org/hudson/job/cbi-pdt-2.2-helios/ws/build/>
++ ln -s /opt/public/cbi/build/3rdPartyJars <https://build.eclipse.org/hudson/job/cbi-pdt-2.2-helios/ws/build/>
++ thirdPartyJarsDir=<https://build.eclipse.org/hudson/job/cbi-pdt-2.2-helios/ws/build/3rdPartyJars>
++ find <https://build.eclipse.org/hudson/job/cbi-pdt-2.2-helios/ws/build/downloads> -maxdepth 1 -type f -name '*-SNAPSHOT.zip' -exec rm -f '{}' ';'
++ cd <https://build.eclipse.org/hudson/job/cbi-pdt-2.2-helios/ws/build/org.eclipse.dash.common.releng/tools/scripts>
++ ./start.sh -projectid tools.pdt -version 2.2.0 -buildType N -buildTimestamp 201006130912 -writableBuildRoot <https://build.eclipse.org/hudson/job/cbi-pdt-2.2-helios/ws/build> -thirdPartyJarsDir <https://build.eclipse.org/hudson/job/cbi-pdt-2.2-helios/ws/build/3rdPartyJars> -downloadsDir <https://build.eclipse.org/hudson/job/cbi-pdt-2.2-helios/ws/build/downloads> -buildDir <https://build.eclipse.org/hudson/job/cbi-pdt-2.2-helios/303/artifact/build/N201006130912> -projRelengRoot :pserver:anonymous@xxxxxxxxxxxxxxx:/cvsroot/tools -projRelengPath org.eclipse.pdt/org.eclipse.pdt.releng -forceContextQualifier -fetchTag HEAD
Found cvs: /usr/bin/cvs /usr/share/cvs /usr/share/man/man1/cvs.1.gz /usr/share/man/man5/cvs.5.gz
Found svn in PATH=
/bin:/usr/bin/:/usr/local/bin
Found javac in PATH=
/bin:/usr/bin/:/usr/local/bin
Found wget: /usr/bin/wget /usr/share/man/man1/wget.1.gz
Found vncserver: /usr/X11R6/bin/vncserver /usr/bin/X11/vncserver /usr/X11/bin/vncserver /usr/share/man/man1/vncserver.1.gz
Found Xvfb: /usr/X11R6/bin/Xvfb /usr/bin/X11/Xvfb /usr/X11/bin/Xvfb /usr/X11/man/man1/Xvfb.1x.gz
Found Xvnc: /usr/X11R6/bin/Xvnc /usr/bin/X11/Xvnc /usr/X11/bin/Xvnc
[start] [09:12:22] Started on 20100613 with these options:
   -projectid tools.pdt
   -version 2.2.0
   -buildType N
   -buildTimestamp 201006130912
   -writableBuildRoot <https://build.eclipse.org/hudson/job/cbi-pdt-2.2-helios/ws/build>
   -thirdPartyJarsDir <https://build.eclipse.org/hudson/job/cbi-pdt-2.2-helios/ws/build/3rdPartyJars>
   -downloadsDir <https://build.eclipse.org/hudson/job/cbi-pdt-2.2-helios/ws/build/downloads>
   -buildDir <https://build.eclipse.org/hudson/job/cbi-pdt-2.2-helios/303/artifact/build/N201006130912>
   -projRelengRoot :pserver:anonymous@xxxxxxxxxxxxxxx:/cvsroot/tools
   -projRelengPath org.eclipse.pdt/org.eclipse.pdt.releng
   -forceContextQualifier
   -fetchTag HEAD

[start] Create build directory <https://build.eclipse.org/hudson/job/cbi-pdt-2.2-helios/303/artifact/build/N201006130912>

  cvs -d :pserver:anonymous@xxxxxxxxxxxxxxx:/cvsroot/tools -Q ex -r HEAD -d org.eclipse.pdt.releng org.eclipse.pdt/org.eclipse.pdt.releng
[start] [09:12:22] Export done.

[start] Export skipped: org.eclipse.dash.common.releng already exists.

[start] Export skipped: org.eclipse.releng.basebuilder already exists.

Environment variables:
  HOME      = <https://build.eclipse.org/hudson/job/cbi-pdt-2.2-helios/ws/build>
  JAVA_HOME = /opt/public/common/ibm-java2-ppc-50
  ANT_HOME  = /opt/public/common/apache-ant-1.7.1
  ANT       = /opt/public/common/apache-ant-1.7.1/bin/ant

[start] mapVersionTag: HEAD
[start] [09:12:23] Invoke Eclipse build
 
[09:12:24]
  /opt/public/common/ibm-java2-ppc-50/bin/java 
  -enableassertions
  -cp <https://build.eclipse.org/hudson/job/cbi-pdt-2.2-helios/ws/build/org.eclipse.releng.basebuilder/plugins/org.eclipse.equinox.launcher.jar> org.eclipse.equinox.launcher.Main
  -application org.eclipse.ant.core.antRunner
  -f <https://build.eclipse.org/hudson/job/cbi-pdt-2.2-helios/ws/build/org.eclipse.dash.common.releng/buildAll.xml> run
  -Dprojectid=tools.pdt
  -DbuildTimestamp=201006130912
  -DbuildType=N
  -Dversion=2.2.0
  -DwritableBuildRoot=<https://build.eclipse.org/hudson/job/cbi-pdt-2.2-helios/ws/build>
  -DdownloadsDir=<https://build.eclipse.org/hudson/job/cbi-pdt-2.2-helios/ws/build/downloads>
  -DthirdPartyJarsDir=<https://build.eclipse.org/hudson/job/cbi-pdt-2.2-helios/ws/build/3rdPartyJars>
  -DbuildDir=<https://build.eclipse.org/hudson/job/cbi-pdt-2.2-helios/303/artifact/build/N201006130912>
  -DrelengBuilderDir=<https://build.eclipse.org/hudson/job/cbi-pdt-2.2-helios/ws/build/org.eclipse.pdt.releng>
  -DrelengCommonBuilderDir=<https://build.eclipse.org/hudson/job/cbi-pdt-2.2-helios/ws/build/org.eclipse.dash.common.releng>
  -DrelengBaseBuilderDir=<https://build.eclipse.org/hudson/job/cbi-pdt-2.2-helios/ws/build/org.eclipse.releng.basebuilder>
  -DJAVA_HOME=/opt/public/common/ibm-java2-ppc-50
  -DmapVersionTag=HEAD
  -DforceContextQualifier=v201006130912
  -DfetchTag=HEAD
Buildfile: <https://build.eclipse.org/hudson/job/cbi-pdt-2.2-helios/ws/build/org.eclipse.dash.common.releng/buildAll.xml>

init:

check.ant-contrib:

resolvepaths:

init:

genBuildCfgInit:
Trying to override old definition of task resolvepath

projectid2names:

genBuildCfg:
Trying to override old definition of task resolvepath

createBuildConfigFile:
Trying to override old definition of task resolvepath

initCommandlineArgsList:
Trying to override old definition of task resolvepath

load.properties:
     [echo] Load properties from <https://build.eclipse.org/hudson/job/cbi-pdt-2.2-helios/ws/build/org.eclipse.pdt.releng/build.properties>
     [echo] 
     [echo] Loaded JAVA*_HOME and bootclasspath values:
     [echo]         JAVA_HOME = /opt/public/common/ibm-java2-ppc-50
     [echo]       JAVA14_HOME = /opt/public/common/ibm-java2-142, J2SE-1.4 = /opt/public/common/ibm-java2-142/lib/vm.jar:/opt/public/common/ibm-java2-142/jre/lib/vm.jar:/opt/public/common/ibm-java2-142/lib/dt.jar:/opt/public/common/ibm-java2-142/jre/lib/dt.jar:/opt/public/common/ibm-java2-142/lib/rt.jar:/opt/public/common/ibm-java2-142/jre/lib/rt.jar:/opt/public/common/ibm-java2-142/lib/core.jar:/opt/public/common/ibm-java2-142/jre/lib/core.jar:/opt/public/common/ibm-java2-142/lib/xml.jar:/opt/public/common/ibm-java2-142/jre/lib/xml.jar:/opt/public/common/ibm-java2-142/lib/graphics.jar:/opt/public/common/ibm-java2-142/jre/lib/graphics.jar:/opt/public/common/ibm-java2-142/lib/server.jar:/opt/public/common/ibm-java2-142/jre/lib/server.jar:/opt/public/common/ibm-java2-142/lib/ibmorbapi.jar:/opt/public/common/ibm-java2-142/jre/lib/ibmorbapi.jar:/opt/public/common/ibm-java2-142/lib/security.jar:/opt/public/common/ibm-java2-142/jre/lib/security.jar:/opt/public/common/ibm-java2-142/lib/classes.jar:/opt/public/common/ibm-java2-142/jre/lib/classes.jar:/opt/public/common/ibm-java2-142/jre/lib/jce.jar:/opt/public/common/ibm-java2-142/lib/jsse.jar:/opt/public/common/ibm-java2-142/jre/lib/jsse.jar:/opt/public/common/ibm-java2-142/../Classes/dt.jar:/opt/public/common/ibm-java2-142/../Classes/classes.jar:/opt/public/common/ibm-java2-142/../Classes/jsse.jar:/opt/public/common/ibm-java2-142/../Classes/jce.jar
     [echo]       JAVA50_HOME = /opt/public/common/ibm-java2-ppc-50, J2SE-1.5 = /opt/public/common/ibm-java2-ppc-50/jre/lib/rt.jar:/opt/public/common/ibm-java2-ppc-50/jre/lib/vm.jar:/opt/public/common/ibm-java2-ppc-50/jre/lib/core.jar:/opt/public/common/ibm-java2-ppc-50/jre/lib/xml.jar:/opt/public/common/ibm-java2-ppc-50/jre/lib/graphics.jar:/opt/public/common/ibm-java2-ppc-50/jre/lib/server.jar:/opt/public/common/ibm-java2-ppc-50/jre/lib/ibmorbapi.jar:/opt/public/common/ibm-java2-ppc-50/jre/lib/security.jar:/opt/public/common/ibm-java2-ppc-50/jre/lib/classes.jar:/opt/public/common/ibm-java2-ppc-50/jre/lib/jsse.jar:/opt/public/common/ibm-java2-ppc-50/jre/lib/jce.jar:/opt/public/common/ibm-java2-ppc-50/jre/lib/ibmjcefw.jar:/opt/public/common/ibm-java2-ppc-50/../Classes/dt.jar:/opt/public/common/ibm-java2-ppc-50/../Classes/classes.jar:/opt/public/common/ibm-java2-ppc-50/../Classes/jsse.jar:/opt/public/common/ibm-java2-ppc-50/../Classes/jce.jar
     [echo]       JAVA60_HOME = /opt/public/common/ibm-java-jdk-ppc-60, JavaSE-1.6 = /opt/public/common/ibm-java-jdk-ppc-60/jre/lib/rt.jar:/opt/public/common/ibm-java-jdk-ppc-60/jre/lib/core.jar:/opt/public/common/ibm-java-jdk-ppc-60/jre/lib/annotation.jar:/opt/public/common/ibm-java-jdk-ppc-60/jre/lib/beans.jar:/opt/public/common/ibm-java-jdk-ppc-60/jre/lib/ibmorbapi.jar:/opt/public/common/ibm-java-jdk-ppc-60/jre/lib/java.util.jar:/opt/public/common/ibm-java-jdk-ppc-60/jre/lib/jlm.jar:/opt/public/common/ibm-java-jdk-ppc-60/jre/lib/logging.jar:/opt/public/common/ibm-java-jdk-ppc-60/jre/lib/resources.jar:/opt/public/common/ibm-java-jdk-ppc-60/jre/lib/security.jar:/opt/public/common/ibm-java-jdk-ppc-60/jre/lib/sql.jar:/opt/public/common/ibm-java-jdk-ppc-60/jre/lib/vm.jar:/opt/public/common/ibm-java-jdk-ppc-60/jre/lib/xmldsigfw.jar:/opt/public/common/ibm-java-jdk-ppc-60/jre/lib/xml.jar:/opt/public/common/ibm-java-jdk-ppc-60/jre/lib/graphics.jar:/opt/public/common/ibm-java-jdk-ppc-60/jre/lib/server.jar:/opt/public/common/ibm-java-jdk-ppc-60/jre/lib/jce.jar:/opt/public/common/ibm-java-jdk-ppc-60/jre/lib/jsse.jar:/opt/public/common/ibm-java-jdk-ppc-60/jre/lib/ibmjcefw.jar:/opt/public/common/ibm-java-jdk-ppc-60/lib/dt.jar:/opt/public/common/ibm-java-jdk-ppc-60/../Classes/dt.jar:/opt/public/common/ibm-java-jdk-ppc-60/../Classes/classes.jar:/opt/public/common/ibm-java-jdk-ppc-60/../Classes/jsse.jar:/opt/public/common/ibm-java-jdk-ppc-60/../Classes/jce.jar
     [echo] Created <https://build.eclipse.org/hudson/job/cbi-pdt-2.2-helios/303/artifact/build/N201006130912/build.cfg>
Trying to override old definition of task resolvepath

collectMapTypes:
     [echo] Found these map entry types: CVS
Trying to override old definition of task resolvepath

collectURLs:

getZip:
      [get] Getting: http://download.eclipse.org/eclipse/downloads/drops/S-3.6RC3-201005271700/eclipse-SDK-3.6RC3-linux-gtk-ppc.tar.gz
      [get] To: <https://build.eclipse.org/hudson/job/cbi-pdt-2.2-helios/ws/build/downloads/eclipse-SDK-3.6RC3-linux-gtk-ppc.tar.gz>
      [get] Error opening connection java.io.FileNotFoundException: http://download.eclipse.org/eclipse/downloads/drops/S-3.6RC3-201005271700/eclipse-SDK-3.6RC3-linux-gtk-ppc.tar.gz
      [get] Error opening connection java.io.FileNotFoundException: http://download.eclipse.org/eclipse/downloads/drops/S-3.6RC3-201005271700/eclipse-SDK-3.6RC3-linux-gtk-ppc.tar.gz
      [get] Error opening connection java.io.FileNotFoundException: http://download.eclipse.org/eclipse/downloads/drops/S-3.6RC3-201005271700/eclipse-SDK-3.6RC3-linux-gtk-ppc.tar.gz
      [get] Can't get http://download.eclipse.org/eclipse/downloads/drops/S-3.6RC3-201005271700/eclipse-SDK-3.6RC3-linux-gtk-ppc.tar.gz to <https://build.eclipse.org/hudson/job/cbi-pdt-2.2-helios/ws/build/downloads/eclipse-SDK-3.6RC3-linux-gtk-ppc.tar.gz>

BUILD FAILED
<https://build.eclipse.org/hudson/job/cbi-pdt-2.2-helios/ws/build/org.eclipse.dash.common.releng/tools/scripts/buildAllHelper.xml>:2831: The following error occurred while executing this line:
<https://build.eclipse.org/hudson/job/cbi-pdt-2.2-helios/ws/build/org.eclipse.dash.common.releng/tools/scripts/buildAllHelper.xml>:3035: The following error occurred while executing this line:
<https://build.eclipse.org/hudson/job/cbi-pdt-2.2-helios/ws/build/org.eclipse.dash.common.releng/tools/scripts/buildAllHelper.xml>:3202: Can't get http://download.eclipse.org/eclipse/downloads/drops/S-3.6RC3-201005271700/eclipse-SDK-3.6RC3-linux-gtk-ppc.tar.gz to <https://build.eclipse.org/hudson/job/cbi-pdt-2.2-helios/ws/build/downloads/eclipse-SDK-3.6RC3-linux-gtk-ppc.tar.gz>

Total time: 4 seconds
[start] [09:12:38] start.sh finished.

++ rm -f <https://build.eclipse.org/hudson/job/cbi-pdt-2.2-helios/ws/build/.cvspass>
+++ date '+%Y/%m/%d %H:%M'
++ echo '[2010/06/13 09:12] Hudson job  build #303 (2010-06-13_09-11-52) done.'
[2010/06/13 09:12] Hudson job  build #303 (2010-06-13_09-11-52) done.
Terminating xvnc.
FreeFontPath: FPE "/usr/X11R6/lib/X11/fonts/misc/" refcount is 2, should be 1; fixing.
Archiving artifacts
Recording test results
No test report files were found. Configuration error?