Skip to main content

[Date Prev][Date Next][Thread Prev][Thread Next][Date Index][Thread Index] [List Home]
[jdt-dev] Smoke test for Y20261028-1500 - FAILURE

Smoke tests failed for Y20261028-1500. Please review the logs:
https://ci.eclipse.org/releng/job/y-builds/job/smoke-tests/4/

Results per platform / Java version:
  CentOS 9 / Java 25          : PASSED (1619 passed, 0 failed, 134 skipped)
  CentOS 9 / Java 28-EA       : FAILED
  CentOS ARM / Java 25        : PASSED (1619 passed, 0 failed, 134 skipped)
  CentOS ARM / Java 28-EA     : PASSED (1619 passed, 0 failed, 134 skipped)
  CentOS PowerPC / Java 28-EA : FAILED (1617 passed, 2 failed, 134 skipped)
  Linux RISC-V / Java 28-EA   : FAILED (1618 passed, 1 failed, 134 skipped)
  openSUSE Leap / Java 25     : PASSED (1619 passed, 0 failed, 134 skipped)
  openSUSE Leap / Java 28-EA  : FAILED

Back to the top