Skip to main content

[Date Prev][Date Next][Thread Prev][Thread Next][Date Index][Thread Index] [List Home]
Re: [jdt-dev] FW: Smoke test for Y20261021-1500 - FAILURE
  • From: JAYAPRAKASH ARTHANAREESWARAN <jarthana@xxxxxxxxxx>
  • Date: Thu, 22 Oct 2026 04:48:47 +0000
  • Accept-language: en-US
  • Arc-authentication-results: i=1; mx.microsoft.com 1; spf=pass smtp.mailfrom=in.ibm.com; dmarc=pass action=none header.from=in.ibm.com; dkim=pass header.d=in.ibm.com; arc=none
  • Arc-message-signature: i=1; a=rsa-sha256; c=relaxed/relaxed; d=microsoft.com; s=arcselector10001; h=From:Date:Subject:Message-ID:Content-Type:MIME-Version:X-MS-Exchange-AntiSpam-MessageData-ChunkCount:X-MS-Exchange-AntiSpam-MessageData-0:X-MS-Exchange-AntiSpam-MessageData-1; bh=UGLoq4rX7pzuKJz2NCWOcG4RzJhVgQ65/W8/ahOR/lo=; b=E948QO8anry0TCDPvoceV9KKbzcf3bNhpwHhFUshLWC4Lqkjn5r1pFcvjliujyWf8OfaFKa7lwE5hCNhTGXaemnIRiFdZ23/kuGAT6xQv6jwh9V7S402Vc0cMnJDKHp+OMq2Lng6GWj0tQsPd7FPXg/a2z75OjF0t9G0y2ZdXK4IEhBYiQZmI/JfWdvFu2XeOMIxdNVab4VF/CdnkEF1mVIscB+5GeZAlT2gBMK9Q99k1vCGfFnJ0st+MU25EpRjojlROPvuA/oL1xG05YxXanmQ95IRxm3z7PGvtVZTBgIjUP4h5yJL0BdmwQNMn7dL0Oica5ZkP4aEhuueNMmNKA==
  • Arc-seal: i=1; a=rsa-sha256; s=arcselector10001; d=microsoft.com; cv=none; b=C3DwxFumNmaM/PK2sxufheluzuqzPIzO6weJPtjwTNDOFTwyCMxSt6KqF3MZTkVOQdBOeoF7kGKAWjLbtoONEDk37TJlGloOT16cRUNIuIgCrb+mixYoYcmw6xx//+2w8UtUdkS+QJpEMoEoYNFvxCP+huXttDBWS2/eaHrtsxiBOcdu/WQMC/w3vOacCE7cBcGzMpB9EVVRDf/kWW/UU/e9r0ZLOYbljJ9DjT3xnPJCrAIlLqPpOVnWDwrP2qD7H4so9POlBfQDuxRaLdprl+o5rH/tAOuEtg8RlcBRBAsOI/EsZpuE5W2F347nyVo87EMmyiB8SVPjN6M67+acoQ==
  • Delivered-to: jdt-dev@xxxxxxxxxxx
  • List-archive: <https://www.eclipse.org/mailman/private/jdt-dev/>
  • List-help: <mailto:jdt-dev-request@eclipse.org?subject=help>
  • List-subscribe: <https://www.eclipse.org/mailman/listinfo/jdt-dev>, <mailto:jdt-dev-request@eclipse.org?subject=subscribe>
  • List-unsubscribe: <https://www.eclipse.org/mailman/options/jdt-dev>, <mailto:jdt-dev-request@eclipse.org?subject=unsubscribe>
  • Thread-index: AQHdYcNAij3F6wsLlUSn+mko0OfE87cI/TaA
  • Thread-topic: [EXTERNAL] [jdt-dev] FW: Smoke test for Y20261021-1500 - FAILURE

At the end of console, I see this: 
ERROR: None of the test reports contained any result  [Checks API] No suitable checks publisher found.  Finished: FAILURE
I am checking this from my mobile, so can't be sure if the tests actually ran and passed. Do you see the results? Or just a pass status?

Jay

From: jdt-dev <jdt-dev-bounces@xxxxxxxxxxx> on behalf of Sankaran, Srikanth via jdt-dev <jdt-dev@xxxxxxxxxxx>
Sent: Thursday, 22 October 2026 06:47:58
To: Eclipse JDT general developers list. <jdt-dev@xxxxxxxxxxx>
Cc: Sankaran, Srikanth <srikanth.sankaran@xxxxxxxxxxxxx>
Subject: [EXTERNAL] [jdt-dev] FW: Smoke test for Y20261021-1500 - FAILURE
 
Why does this say FAILURE - while the link actually opens a page that says all tests passed ? Who should look into this ?

Thanks
Srikanth

-----Original Message-----
From: jdt-dev <jdt-dev-bounces@xxxxxxxxxxx> On Behalf Of genie.releng--- via jdt-dev
Sent: 21 October 2026 22:50
To: jdt-dev@xxxxxxxxxxx
Cc: genie.releng@xxxxxxxxxxx
Subject: [jdt-dev] Smoke test for Y20261021-1500 - FAILURE

[EXTERNAL] This email is from outside, please confirm sender, title, content and whether you're expecting an email from this sender. If you have any doubt about the legitimacy of this email, please use the Report feature of Microsoft Outlook (instructions<https://urldefense.proofpoint.com/v2/url?u=https-3A__myadvantest.sharepoint.com_sites_InformationSecurity_SitePages_en_report-5Femail.aspx&d=DwIGaQ&c=BSDicqBQBDjDI9RkVyTcHQ&r=vh5OAwy_yVyW8HGeRVe4cYV53uUv77xN20nAmBsrgLs&m=nEnEXo86nf3KdOlQnfGrtttjjnipzbH1FsS_zbU0x1jqAM5nZg2u0c5_IWxresbb&s=zJGbCfOJkKevWl8o3g-51BFDG2pVCvVMcSL6u0fT5vw&e= >).
In case of a security incident click here<https://urldefense.proofpoint.com/v2/url?u=https-3A__helpdesk.advantest.com_servicePortal_submitIncident-3FpopulateSR-5Fid-3D334272&d=DwIGaQ&c=BSDicqBQBDjDI9RkVyTcHQ&r=vh5OAwy_yVyW8HGeRVe4cYV53uUv77xN20nAmBsrgLs&m=nEnEXo86nf3KdOlQnfGrtttjjnipzbH1FsS_zbU0x1jqAM5nZg2u0c5_IWxresbb&s=RNZxSrG6jVJFXUKefd6q8GOnqhpS37QmOolrtrBnsXM&e= >.


Smoke tests failed for Y20261021-1500. Please review the logs:
https://ci.eclipse.org/releng/job/automated-tests/job/smoke-tests/1013/

Back to the top