Skip to main content


Eclipse Community Forums
Forum Search:

Search      Help    Register    Login    Home
Home » Eclipse Projects » Eclipse SmartHome » mvn build error(Build fails at - Eclipse SmartHome Karaf Feature Verification)
mvn build error [message #1811243] Thu, 29 August 2019 10:45
Divya Chauhan is currently offline Divya ChauhanFriend
Messages: 1
Registered: August 2019
Junior Member
error log -

Eclipse SmartHome Karaf Feature Verification ....... FAILURE [02:01 min]
[INFO] Eclipse SmartHome Products ......................... SKIPPED
[INFO] Eclipse SmartHome p2 Repository .................... SKIPPED
[INFO] Eclipse SmartHome Tools ............................ SKIPPED
[INFO] Eclipse SmartHome Archetypes ....................... SKIPPED
[INFO] Eclipse SmartHome Binding Archetype ................ SKIPPED
[INFO] Eclipse SmartHome Binding Archetype Testsuite ...... SKIPPED
[INFO] Eclipse SmartHome Target Platform .................. SKIPPED
[INFO] Eclipse SmartHome Distribution ..................... SKIPPED
[INFO] ------------------------------------------------------------------------
[INFO] BUILD FAILURE
[INFO] ------------------------------------------------------------------------
[INFO] Total time: 02:39 min
[INFO] Finished at: 2019-08-29T12:10:42+02:00
[INFO] ------------------------------------------------------------------------
[ERROR] Failed to execute goal org.apache.karaf.tooling:karaf-maven-plugin:4.2.1:verify (verify-esh) on project verify: Verification failures: Verification failures:
[ERROR] Feature resolution failed for [esh.tp-lsp4j/0.11.0.SNAPSHOT]
[ERROR] Message: org.apache.karaf.features.internal.util.MultiException: Error:
[ERROR] Error downloading mvn:org.eclipse.orbit.bundles/com.google.gson/2.7.0.v20170129-0911
[ERROR] Repositories: {
[ERROR] mvn:org.apache.karaf.features/framework/4.2.1/xml/features
[ERROR] mvn:org.apache.karaf.features/standard/4.2.1/xml/features
[ERROR] mvn:org.eclipse.smarthome/esh-core/0.11.0-SNAPSHOT/xml/features
[ERROR] mvn:org.eclipse.smarthome/esh-ext/0.11.0-SNAPSHOT/xml/features
[ERROR] mvn:org.eclipse.smarthome/esh-tp/0.11.0-SNAPSHOT/xml/features
[ERROR] mvn:org.ops4j.pax.web/pax-web-features/7.2.3/xml/features
[ERROR] }
[ERROR] Resources: {
[ERROR] mvn:org.apache.felix/org.apache.felix.configadmin/1.9.4
[ERROR] mvn:org.apache.felix/org.apache.felix.coordinator/1.0.2
[ERROR] mvn:org.apache.felix/org.apache.felix.fileinstall/3.6.4
[ERROR] mvn:org.apache.karaf.features/org.apache.karaf.features.core/4.2.1
[ERROR] mvn:org.apache.karaf.features/org.apache.karaf.features.extension/4.2.1
[ERROR] mvn:org.apache.servicemix.bundles/org.apache.servicemix.bundles.jaxb-impl/2.2.11_1
[ERROR] mvn:org.apache.servicemix.specs/org.apache.servicemix.specs.activation-api-1.1/2.5.0
[ERROR] mvn:org.apache.servicemix.specs/org.apache.servicemix.specs.jaxb-api-2.2/2.5.0
[ERROR] mvn:org.eclipse.lsp4j/org.eclipse.lsp4j.jsonrpc/0.4.1
[ERROR] mvn:org.eclipse.lsp4j/org.eclipse.lsp4j/0.4.1
[ERROR] mvn:org.eclipse.orbit.bundles/com.google.gson/2.7.0.v20170129-0911
[ERROR] mvn:org.fusesource.jansi/jansi/1.17.1
[ERROR] mvn:org.ops4j.pax.logging/pax-logging-api/1.10.1
[ERROR] mvn:org.ops4j.pax.logging/pax-logging-log4j2/1.10.1
[ERROR] mvn:org.ops4j.pax.url/pax-url-aether/2.5.4
[ERROR] }
[ERROR] Feature resolution failed for [esh-model-lsp/0.11.0.SNAPSHOT]
[ERROR] Message: org.apache.karaf.features.internal.util.MultiException: Error:
[ERROR] Error downloading mvn:org.eclipse.orbit.bundles/com.google.gson/2.7.0.v20170129-0911
[ERROR] Repositories: {
[ERROR] mvn:org.apache.karaf.features/framework/4.2.1/xml/features
[ERROR] mvn:org.apache.karaf.features/standard/4.2.1/xml/features
[ERROR] mvn:org.eclipse.smarthome/esh-core/0.11.0-SNAPSHOT/xml/features
[ERROR] mvn:org.eclipse.smarthome/esh-ext/0.11.0-SNAPSHOT/xml/features
[ERROR] mvn:org.eclipse.smarthome/esh-tp/0.11.0-SNAPSHOT/xml/features
[ERROR] mvn:org.ops4j.pax.web/pax-web-features/7.2.3/xml/features
[ERROR] }
[ERROR] Resources: {
[ERROR] mvn:org.apache.felix/org.apache.felix.configadmin/1.9.4
[ERROR] mvn:org.apache.felix/org.apache.felix.coordinator/1.0.2
[ERROR] mvn:org.apache.felix/org.apache.felix.fileinstall/3.6.4
[ERROR] mvn:org.apache.karaf.features/org.apache.karaf.features.core/4.2.1
[ERROR] mvn:org.apache.karaf.features/org.apache.karaf.features.extension/4.2.1
[ERROR] mvn:org.apache.servicemix.bundles/org.apache.servicemix.bundles.jaxb-impl/2.2.11_1
[ERROR] mvn:org.apache.servicemix.specs/org.apache.servicemix.specs.activation-api-1.1/2.5.0
[ERROR] mvn:org.apache.servicemix.specs/org.apache.servicemix.specs.jaxb-api-2.2/2.5.0
[ERROR] mvn:org.eclipse.lsp4j/org.eclipse.lsp4j.jsonrpc/0.4.1
[ERROR] mvn:org.eclipse.lsp4j/org.eclipse.lsp4j/0.4.1
[ERROR] mvn:org.eclipse.orbit.bundles/com.google.gson/2.7.0.v20170129-0911
[ERROR] mvn:org.eclipse.smarthome.model/org.eclipse.smarthome.model.lsp/0.11.0-SNAPSHOT
[ERROR] mvn:org.eclipse.xtext/org.eclipse.xtext.ide/2.14.0
[ERROR] mvn:org.eclipse.xtext/org.eclipse.xtext.xbase.ide/2.14.0
[ERROR] mvn:org.fusesource.jansi/jansi/1.17.1
[ERROR] mvn:org.ops4j.pax.logging/pax-logging-api/1.10.1
[ERROR] mvn:org.ops4j.pax.logging/pax-logging-log4j2/1.10.1
[ERROR] mvn:org.ops4j.pax.url/pax-url-aether/2.5.4
[ERROR] }
Previous Topic:Project currently stalled - do not expect answers here!
Goto Forum:
  


Current Time: Thu Feb 20 13:42:27 GMT 2020

Powered by FUDForum. Page generated in 0.02048 seconds
.:: Contact :: Home ::.

Powered by: FUDforum 3.0.2.
Copyright ©2001-2010 FUDforum Bulletin Board Software

Back to the top