Skip to main content


Eclipse Community Forums
Forum Search:

Search      Help    Register    Login    Home
Home » Eclipse Projects » Eclipse SmartHome » Getting error while doing maven clean install(When i am doing maven clean install on windows i am getting this error)
Getting error while doing maven clean install [message #1780479] Tue, 23 January 2018 06:44 Go to next message
Paramesh  Surakod is currently offline Paramesh SurakodFriend
Messages: 6
Registered: January 2018
Junior Member
[ERROR] Failed to execute goal com.github.eirslett:frontend-maven-plugin:1.0:npm (npm install) on project org.eclipse.smarthome.ui.paper: Failed to run task: 'npm install' failed. (error code 1) -> [Help 1]

[ERROR] mvn <goals> -rf :org.eclipse.smarthome.ui.paper




can anyone help me out in this.
Re: Getting error while doing maven clean install [message #1780490 is a reply to message #1780479] Tue, 23 January 2018 10:10 Go to previous messageGo to next message
Paramesh  Surakod is currently offline Paramesh SurakodFriend
Messages: 6
Registered: January 2018
Junior Member
I have done the changes in package.json in paper ui as per the same issue shared in this link : https://github.com/eclipse/smarthome/issues/2384
please help me out on this.
Re: Getting error while doing maven clean install [message #1780504 is a reply to message #1780490] Tue, 23 January 2018 13:55 Go to previous messageGo to next message
Stefan Triller is currently offline Stefan TrillerFriend
Messages: 22
Registered: April 2017
Junior Member
Hello Paramesh,

do you have a more detailed error message? A plain "npm failed" is not really useful to help you there.

Edit: On which operating system are you? There are some open issues on windows still...

Regards,

Stefan

[Updated on: Tue, 23 January 2018 13:56]

Report message to a moderator

Re: Getting error while doing maven clean install [message #1780507 is a reply to message #1780504] Tue, 23 January 2018 14:21 Go to previous messageGo to next message
Paramesh  Surakod is currently offline Paramesh SurakodFriend
Messages: 6
Registered: January 2018
Junior Member
Thanks for the reply Stefan,
here is the full error i am getting
[INFO] Eclipse SmartHome Karaf Feature Verification ....... SKIPPED
[INFO] Eclipse SmartHome Products ......................... SKIPPED
[INFO] Eclipse SmartHome p2 Repository .................... SKIPPED
[INFO] Eclipse SmartHome Tools ............................ SKIPPED
[INFO] Eclipse SmartHome Archetypes ....................... SKIPPED
[INFO] Eclipse Smarthome Binding Archetype ................ SKIPPED
[INFO] Eclipse Smarthome Binding Archetype Testsuite ...... SKIPPED
[INFO] Eclipse SmartHome Target Platform .................. SKIPPED
[INFO] Eclipse SmartHome Distribution ..................... SKIPPED
[INFO] ------------------------------------------------------------------------
[INFO] BUILD FAILURE
[INFO] ------------------------------------------------------------------------
[INFO] Total time: 01:30 h
[INFO] Finished at: 2018-01-22T13:29:24+05:30
[INFO] Final Memory: 413M/953M
[INFO] ------------------------------------------------------------------------
[ERROR] Failed to execute goal com.github.eirslett:frontend-maven-plugin:1.0:npm (npm install) on project org.eclipse.smarthome.ui.paper: Failed to run task: 'npm install' failed. (error code 1) -> [Help 1]
[ERROR]
[ERROR] To see the full stack trace of the errors, re-run Maven with the -e switch.
[ERROR] Re-run Maven using the -X switch to enable full debug logging.
[ERROR]
[ERROR] For more information about the errors and possible solutions, please read the following articles:
[ERROR] [Help 1] http://cwiki.apache.org/confluence/display/MAVEN/MojoFailureException
[ERROR]
[ERROR] After correcting the problems, you can resume the build with the command
[ERROR] mvn <goals> -rf :org.eclipse.smarthome.ui.paper


ya am using windows(10), is there any fix for this
Re: Getting error while doing maven clean install [message #1780508 is a reply to message #1780507] Tue, 23 January 2018 14:37 Go to previous messageGo to next message
Simon Kaufmann is currently offline Simon KaufmannFriend
Messages: 51
Registered: January 2011
Member
There must be something more details above, where the npm stuff actually ran (or at least tried to...). This summary at the end of the overall build unfortunately doesn't contain anything helpful.
Re: Getting error while doing maven clean install [message #1780583 is a reply to message #1780508] Wed, 24 January 2018 05:47 Go to previous messageGo to next message
Paramesh  Surakod is currently offline Paramesh SurakodFriend
Messages: 6
Registered: January 2018
Junior Member
Thank you for the reply sir

Here is the complete error message which I got.....

[INFO] Source directory: C:\Users\Asus_Fueb1\smarthome-master\git\smarthome\extensions\ui\org.eclipse.smarthome.ui.paper\src\main\groovy added.
[INFO]
[INFO] --- frontend-maven-plugin:1.0:install-node-and-npm (Install node and npm) @ org.eclipse.smarthome.ui.paper ---
[INFO] Node v8.1.2 is already installed.
[INFO] NPM 5.0.3 is already installed.
[INFO]
[INFO] --- frontend-maven-plugin:1.0:npm (npm install) @ org.eclipse.smarthome.ui.paper ---
[INFO] Running 'npm install' in C:\Users\Asus_Fueb1\smarthome-master\git\smarthome\extensions\ui\org.eclipse.smarthome.ui.paper
[WARNING] npm WARN deprecated gulp-util@3.0.8: gulp-util is deprecated - replace it, following the guidelines at https://medium.com/gulpjs/gulp-util-ca3b1f9f9ac5
[WARNING] npm WARN deprecated gulp-util@2.2.20: gulp-util is deprecated - replace it, following the guidelines at https://medium.com/gulpjs/gulp-util-ca3b1f9f9ac5
[WARNING] npm WARN deprecated minimatch@2.0.10: Please update to minimatch 3.0.2 or higher to avoid a RegExp DoS issue
[WARNING] npm WARN deprecated graceful-fs@3.0.11: please upgrade to graceful-fs 4 for compatibility with current and future versions of Node.js
[WARNING] npm WARN deprecated express@2.5.11: express 2.x series is deprecated
[WARNING] npm WARN deprecated connect@1.9.2: connect 1.x series is deprecated
[WARNING] npm WARN deprecated coffee-script@1.12.7: CoffeeScript on NPM has moved to "coffeescript" (no hyphen)
[WARNING] npm WARN deprecated node-uuid@1.4.8: Use uuid module instead
[WARNING] npm WARN deprecated minimatch@0.2.14: Please update to minimatch 3.0.2 or higher to avoid a RegExp DoS issue
[WARNING] npm WARN deprecated graceful-fs@1.2.3: please upgrade to graceful-fs 4 for compatibility with current and future versions of Node.js
[ERROR] npm ERR! code EINTEGRITY
[ERROR] npm ERR! sha1-qced3wuE72sv5IoNEVe0JWioH1o= integrity checksum failed when using sha1: wanted sha1-qced3wuE72sv5IoNEVe0JWioH1o= but got sha1-kJI+ZF8CdIvABaRkInpGAZPLGJs=. (2046229 bytes)
[ERROR]
[ERROR] npm ERR! A complete log of this run can be found in:
[ERROR] npm ERR! C:\Users\Asus_Fueb1\smarthome-master\git\smarthome\extensions\ui\org.eclipse.smarthome.ui.paper\npm_cache\_logs\2018-01-24T05_35_47_543Z-debug.log
[INFO] ------------------------------------------------------------------------
[INFO] Reactor Summary:
[INFO]
[INFO] Eclipse SmartHome .................................. SUCCESS [ 4.624 s]
[INFO] Eclipse SmartHome Bundles .......................... SUCCESS [ 1.855 s]
[INFO] Eclipse SmartHome Test Components .................. SUCCESS [ 0.078 s]
[INFO] Eclipse SmartHome Core Components .................. SUCCESS [ 0.095 s]
[INFO] Eclipse SmartHome Core ............................. SUCCESS [02:20 min]
[INFO] Eclipse SmartHome Configurations ................... SUCCESS [ 0.109 s]
[INFO] Eclipse SmartHome Configuration Core ............... SUCCESS [ 16.973 s]
[INFO] Eclipse SmartHome Configuration XML ................ SUCCESS [ 13.858 s]
[INFO] Eclipse SmartHome AutoUpdate Binding ............... SUCCESS [ 8.840 s]
[INFO] Eclipse SmartHome Test ............................. SUCCESS [ 24.239 s]
[INFO] Eclipse SmartHome I/O Components ................... SUCCESS [ 0.187 s]
[INFO] Eclipse SmartHome Console .......................... SUCCESS [ 13.701 s]
[INFO] Eclipse SmartHome Thing ............................ SUCCESS [ 33.195 s]
[INFO] Magic Bundle ....................................... SUCCESS [ 11.774 s]
[INFO] Magic Bundle Tests ................................. SUCCESS [ 18.971 s]
[INFO] Eclipse SmartHome Auth Components .................. SUCCESS [ 0.217 s]
[INFO] Eclipse SmartHome JAAS Authentication .............. SUCCESS [ 7.336 s]
[INFO] Eclipse SmartHome Configuration Dispatcher ......... SUCCESS [ 9.121 s]
[INFO] Eclipse SmartHome Configuration Dispatcher Tests ... SUCCESS [ 42.027 s]
[INFO] Eclipse SmartHome Configuration Core Tests ......... SUCCESS [ 24.768 s]
[INFO] Eclipse SmartHome Configuration Discovery .......... SUCCESS [ 19.976 s]
[INFO] Eclipse SmartHome mDNS Service ..................... SUCCESS [ 9.790 s]
[INFO] Eclipse SmartHome Configuration mDNS Discovery ..... SUCCESS [ 7.993 s]
[INFO] Eclipse SmartHome Core Thing XML ................... SUCCESS [ 13.758 s]
[INFO] Eclipse SmartHome Configuration Discovery Tests .... SUCCESS [ 42.440 s]
[INFO] Eclipse SmartHome Configuration UPnP Discovery ..... SUCCESS [ 12.918 s]
[INFO] Eclipse SmartHome Configuration Serial ............. SUCCESS [ 9.590 s]
[INFO] Eclipse SmartHome Config XML Tests ................. SUCCESS [ 18.856 s]
[INFO] Eclipse SmartHome Core Audio ....................... SUCCESS [ 11.544 s]
[INFO] Eclipse SmartHome Core Binding XML ................. SUCCESS [ 10.076 s]
[INFO] Eclipse Smarthome Audio Test ....................... SUCCESS [ 34.498 s]
[INFO] Eclipse SmartHome Sample Extension Service ......... SUCCESS [ 7.673 s]
[INFO] Eclipse SmartHome REST Interface ................... SUCCESS [ 15.507 s]
[INFO] Eclipse SmartHome Core ID .......................... SUCCESS [ 9.177 s]
[INFO] Eclipse SmartHome ID Tests ......................... SUCCESS [ 20.684 s]
[INFO] Eclipse SmartHome Core Tests ....................... SUCCESS [01:45 min]
[INFO] Eclipse SmartHome Thing Tests ...................... SUCCESS [02:16 min]
[INFO] Eclipse SmartHome Core Persistence ................. SUCCESS [ 17.338 s]
[INFO] Eclipse SmartHome Core Scheduler Service ........... SUCCESS [ 7.835 s]
[INFO] Eclipse SmartHome Core Transformation Service ...... SUCCESS [ 9.549 s]
[INFO] Eclipse SmartHome Core Binding XML Tests ........... SUCCESS [ 22.312 s]
[INFO] Eclipse SmartHome Core Thing XML Tests ............. SUCCESS [ 29.065 s]
[INFO] Eclipse SmartHome Core Voice ....................... SUCCESS [ 21.183 s]
[INFO] Eclipse SmartHome Core Voice Test .................. SUCCESS [ 23.384 s]
[INFO] Eclipse SmartHome Automation ....................... SUCCESS [ 0.428 s]
[INFO] Eclipse SmartHome Automation API ................... SUCCESS [ 19.301 s]
[INFO] Eclipse SmartHome Automation Commands .............. SUCCESS [ 13.368 s]
[INFO] Eclipse SmartHome Automation Parser GSON ........... SUCCESS [ 10.218 s]
[INFO] Eclipse SmartHome Automation Providers ............. SUCCESS [ 17.703 s]
[INFO] Eclipse SmartHome Automation Provider File ......... SUCCESS [ 9.964 s]
[INFO] Eclipse SmartHome Automation Core .................. SUCCESS [ 16.059 s]
[INFO] Eclipse SmartHome Automation Core Tests ............ SUCCESS [ 20.301 s]
[INFO] Eclipse SmartHome Automation Sample JSON ........... SUCCESS [ 11.024 s]
[INFO] Eclipse SmartHome Automation Core Modules .......... SUCCESS [ 14.867 s]
[INFO] Eclipse SmartHome Automation Core Module Tests ..... SUCCESS [ 22.041 s]
[INFO] Eclipse SmartHome Automation Script Modules ........ SUCCESS [ 12.159 s]
[INFO] Eclipse SmartHome Automation Media Modules ......... SUCCESS [ 10.162 s]
[INFO] Eclipse SmartHome Automation Timer Modules ......... SUCCESS [ 13.016 s]
[INFO] Eclipse SmartHome Automation Module Timer Tests .... SUCCESS [ 26.034 s]
[INFO] Eclipse SmartHome Automation Script Default Scope .. SUCCESS [ 9.690 s]
[INFO] Eclipse SmartHome Automation Script RuleSupport .... SUCCESS [ 10.963 s]
[INFO] Eclipse SmartHome Automation Script Module Tests ... SUCCESS [ 19.610 s]
[INFO] Eclipse SmartHome Automation Event Tests ........... SUCCESS [ 17.564 s]
[INFO] Eclipse SmartHome Automation Integration Tests ..... SUCCESS [ 45.056 s]
[INFO] Eclipse SmartHome Automation Sample Extension Java . SUCCESS [ 12.933 s]
[INFO] Eclipse SmartHome Automation REST API .............. SUCCESS [ 13.869 s]
[INFO] Eclipse SmartHome Automation Sample REST API ....... SUCCESS [ 9.177 s]
[INFO] Eclipse SmartHome Automation Java Demo ............. SUCCESS [ 6.498 s]
[INFO] Eclipse SmartHome Automation Json Demo ............. SUCCESS [ 9.447 s]
[INFO] Eclipse SmartHome Automation Module Type Demo ...... SUCCESS [ 12.015 s]
[INFO] Eclipse SmartHome Console for OSGi framework Eclipse Equinox SUCCESS [ 9.798 s]
[INFO] Eclipse SmartHome Console for OSGi Console RFC 147 . SUCCESS [ 10.686 s]
[INFO] Eclipse SmartHome Console for OSGi runtime Karaf ... SUCCESS [ 11.728 s]
[INFO] Eclipse SmartHome Monitor .......................... SUCCESS [ 7.578 s]
[INFO] Eclipse SmartHome Network I/O ...................... SUCCESS [ 15.276 s]
[INFO] Eclipse SmartHome Network I/O Tests ................ SUCCESS [ 18.345 s]
[INFO] Eclipse SmartHome IO REST Tests .................... SUCCESS [ 21.166 s]
[INFO] Eclipse SmartHome Authentication Support for the REST Interface SUCCESS [ 7.338 s]
[INFO] Eclipse SmartHome Basic Auth for the REST Interface SUCCESS [ 9.130 s]
[INFO] Eclipse SmartHome Core REST Interface .............. SUCCESS [ 22.707 s]
[INFO] Eclipse SmartHome IO REST Core Tests ............... SUCCESS [ 25.548 s]
[INFO] Eclipse SmartHome REST mDNS Announcer .............. SUCCESS [ 17.773 s]
[INFO] Eclipse SmartHome REST JAX-RS Optimizations ........ SUCCESS [ 9.087 s]
[INFO] Eclipse SmartHome SSE Interface .................... SUCCESS [ 15.621 s]
[INFO] Eclipse SmartHome IO SSE Tests ..................... SUCCESS [ 20.510 s]
[INFO] Eclipse SmartHome Models ........................... SUCCESS [ 23.708 s]
[INFO] Eclipse SmartHome Model Core ....................... SUCCESS [ 21.355 s]
[INFO] Eclipse SmartHome Model Lazy Generation ............ SUCCESS [ 15.049 s]
[INFO] Eclipse SmartHome Model Sitemap .................... SUCCESS [01:32 min]
[INFO] Eclipse SmartHome Model Items ...................... SUCCESS [ 41.356 s]
[INFO] Eclipse SmartHome UIs .............................. SUCCESS [ 0.131 s]
[INFO] Eclipse SmartHome UI ............................... SUCCESS [ 22.679 s]
[INFO] Eclipse SmartHome Sitemap REST Interface ........... SUCCESS [ 21.268 s]
[INFO] Eclipse SmartHome Core REST UI Logging Module ...... SUCCESS [ 15.764 s]
[INFO] Eclipse SmartHome Voice REST Interface ............. SUCCESS [ 12.032 s]
[INFO] Eclipse SmartHome DBus Transport ................... SUCCESS [ 4.431 s]
[INFO] Eclipse SmartHome MQTT Transport ................... SUCCESS [ 15.686 s]
[INFO] Eclipse SmartHome Mqtt Transport I/O Tests ......... SUCCESS [ 26.527 s]
[INFO] Eclipse SmartHome UPnP Transport ................... SUCCESS [ 14.137 s]
[INFO] Eclipse SmartHome IO UPnP Tests .................... SUCCESS [ 26.305 s]
[INFO] Eclipse SmartHome Model Core Tests ................. SUCCESS [ 26.263 s]
[INFO] Eclipse SmartHome Model Item IDE ................... SUCCESS [ 27.592 s]
[INFO] Eclipse SmartHome Model Items Runtime .............. SUCCESS [ 9.268 s]
[INFO] Eclipse SmartHome Items Model Tests ................ SUCCESS [ 35.715 s]
[INFO] Eclipse SmartHome Model Persistence ................ SUCCESS [ 59.060 s]
[INFO] Eclipse SmartHome Model Persistence IDE ............ SUCCESS [ 18.854 s]
[INFO] Eclipse SmartHome Model Script ..................... SUCCESS [01:07 min]
[INFO] Eclipse SmartHome Model Rules ...................... SUCCESS [01:21 min]
[INFO] Eclipse SmartHome Model Rule IDE ................... SUCCESS [ 40.655 s]
[INFO] Eclipse SmartHome Model Script IDE ................. SUCCESS [ 36.780 s]
[INFO] Eclipse SmartHome Model Sitemap IDE ................ SUCCESS [ 47.621 s]
[INFO] Eclipse SmartHome Thing Model ...................... SUCCESS [ 51.840 s]
[INFO] Eclipse SmartHome Model Thing IDE .................. SUCCESS [ 21.114 s]
[INFO] Eclipse SmartHome Language Server .................. SUCCESS [ 16.348 s]
[INFO] Eclipse SmartHome Language Server Tests ............ SUCCESS [ 28.974 s]
[INFO] Eclipse SmartHome Model Persistence Runtime ........ SUCCESS [ 9.910 s]
[INFO] Eclipse SmartHome Model Persistence Tests .......... SUCCESS [ 25.614 s]
[INFO] Eclipse SmartHome Model Rules Runtime .............. SUCCESS [ 23.631 s]
[INFO] Eclipse SmartHome Model Rules Tests ................ SUCCESS [ 15.596 s]
[INFO] Eclipse SmartHome Model Script Runtime ............. SUCCESS [ 22.825 s]
[INFO] Eclipse SmartHome Model Script Tests ............... SUCCESS [ 44.397 s]
[INFO] Eclipse SmartHome Model Sitemap Runtime ............ SUCCESS [ 11.875 s]
[INFO] Eclipse SmartHome Thing Model Runtime .............. SUCCESS [ 8.641 s]
[INFO] Eclipse SmartHome Thing Model Tests ................ SUCCESS [ 55.777 s]
[INFO] Eclipse SmartHome UI Tests ......................... SUCCESS [ 33.383 s]
[INFO] Eclipse SmartHome UI Icon Support .................. SUCCESS [ 28.286 s]
[INFO] Eclipse SmartHome UI Icon Tests .................... SUCCESS [ 31.994 s]
[INFO] Eclipse SmartHome Storages ......................... SUCCESS [ 0.172 s]
[INFO] Eclipse SmartHome JSON Storage ..................... SUCCESS [ 36.510 s]
[INFO] Eclipse SmartHome Storage JSON Tests ............... SUCCESS [ 27.070 s]
[INFO] Eclipse SmartHome MapDB Storage .................... SUCCESS [ 14.274 s]
[INFO] Eclipse SmartHome Storage MapDB Tests .............. SUCCESS [ 25.942 s]
[INFO] Eclipse SmartHome Extensions ....................... SUCCESS [ 0.480 s]
[INFO] Eclipse SmartHome Bindings ......................... SUCCESS [ 0.193 s]
[INFO] Eclipse SmartHome Astro Binding .................... SUCCESS [ 31.547 s]
[INFO] Eclipse SmartHome Astro Binding Tests .............. SUCCESS [ 24.023 s]
[INFO] Eclipse SmartHome DigitalSTROM Binding ............. SUCCESS [ 45.179 s]
[INFO] Eclipse Smarthome DMX Binding ...................... SUCCESS [ 19.677 s]
[INFO] Eclipse Smarthome DMX Binding Tests ................ SUCCESS [ 29.074 s]
[INFO] Eclipse SmartHome hue Binding ...................... SUCCESS [ 25.614 s]
[INFO] Eclipse SmartHome hue Binding Tests ................ SUCCESS [01:46 min]
[INFO] Eclipse SmartHome FSInternetRadio Binding .......... SUCCESS [ 17.183 s]
[INFO] Eclipse Smarthome FSInternetRadio Binding Test ..... SUCCESS [ 28.559 s]
[INFO] Eclipse SmartHome LIFX Binding ..................... SUCCESS [ 29.928 s]
[INFO] Eclipse SmartHome LIRC Binding ..................... SUCCESS [ 16.055 s]
[INFO] Eclipse SmartHome NTP Binding ...................... SUCCESS [ 15.566 s]
[INFO] Eclipse SmartHome NTP Binding Tests ................ SUCCESS [ 33.444 s]
[INFO] SerialButton Binding ............................... SUCCESS [ 17.123 s]
[INFO] Eclipse SmartHome Sonos Binding .................... SUCCESS [ 30.492 s]
[INFO] TRÅDFRI Binding .................................... SUCCESS [ 19.706 s]
[INFO] TRÅDFRI Binding Tests .............................. SUCCESS [ 22.062 s]
[INFO] WeatherUnderground Binding ......................... SUCCESS [ 18.158 s]
[INFO] Eclipse SmartHome WeMo Binding ..................... SUCCESS [ 19.721 s]
[INFO] Eclipse SmartHome Wemo Binding Tests ............... SUCCESS [03:40 min]
[INFO] Eclipse SmartHome YahooWeather Binding ............. SUCCESS [ 14.154 s]
[INFO] Eclipse SmartHome Extension Service Extensions ..... SUCCESS [ 0.182 s]
[INFO] Eclipse SmartHome IoT Marketplace Extension Service SUCCESS [ 14.553 s]
[INFO] Eclipse SmartHome IoT Marketplace Extension Automation Support SUCCESS [ 14.029 s]
[INFO] Eclipse SmartHome IoT Marketplace Extension Service Test SUCCESS [ 16.014 s]
[INFO] Eclipse SmartHome I/O Services ..................... SUCCESS [ 0.279 s]
[INFO] Eclipse SmartHome JavaSound I/O .................... SUCCESS [ 13.566 s]
[INFO] Eclipse SmartHome Web Audio Support ................ SUCCESS [01:02 min]
[INFO] Eclipse SmartHome Transformation Services .......... SUCCESS [ 0.194 s]
[INFO] Eclipse SmartHome Exec Transformation Service ...... SUCCESS [ 9.262 s]
[INFO] Eclipse SmartHome Javascript Transformation Service SUCCESS [ 12.187 s]
[INFO] Eclipse SmartHome Map Transformation Service ....... SUCCESS [ 13.244 s]
[INFO] Eclipse SmartHome Map Transformation Service Tests . SUCCESS [ 17.355 s]
[INFO] Eclipse SmartHome Scale Transformation Service ..... SUCCESS [ 11.712 s]
[INFO] Eclipse SmartHome Scale Transformation Service Tests SUCCESS [ 14.692 s]
[INFO] Eclipse SmartHome RegEx Transformation Service ..... SUCCESS [ 11.188 s]
[INFO] Eclipse SmartHome RegEx Transformation Service Tests SUCCESS [ 13.057 s]
[INFO] Eclipse SmartHome XPath Transformation Service ..... SUCCESS [ 12.884 s]
[INFO] Eclipse SmartHome XPath Transformation Service Tests SUCCESS [ 14.533 s]
[INFO] Eclipse SmartHome JSonPath Transformation Service .. SUCCESS [ 10.245 s]
[INFO] Eclipse SmartHome JSonPath Transformation Service Tests SUCCESS [ 16.115 s]
[INFO] Eclipse SmartHome Xslt Transformation Service ...... SUCCESS [ 9.518 s]
[INFO] Eclipse SmartHome Xslt Transformation Service Tests SUCCESS [ 16.755 s]
[INFO] Eclipse SmartHome UI Extensions .................... SUCCESS [ 0.222 s]
[INFO] Eclipse SmartHome Icon Sets ........................ SUCCESS [ 0.095 s]
[INFO] Eclipse SmartHome Classic Icon Set ................. SUCCESS [ 26.494 s]
[INFO] Eclipse SmartHome Basic UI ......................... SUCCESS [02:30 min]
[INFO] Eclipse SmartHome Classic UI ....................... SUCCESS [ 46.576 s]
[INFO] Eclipse SmartHome Paper UI ......................... FAILURE [09:36 min]
[INFO] Eclipse SmartHome Voice Services ................... SKIPPED
[INFO] Eclipse SmartHome MacOS TTS ........................ SKIPPED
[INFO] Eclipse SmartHome Mac TTS Tests .................... SKIPPED
[INFO] Eclipse SmartHome Features ......................... SKIPPED
[INFO] Eclipse SmartHome Runtime Core Feature ............. SKIPPED
[INFO] Eclipse SmartHome Runtime Model Feature ............ SKIPPED
[INFO] Eclipse SmartHome Runtime UI Feature ............... SKIPPED
[INFO] Eclipse SmartHome Runtime REST Feature ............. SKIPPED
[INFO] Eclipse SmartHome Runtime Automation Feature ....... SKIPPED
[INFO] Eclipse SmartHome Runtime Equinox Console Feature .. SKIPPED
[INFO] Eclipse SmartHome Runtime RfC147 Console Feature ... SKIPPED
[INFO] Eclipse SmartHome Runtime Binding Feature .......... SKIPPED
[INFO] Eclipse SmartHome Test Dependencies ................ SKIPPED
[INFO] Eclipse SmartHome Karaf Features ................... SKIPPED
[INFO] Eclipse SmartHome Target Platform Feature .......... SKIPPED
[INFO] Eclipse SmartHome Core Feature ..................... SKIPPED
[INFO] Eclipse SmartHome Extensions Feature ............... SKIPPED
[INFO] Eclipse SmartHome Karaf Feature Verification ....... SKIPPED
[INFO] Eclipse SmartHome Products ......................... SKIPPED
[INFO] Eclipse SmartHome p2 Repository .................... SKIPPED
[INFO] Eclipse SmartHome Tools ............................ SKIPPED
[INFO] Eclipse SmartHome Archetypes ....................... SKIPPED
[INFO] Eclipse Smarthome Binding Archetype ................ SKIPPED
[INFO] Eclipse Smarthome Binding Archetype Testsuite ...... SKIPPED
[INFO] Eclipse SmartHome Target Platform .................. SKIPPED
[INFO] Eclipse SmartHome Distribution ..................... SKIPPED
[INFO] ------------------------------------------------------------------------
[INFO] BUILD FAILURE
[INFO] ------------------------------------------------------------------------
[INFO] Total time: 01:23 h
[INFO] Finished at: 2018-01-24T11:05:50+05:30
[INFO] Final Memory: 387M/936M
[INFO] ------------------------------------------------------------------------
[ERROR] Failed to execute goal com.github.eirslett:frontend-maven-plugin:1.0:npm (npm install) on project org.eclipse.smarthome.ui.paper: Failed to run task: 'npm install' failed. (error code 1) -> [Help 1]
[ERROR]
[ERROR] To see the full stack trace of the errors, re-run Maven with the -e switch.
[ERROR] Re-run Maven using the -X switch to enable full debug logging.
[ERROR]
[ERROR] For more information about the errors and possible solutions, please read the following articles:
[ERROR] [Help 1] http://cwiki.apache.org/confluence/display/MAVEN/MojoFailureException
[ERROR]
[ERROR] After correcting the problems, you can resume the build with the command
[ERROR] mvn <goals> -rf :org.eclipse.smarthome.ui.paper
Re: Getting error while doing maven clean install [message #1780601 is a reply to message #1780583] Wed, 24 January 2018 12:49 Go to previous messageGo to next message
Simon Kaufmann is currently offline Simon KaufmannFriend
Messages: 51
Registered: January 2011
Member
The NPM maintains a local cache of all the JavaScript dependencies it downloads - looks like something got broken there. This is all temporary stuff, so you can simply delete it, it will be downloaded next time again. You can either do it manually (delete all the node* and npm* folders in the Paper UI folder), or let git to the job for you:

git clean -dfx extensions/ui/org.eclipse.smarthome.ui.paper


HTH
Re: Getting error while doing maven clean install [message #1780635 is a reply to message #1780601] Thu, 25 January 2018 06:56 Go to previous message
Paramesh  Surakod is currently offline Paramesh SurakodFriend
Messages: 6
Registered: January 2018
Junior Member
Thank you for the reply sir,

ya i did both options, i deleted manually and also executed command that u have provided above but with both case i am getting the same error

[INFO] --- frontend-maven-plugin:1.0:install-node-and-npm (Install node and npm) @ org.eclipse.smarthome.ui.paper ---
[INFO] Installing node version v8.1.2
[INFO] Copying node binary from C:\Users\Asus_Fueb1\.m2\repository\com\github\eirslett\node\8.1.2\node-8.1.2-windows-x64.exe to C:\Users\Asus_Fueb1\smarthome-master\git\smarthome\extensions\ui\org.eclipse.smarthome.ui.paper\node\node.exe
[INFO] Installed node locally.
[INFO] Installing npm version 5.0.3
[INFO] Unpacking C:\Users\Asus_Fueb1\.m2\repository\com\github\eirslett\npm\5.0.3\npm-5.0.3.tar.gz into C:\Users\Asus_Fueb1\smarthome-master\git\smarthome\extensions\ui\org.eclipse.smarthome.ui.paper\node\node_modules
[INFO] Installed npm locally.
[INFO]
[INFO] --- frontend-maven-plugin:1.0:npm (npm install) @ org.eclipse.smarthome.ui.paper ---
[INFO] Running 'npm install' in C:\Users\Asus_Fueb1\smarthome-master\git\smarthome\extensions\ui\org.eclipse.smarthome.ui.paper
[WARNING] npm WARN deprecated gulp-util@3.0.8: gulp-util is deprecated - replace it, following the guidelines at https://medium.com/gulpjs/gulp-util-ca3b1f9f9ac5
[WARNING] npm WARN deprecated gulp-util@2.2.20: gulp-util is deprecated - replace it, following the guidelines at https://medium.com/gulpjs/gulp-util-ca3b1f9f9ac5
[WARNING] npm WARN deprecated graceful-fs@3.0.11: please upgrade to graceful-fs 4 for compatibility with current and future versions of Node.js
[WARNING] npm WARN deprecated minimatch@2.0.10: Please update to minimatch 3.0.2 or higher to avoid a RegExp DoS issue
[WARNING] npm WARN deprecated express@2.5.11: express 2.x series is deprecated
[WARNING] npm WARN deprecated coffee-script@1.12.7: CoffeeScript on NPM has moved to "coffeescript" (no hyphen)
[WARNING] npm WARN deprecated connect@1.9.2: connect 1.x series is deprecated
[WARNING] npm WARN deprecated node-uuid@1.4.8: Use uuid module instead
[WARNING] npm WARN deprecated minimatch@0.2.14: Please update to minimatch 3.0.2 or higher to avoid a RegExp DoS issue
[WARNING] npm WARN deprecated graceful-fs@1.2.3: please upgrade to graceful-fs 4 for compatibility with current and future versions of Node.js
[WARNING] npm WARN optional SKIPPING OPTIONAL DEPENDENCY: repeat-string@0.2.2 (node_modules\expand-braces\node_modules\repeat-string):
[WARNING] npm WARN enoent SKIPPING OPTIONAL DEPENDENCY: ENOENT: no such file or directory, utime 'C:\Users\Asus_Fueb1\smarthome-master\git\smarthome\extensions\ui\org.eclipse.smarthome.ui.paper\node_modules\.staging\repeat-string-942d116d\.npmignore'
[WARNING] npm WARN optional SKIPPING OPTIONAL DEPENDENCY: expand-range@0.1.1 (node_modules\expand-braces\node_modules\expand-range):
[WARNING] npm WARN enoent SKIPPING OPTIONAL DEPENDENCY: ENOENT: no such file or directory, utime 'C:\Users\Asus_Fueb1\smarthome-master\git\smarthome\extensions\ui\org.eclipse.smarthome.ui.paper\node_modules\.staging\expand-range-ffad84bf\.npmignore'
[WARNING] npm WARN optional SKIPPING OPTIONAL DEPENDENCY: braces@0.1.5 (node_modules\expand-braces\node_modules\braces):
[WARNING] npm WARN enoent SKIPPING OPTIONAL DEPENDENCY: ENOENT: no such file or directory, utime 'C:\Users\Asus_Fueb1\smarthome-master\git\smarthome\extensions\ui\org.eclipse.smarthome.ui.paper\node_modules\.staging\braces-315cfdc8\.npmignore'
[WARNING] npm WARN optional SKIPPING OPTIONAL DEPENDENCY: is-number@0.1.1 (node_modules\expand-braces\node_modules\is-number):
[WARNING] npm WARN enoent SKIPPING OPTIONAL DEPENDENCY: ENOENT: no such file or directory, utime 'C:\Users\Asus_Fueb1\smarthome-master\git\smarthome\extensions\ui\org.eclipse.smarthome.ui.paper\node_modules\.staging\is-number-c3efc22c\.npmignore'
[WARNING] npm WARN optional SKIPPING OPTIONAL DEPENDENCY: eventie@1.0.6 (node_modules\eventie):
[WARNING] npm WARN enoent SKIPPING OPTIONAL DEPENDENCY: ENOENT: no such file or directory, utime 'C:\Users\Asus_Fueb1\smarthome-master\git\smarthome\extensions\ui\org.eclipse.smarthome.ui.paper\node_modules\.staging\eventie-0a3d9066\README.md'
[WARNING] npm WARN optional SKIPPING OPTIONAL DEPENDENCY: lodash@4.17.4 (node_modules\lodash):
[WARNING] npm WARN enoent SKIPPING OPTIONAL DEPENDENCY: ENOENT: no such file or directory, open 'C:\Users\Asus_Fueb1\smarthome-master\git\smarthome\extensions\ui\org.eclipse.smarthome.ui.paper\node_modules\.staging\lodash-be2752ff\deburr.js'
[WARNING] npm WARN optional SKIPPING OPTIONAL DEPENDENCY: async@2.4.1 (node_modules\async):
[WARNING] npm WARN optional SKIPPING OPTIONAL DEPENDENCY: EEXIST: file already exists, mkdir 'C:\Users\Asus_Fueb1\smarthome-master\git\smarthome\extensions\ui\org.eclipse.smarthome.ui.paper\node_modules\.staging\async-952b1f5b'
[WARNING] npm WARN optional SKIPPING OPTIONAL DEPENDENCY: File exists: C:\Users\Asus_Fueb1\smarthome-master\git\smarthome\extensions\ui\org.eclipse.smarthome.ui.paper\node_modules\.staging\async-952b1f5b
[WARNING] npm WARN optional SKIPPING OPTIONAL DEPENDENCY: event-emitter@0.3.5 (node_modules\event-emitter):
[WARNING] npm WARN enoent SKIPPING OPTIONAL DEPENDENCY: ENOENT: no such file or directory, open 'C:\Users\Asus_Fueb1\smarthome-master\git\smarthome\extensions\ui\org.eclipse.smarthome.ui.paper\node_modules\.staging\event-emitter-21325be0\.npmignore'
[WARNING] npm WARN optional SKIPPING OPTIONAL DEPENDENCY: browser-sync-client@2.5.1 (node_modules\browser-sync-client):
[WARNING] npm WARN enoent SKIPPING OPTIONAL DEPENDENCY: ENOENT: no such file or directory, open 'C:\Users\Asus_Fueb1\smarthome-master\git\smarthome\extensions\ui\org.eclipse.smarthome.ui.paper\node_modules\.staging\browser-sync-client-364b1e69\README.md'
[WARNING] npm WARN optional SKIPPING OPTIONAL DEPENDENCY: extsprintf@1.3.0 (node_modules\extsprintf):
[WARNING] npm WARN optional SKIPPING OPTIONAL DEPENDENCY: EEXIST: file already exists, mkdir 'C:\Users\Asus_Fueb1\smarthome-master\git\smarthome\extensions\ui\org.eclipse.smarthome.ui.paper\node_modules\.staging\extsprintf-60a71111'
[WARNING] npm WARN optional SKIPPING OPTIONAL DEPENDENCY: File exists: C:\Users\Asus_Fueb1\smarthome-master\git\smarthome\extensions\ui\org.eclipse.smarthome.ui.paper\node_modules\.staging\extsprintf-60a71111
[WARNING] npm WARN optional SKIPPING OPTIONAL DEPENDENCY: mime@1.2.4 (node_modules\express\node_modules\mime):
[WARNING] npm WARN enoent SKIPPING OPTIONAL DEPENDENCY: ENOENT: no such file or directory, utime 'C:\Users\Asus_Fueb1\smarthome-master\git\smarthome\extensions\ui\org.eclipse.smarthome.ui.paper\node_modules\.staging\mime-945aa4cd\LICENSE'
[WARNING] npm WARN optional SKIPPING OPTIONAL DEPENDENCY: connect@1.9.2 (node_modules\express\node_modules\connect):
[WARNING] npm WARN enoent SKIPPING OPTIONAL DEPENDENCY: ENOENT: no such file or directory, open 'C:\Users\Asus_Fueb1\smarthome-master\git\smarthome\extensions\ui\org.eclipse.smarthome.ui.paper\node_modules\.staging\connect-97b2d9eb\lib\patch.js'
[WARNING] npm WARN optional SKIPPING OPTIONAL DEPENDENCY: lodash@3.10.1 (node_modules\opt-merger\node_modules\lodash):
[WARNING] npm WARN optional SKIPPING OPTIONAL DEPENDENCY: EEXIST: file already exists, mkdir 'C:\Users\Asus_Fueb1\smarthome-master\git\smarthome\extensions\ui\org.eclipse.smarthome.ui.paper\node_modules\.staging\lodash-43a36599\object'
[WARNING] npm WARN optional SKIPPING OPTIONAL DEPENDENCY: File exists: C:\Users\Asus_Fueb1\smarthome-master\git\smarthome\extensions\ui\org.eclipse.smarthome.ui.paper\node_modules\.staging\lodash-43a36599\object
[WARNING] npm WARN optional SKIPPING OPTIONAL DEPENDENCY: lodash@1.0.2 (node_modules\glob-watcher\node_modules\lodash):
[WARNING] npm WARN optional SKIPPING OPTIONAL DEPENDENCY: EEXIST: file already exists, mkdir 'C:\Users\Asus_Fueb1\smarthome-master\git\smarthome\extensions\ui\org.eclipse.smarthome.ui.paper\node_modules\.staging\lodash-641bedf0\dist'
[WARNING] npm WARN optional SKIPPING OPTIONAL DEPENDENCY: File exists: C:\Users\Asus_Fueb1\smarthome-master\git\smarthome\extensions\ui\org.eclipse.smarthome.ui.paper\node_modules\.staging\lodash-641bedf0\dist
[WARNING] npm WARN optional SKIPPING OPTIONAL DEPENDENCY: es6-map@0.1.5 (node_modules\es6-map):
[WARNING] npm WARN enoent SKIPPING OPTIONAL DEPENDENCY: ENOENT: no such file or directory, utime 'C:\Users\Asus_Fueb1\smarthome-master\git\smarthome\extensions\ui\org.eclipse.smarthome.ui.paper\node_modules\.staging\es6-map-0c27b93e\README.md'
[WARNING] npm WARN optional SKIPPING OPTIONAL DEPENDENCY: flagged-respawn@1.0.0 (node_modules\flagged-respawn):
[WARNING] npm WARN enoent SKIPPING OPTIONAL DEPENDENCY: ENOENT: no such file or directory, utime 'C:\Users\Asus_Fueb1\smarthome-master\git\smarthome\extensions\ui\org.eclipse.smarthome.ui.paper\node_modules\.staging\flagged-respawn-70645176\index.js'
[WARNING] npm WARN optional SKIPPING OPTIONAL DEPENDENCY: es6-set@0.1.5 (node_modules\es6-set):
[WARNING] npm WARN enoent SKIPPING OPTIONAL DEPENDENCY: ENOENT: no such file or directory, utime 'C:\Users\Asus_Fueb1\smarthome-master\git\smarthome\extensions\ui\org.eclipse.smarthome.ui.paper\node_modules\.staging\es6-set-36e19c72\README.md'
[WARNING] npm WARN optional SKIPPING OPTIONAL DEPENDENCY: ajv@4.11.8 (node_modules\ajv):
[WARNING] npm WARN optional SKIPPING OPTIONAL DEPENDENCY: EEXIST: file already exists, mkdir 'C:\Users\Asus_Fueb1\smarthome-master\git\smarthome\extensions\ui\org.eclipse.smarthome.ui.paper\node_modules\.staging\ajv-05ca68ce\lib\compile'
[WARNING] npm WARN optional SKIPPING OPTIONAL DEPENDENCY: File exists: C:\Users\Asus_Fueb1\smarthome-master\git\smarthome\extensions\ui\org.eclipse.smarthome.ui.paper\node_modules\.staging\ajv-05ca68ce\lib\compile
[WARNING] npm WARN optional SKIPPING OPTIONAL DEPENDENCY: bluebird@3.4.7 (node_modules\jsdoc\node_modules\bluebird):
[WARNING] npm WARN optional SKIPPING OPTIONAL DEPENDENCY: EEXIST: file already exists, mkdir 'C:\Users\Asus_Fueb1\smarthome-master\git\smarthome\extensions\ui\org.eclipse.smarthome.ui.paper\node_modules\.staging\bluebird-dca5c58d\js\release'
[WARNING] npm WARN optional SKIPPING OPTIONAL DEPENDENCY: File exists: C:\Users\Asus_Fueb1\smarthome-master\git\smarthome\extensions\ui\org.eclipse.smarthome.ui.paper\node_modules\.staging\bluebird-dca5c58d\js\release
[WARNING] npm WARN optional SKIPPING OPTIONAL DEPENDENCY: qs@0.4.2 (node_modules\express\node_modules\qs):
[WARNING] npm WARN enoent SKIPPING OPTIONAL DEPENDENCY: ENOENT: no such file or directory, utime 'C:\Users\Asus_Fueb1\smarthome-master\git\smarthome\extensions\ui\org.eclipse.smarthome.ui.paper\node_modules\.staging\qs-9ee7025d\History.md'
[WARNING] npm WARN optional SKIPPING OPTIONAL DEPENDENCY: expand-braces@0.1.2 (node_modules\expand-braces):
[WARNING] npm WARN enoent SKIPPING OPTIONAL DEPENDENCY: ENOENT: no such file or directory, utime 'C:\Users\Asus_Fueb1\smarthome-master\git\smarthome\extensions\ui\org.eclipse.smarthome.ui.paper\node_modules\.staging\expand-braces-34cd6e42\readme.md'
[WARNING] npm WARN optional SKIPPING OPTIONAL DEPENDENCY: weinre@2.0.0-pre-I0Z7U9OV (node_modules\weinre):
[WARNING] npm WARN optional SKIPPING OPTIONAL DEPENDENCY: EEXIST: file already exists, mkdir 'C:\Users\Asus_Fueb1\smarthome-master\git\smarthome\extensions\ui\org.eclipse.smarthome.ui.paper\node_modules\.staging\weinre-8ce041d4\web\client\Images'
[WARNING] npm WARN optional SKIPPING OPTIONAL DEPENDENCY: File exists: C:\Users\Asus_Fueb1\smarthome-master\git\smarthome\extensions\ui\org.eclipse.smarthome.ui.paper\node_modules\.staging\weinre-8ce041d4\web\client\Images
[WARNING] npm WARN optional SKIPPING OPTIONAL DEPENDENCY: formidable@1.0.17 (node_modules\formidable):
[WARNING] npm WARN enoent SKIPPING OPTIONAL DEPENDENCY: ENOENT: no such file or directory, open 'C:\Users\Asus_Fueb1\smarthome-master\git\smarthome\extensions\ui\org.eclipse.smarthome.ui.paper\node_modules\.staging\formidable-84652e6f\lib\octet_parser.js'
[WARNING] npm WARN optional SKIPPING OPTIONAL DEPENDENCY: express@2.5.11 (node_modules\express):
[WARNING] npm WARN enoent SKIPPING OPTIONAL DEPENDENCY: ENOENT: no such file or directory, open 'C:\Users\Asus_Fueb1\smarthome-master\git\smarthome\extensions\ui\org.eclipse.smarthome.ui.paper\node_modules\.staging\express-a18228a6\lib\response.js'
[WARNING] npm WARN optional SKIPPING OPTIONAL DEPENDENCY: fast-deep-equal@1.0.0 (node_modules\fast-deep-equal):
[WARNING] npm WARN optional SKIPPING OPTIONAL DEPENDENCY: EEXIST: file already exists, mkdir 'C:\Users\Asus_Fueb1\smarthome-master\git\smarthome\extensions\ui\org.eclipse.smarthome.ui.paper\node_modules\.staging\fast-deep-equal-3153dde1\benchmark'
[WARNING] npm WARN optional SKIPPING OPTIONAL DEPENDENCY: File exists: C:\Users\Asus_Fueb1\smarthome-master\git\smarthome\extensions\ui\org.eclipse.smarthome.ui.paper\node_modules\.staging\fast-deep-equal-3153dde1\benchmark
[WARNING] npm WARN optional SKIPPING OPTIONAL DEPENDENCY: mout@0.10.0 (node_modules\mout):
[WARNING] npm WARN optional SKIPPING OPTIONAL DEPENDENCY: EEXIST: file already exists, mkdir 'C:\Users\Asus_Fueb1\smarthome-master\git\smarthome\extensions\ui\org.eclipse.smarthome.ui.paper\node_modules\.staging\mout-a9235fbf\array'
[WARNING] npm WARN optional SKIPPING OPTIONAL DEPENDENCY: File exists: C:\Users\Asus_Fueb1\smarthome-master\git\smarthome\extensions\ui\org.eclipse.smarthome.ui.paper\node_modules\.staging\mout-a9235fbf\array
[WARNING] npm WARN optional SKIPPING OPTIONAL DEPENDENCY: iconv-lite@0.4.19 (node_modules\iconv-lite):
[WARNING] npm WARN enoent SKIPPING OPTIONAL DEPENDENCY: ENOENT: no such file or directory, utime 'C:\Users\Asus_Fueb1\smarthome-master\git\smarthome\extensions\ui\org.eclipse.smarthome.ui.paper\node_modules\.staging\iconv-lite-f8d563c4\lib\index.js'
[WARNING] npm WARN optional SKIPPING OPTIONAL DEPENDENCY: lodash@3.10.1 (node_modules\karma\node_modules\lodash):
[WARNING] npm WARN optional SKIPPING OPTIONAL DEPENDENCY: EEXIST: file already exists, mkdir 'C:\Users\Asus_Fueb1\smarthome-master\git\smarthome\extensions\ui\org.eclipse.smarthome.ui.paper\node_modules\.staging\lodash-dd1eba5b\collection'
[WARNING] npm WARN optional SKIPPING OPTIONAL DEPENDENCY: File exists: C:\Users\Asus_Fueb1\smarthome-master\git\smarthome\extensions\ui\org.eclipse.smarthome.ui.paper\node_modules\.staging\lodash-dd1eba5b\collection
[WARNING] npm WARN optional SKIPPING OPTIONAL DEPENDENCY: fsevents@1.1.3 (node_modules\fsevents):
[WARNING] npm WARN enoent SKIPPING OPTIONAL DEPENDENCY: ENOENT: no such file or directory, utime 'C:\Users\Asus_Fueb1\smarthome-master\git\smarthome\extensions\ui\org.eclipse.smarthome.ui.paper\node_modules\.staging\fsevents-39ffd3a4\node_modules\aproba\README.md'
[WARNING] npm WARN optional SKIPPING OPTIONAL DEPENDENCY: lodash@3.10.1 (node_modules\http-proxy-middleware\node_modules\lodash):
[WARNING] npm WARN optional SKIPPING OPTIONAL DEPENDENCY: EEXIST: file already exists, mkdir 'C:\Users\Asus_Fueb1\smarthome-master\git\smarthome\extensions\ui\org.eclipse.smarthome.ui.paper\node_modules\.staging\lodash-47df3ff5\object'
[WARNING] npm WARN optional SKIPPING OPTIONAL DEPENDENCY: File exists: C:\Users\Asus_Fueb1\smarthome-master\git\smarthome\extensions\ui\org.eclipse.smarthome.ui.paper\node_modules\.staging\lodash-47df3ff5\object
[ERROR]
[ERROR] npm ERR! code EINTEGRITY
[ERROR] npm ERR! sha1-qced3wuE72sv5IoNEVe0JWioH1o= integrity checksum failed when using sha1: wanted sha1-qced3wuE72sv5IoNEVe0JWioH1o= but got sha1-R7ay3ttvDgcr6+IRV/u4Hr4khaY=. (261548 bytes)
[ERROR]
[ERROR] npm ERR! A complete log of this run can be found in:
[ERROR] npm ERR! C:\Users\Asus_Fueb1\smarthome-master\git\smarthome\extensions\ui\org.eclipse.smarthome.ui.paper\npm_cache\_logs\2018-01-25T06_43_45_155Z-debug.log
[INFO] ------------------------------------------------------------------------
[INFO] Reactor Summary:
[INFO]
[INFO] Eclipse SmartHome .................................. SUCCESS [ 5.491 s]
[INFO] Eclipse SmartHome Bundles .......................... SUCCESS [ 1.450 s]
[INFO] Eclipse SmartHome Test Components .................. SUCCESS [ 0.094 s]
[INFO] Eclipse SmartHome Core Components .................. SUCCESS [ 0.090 s]
[INFO] Eclipse SmartHome Core ............................. SUCCESS [01:18 min]
[INFO] Eclipse SmartHome Configurations ................... SUCCESS [ 0.140 s]
[INFO] Eclipse SmartHome Configuration Core ............... SUCCESS [ 18.269 s]
[INFO] Eclipse SmartHome Configuration XML ................ SUCCESS [ 15.276 s]
[INFO] Eclipse SmartHome AutoUpdate Binding ............... SUCCESS [ 10.520 s]
[INFO] Eclipse SmartHome Test ............................. SUCCESS [ 12.832 s]
[INFO] Eclipse SmartHome I/O Components ................... SUCCESS [ 0.109 s]
[INFO] Eclipse SmartHome Console .......................... SUCCESS [ 9.642 s]
[INFO] Eclipse SmartHome Thing ............................ SUCCESS [ 27.856 s]
[INFO] Magic Bundle ....................................... SUCCESS [ 10.139 s]
[INFO] Magic Bundle Tests ................................. SUCCESS [ 8.572 s]
[INFO] Eclipse SmartHome Auth Components .................. SUCCESS [ 0.141 s]
[INFO] Eclipse SmartHome JAAS Authentication .............. SUCCESS [ 9.206 s]
[INFO] Eclipse SmartHome Configuration Dispatcher ......... SUCCESS [ 11.178 s]
[INFO] Eclipse SmartHome Configuration Dispatcher Tests ... SUCCESS [ 10.963 s]
[INFO] Eclipse SmartHome Configuration Core Tests ......... SUCCESS [ 33.236 s]
[INFO] Eclipse SmartHome Configuration Discovery .......... SUCCESS [ 12.147 s]
[INFO] Eclipse SmartHome mDNS Service ..................... SUCCESS [ 8.107 s]
[INFO] Eclipse SmartHome Configuration mDNS Discovery ..... SUCCESS [ 7.294 s]
[INFO] Eclipse SmartHome Core Thing XML ................... SUCCESS [ 11.648 s]
[INFO] Eclipse SmartHome Configuration Discovery Tests .... SUCCESS [ 16.225 s]
[INFO] Eclipse SmartHome Configuration UPnP Discovery ..... SUCCESS [ 9.112 s]
[INFO] Eclipse SmartHome Configuration Serial ............. SUCCESS [ 7.355 s]
[INFO] Eclipse SmartHome Config XML Tests ................. SUCCESS [ 11.363 s]
[INFO] Eclipse SmartHome Core Audio ....................... SUCCESS [ 11.707 s]
[INFO] Eclipse SmartHome Core Binding XML ................. SUCCESS [ 10.042 s]
[INFO] Eclipse Smarthome Audio Test ....................... SUCCESS [ 12.513 s]
[INFO] Eclipse SmartHome Sample Extension Service ......... SUCCESS [ 7.068 s]
[INFO] Eclipse SmartHome REST Interface ................... SUCCESS [ 9.384 s]
[INFO] Eclipse SmartHome Core ID .......................... SUCCESS [ 6.882 s]
[INFO] Eclipse SmartHome ID Tests ......................... SUCCESS [ 6.697 s]
[INFO] Eclipse SmartHome Core Tests ....................... SUCCESS [ 22.315 s]
[INFO] Eclipse SmartHome Thing Tests ...................... SUCCESS [01:01 min]
[INFO] Eclipse SmartHome Core Persistence ................. SUCCESS [ 10.108 s]
[INFO] Eclipse SmartHome Core Scheduler Service ........... SUCCESS [ 6.718 s]
[INFO] Eclipse SmartHome Core Transformation Service ...... SUCCESS [ 8.123 s]
[INFO] Eclipse SmartHome Core Binding XML Tests ........... SUCCESS [ 8.793 s]
[INFO] Eclipse SmartHome Core Thing XML Tests ............. SUCCESS [ 12.924 s]
[INFO] Eclipse SmartHome Core Voice ....................... SUCCESS [ 13.189 s]
[INFO] Eclipse SmartHome Core Voice Test .................. SUCCESS [ 10.095 s]
[INFO] Eclipse SmartHome Automation ....................... SUCCESS [ 0.325 s]
[INFO] Eclipse SmartHome Automation API ................... SUCCESS [ 17.184 s]
[INFO] Eclipse SmartHome Automation Commands .............. SUCCESS [ 11.729 s]
[INFO] Eclipse SmartHome Automation Parser GSON ........... SUCCESS [ 8.326 s]
[INFO] Eclipse SmartHome Automation Providers ............. SUCCESS [ 10.373 s]
[INFO] Eclipse SmartHome Automation Provider File ......... SUCCESS [ 8.821 s]
[INFO] Eclipse SmartHome Automation Core .................. SUCCESS [ 14.281 s]
[INFO] Eclipse SmartHome Automation Core Tests ............ SUCCESS [ 10.391 s]
[INFO] Eclipse SmartHome Automation Sample JSON ........... SUCCESS [ 12.506 s]
[INFO] Eclipse SmartHome Automation Core Modules .......... SUCCESS [ 11.014 s]
[INFO] Eclipse SmartHome Automation Core Module Tests ..... SUCCESS [ 10.970 s]
[INFO] Eclipse SmartHome Automation Script Modules ........ SUCCESS [ 11.975 s]
[INFO] Eclipse SmartHome Automation Media Modules ......... SUCCESS [ 9.942 s]
[INFO] Eclipse SmartHome Automation Timer Modules ......... SUCCESS [ 9.016 s]
[INFO] Eclipse SmartHome Automation Module Timer Tests .... SUCCESS [ 11.787 s]
[INFO] Eclipse SmartHome Automation Script Default Scope .. SUCCESS [ 8.955 s]
[INFO] Eclipse SmartHome Automation Script RuleSupport .... SUCCESS [ 14.237 s]
[INFO] Eclipse SmartHome Automation Script Module Tests ... SUCCESS [ 8.148 s]
[INFO] Eclipse SmartHome Automation Event Tests ........... SUCCESS [ 8.831 s]
[INFO] Eclipse SmartHome Automation Integration Tests ..... SUCCESS [ 17.862 s]
[INFO] Eclipse SmartHome Automation Sample Extension Java . SUCCESS [ 31.702 s]
[INFO] Eclipse SmartHome Automation REST API .............. SUCCESS [ 13.702 s]
[INFO] Eclipse SmartHome Automation Sample REST API ....... SUCCESS [ 8.249 s]
[INFO] Eclipse SmartHome Automation Java Demo ............. SUCCESS [ 6.691 s]
[INFO] Eclipse SmartHome Automation Json Demo ............. SUCCESS [ 3.686 s]
[INFO] Eclipse SmartHome Automation Module Type Demo ...... SUCCESS [ 8.715 s]
[INFO] Eclipse SmartHome Console for OSGi framework Eclipse Equinox SUCCESS [ 8.704 s]
[INFO] Eclipse SmartHome Console for OSGi Console RFC 147 . SUCCESS [ 11.014 s]
[INFO] Eclipse SmartHome Console for OSGi runtime Karaf ... SUCCESS [ 8.961 s]
[INFO] Eclipse SmartHome Monitor .......................... SUCCESS [ 7.825 s]
[INFO] Eclipse SmartHome Network I/O ...................... SUCCESS [ 11.033 s]
[INFO] Eclipse SmartHome Network I/O Tests ................ SUCCESS [ 8.698 s]
[INFO] Eclipse SmartHome IO REST Tests .................... SUCCESS [ 10.727 s]
[INFO] Eclipse SmartHome Authentication Support for the REST Interface SUCCESS [ 9.220 s]
[INFO] Eclipse SmartHome Basic Auth for the REST Interface SUCCESS [ 9.346 s]
[INFO] Eclipse SmartHome Core REST Interface .............. SUCCESS [ 22.005 s]
[INFO] Eclipse SmartHome IO REST Core Tests ............... SUCCESS [ 10.904 s]
[INFO] Eclipse SmartHome REST mDNS Announcer .............. SUCCESS [ 7.868 s]
[INFO] Eclipse SmartHome REST JAX-RS Optimizations ........ SUCCESS [ 9.081 s]
[INFO] Eclipse SmartHome SSE Interface .................... SUCCESS [ 10.920 s]
[INFO] Eclipse SmartHome IO SSE Tests ..................... SUCCESS [ 9.923 s]
[INFO] Eclipse SmartHome Models ........................... SUCCESS [ 12.564 s]
[INFO] Eclipse SmartHome Model Core ....................... SUCCESS [ 20.341 s]
[INFO] Eclipse SmartHome Model Lazy Generation ............ SUCCESS [ 13.632 s]
[INFO] Eclipse SmartHome Model Sitemap .................... SUCCESS [01:18 min]
[INFO] Eclipse SmartHome Model Items ...................... SUCCESS [ 37.046 s]
[INFO] Eclipse SmartHome UIs .............................. SUCCESS [ 0.185 s]
[INFO] Eclipse SmartHome UI ............................... SUCCESS [ 20.160 s]
[INFO] Eclipse SmartHome Sitemap REST Interface ........... SUCCESS [ 13.402 s]
[INFO] Eclipse SmartHome Core REST UI Logging Module ...... SUCCESS [ 8.697 s]
[INFO] Eclipse SmartHome Voice REST Interface ............. SUCCESS [ 7.913 s]
[INFO] Eclipse SmartHome DBus Transport ................... SUCCESS [ 3.541 s]
[INFO] Eclipse SmartHome MQTT Transport ................... SUCCESS [ 11.097 s]
[INFO] Eclipse SmartHome Mqtt Transport I/O Tests ......... SUCCESS [ 8.847 s]
[INFO] Eclipse SmartHome UPnP Transport ................... SUCCESS [ 10.267 s]
[INFO] Eclipse SmartHome IO UPnP Tests .................... SUCCESS [ 14.363 s]
[INFO] Eclipse SmartHome Model Core Tests ................. SUCCESS [ 12.066 s]
[INFO] Eclipse SmartHome Model Item IDE ................... SUCCESS [ 20.256 s]
[INFO] Eclipse SmartHome Model Items Runtime .............. SUCCESS [ 7.510 s]
[INFO] Eclipse SmartHome Items Model Tests ................ SUCCESS [ 12.833 s]
[INFO] Eclipse SmartHome Model Persistence ................ SUCCESS [ 34.809 s]
[INFO] Eclipse SmartHome Model Persistence IDE ............ SUCCESS [ 15.052 s]
[INFO] Eclipse SmartHome Model Script ..................... SUCCESS [01:09 min]
[INFO] Eclipse SmartHome Model Rules ...................... SUCCESS [01:13 min]
[INFO] Eclipse SmartHome Model Rule IDE ................... SUCCESS [ 34.347 s]
[INFO] Eclipse SmartHome Model Script IDE ................. SUCCESS [ 35.482 s]
[INFO] Eclipse SmartHome Model Sitemap IDE ................ SUCCESS [ 41.291 s]
[INFO] Eclipse SmartHome Thing Model ...................... SUCCESS [ 50.127 s]
[INFO] Eclipse SmartHome Model Thing IDE .................. SUCCESS [ 20.775 s]
[INFO] Eclipse SmartHome Language Server .................. SUCCESS [ 13.483 s]
[INFO] Eclipse SmartHome Language Server Tests ............ SUCCESS [ 9.503 s]
[INFO] Eclipse SmartHome Model Persistence Runtime ........ SUCCESS [ 7.827 s]
[INFO] Eclipse SmartHome Model Persistence Tests .......... SUCCESS [ 14.185 s]
[INFO] Eclipse SmartHome Model Rules Runtime .............. SUCCESS [ 17.648 s]
[INFO] Eclipse SmartHome Model Rules Tests ................ SUCCESS [ 6.274 s]
[INFO] Eclipse SmartHome Model Script Runtime ............. SUCCESS [ 16.186 s]
[INFO] Eclipse SmartHome Model Script Tests ............... SUCCESS [ 12.699 s]
[INFO] Eclipse SmartHome Model Sitemap Runtime ............ SUCCESS [ 9.000 s]
[INFO] Eclipse SmartHome Thing Model Runtime .............. SUCCESS [ 8.968 s]
[INFO] Eclipse SmartHome Thing Model Tests ................ SUCCESS [ 23.066 s]
[INFO] Eclipse SmartHome UI Tests ......................... SUCCESS [ 11.394 s]
[INFO] Eclipse SmartHome UI Icon Support .................. SUCCESS [ 11.841 s]
[INFO] Eclipse SmartHome UI Icon Tests .................... SUCCESS [ 27.200 s]
[INFO] Eclipse SmartHome Storages ......................... SUCCESS [ 0.250 s]
[INFO] Eclipse SmartHome JSON Storage ..................... SUCCESS [ 11.483 s]
[INFO] Eclipse SmartHome Storage JSON Tests ............... SUCCESS [ 10.918 s]
[INFO] Eclipse SmartHome MapDB Storage .................... SUCCESS [ 12.871 s]
[INFO] Eclipse SmartHome Storage MapDB Tests .............. SUCCESS [ 12.082 s]
[INFO] Eclipse SmartHome Extensions ....................... SUCCESS [ 0.497 s]
[INFO] Eclipse SmartHome Bindings ......................... SUCCESS [ 0.278 s]
[INFO] Eclipse SmartHome Astro Binding .................... SUCCESS [ 25.644 s]
[INFO] Eclipse SmartHome Astro Binding Tests .............. SUCCESS [ 14.253 s]
[INFO] Eclipse SmartHome DigitalSTROM Binding ............. SUCCESS [ 47.285 s]
[INFO] Eclipse Smarthome DMX Binding ...................... SUCCESS [ 17.148 s]
[INFO] Eclipse Smarthome DMX Binding Tests ................ SUCCESS [ 14.746 s]
[INFO] Eclipse SmartHome hue Binding ...................... SUCCESS [ 35.609 s]
[INFO] Eclipse SmartHome hue Binding Tests ................ SUCCESS [ 20.936 s]
[INFO] Eclipse SmartHome FSInternetRadio Binding .......... SUCCESS [ 15.651 s]
[INFO] Eclipse Smarthome FSInternetRadio Binding Test ..... SUCCESS [ 14.608 s]
[INFO] Eclipse SmartHome LIFX Binding ..................... SUCCESS [ 25.376 s]
[INFO] Eclipse SmartHome LIRC Binding ..................... SUCCESS [ 15.524 s]
[INFO] Eclipse SmartHome NTP Binding ...................... SUCCESS [ 14.268 s]
[INFO] Eclipse SmartHome NTP Binding Tests ................ SUCCESS [ 16.761 s]
[INFO] SerialButton Binding ............................... SUCCESS [ 12.739 s]
[INFO] Eclipse SmartHome Sonos Binding .................... SUCCESS [ 27.864 s]
[INFO] TRÅDFRI Binding .................................... SUCCESS [ 24.371 s]
[INFO] TRÅDFRI Binding Tests .............................. SUCCESS [ 16.441 s]
[INFO] WeatherUnderground Binding ......................... SUCCESS [ 22.615 s]
[INFO] Eclipse SmartHome WeMo Binding ..................... SUCCESS [ 16.864 s]
[INFO] Eclipse SmartHome Wemo Binding Tests ............... SUCCESS [ 30.061 s]
[INFO] Eclipse SmartHome YahooWeather Binding ............. SUCCESS [ 16.290 s]
[INFO] Eclipse SmartHome Extension Service Extensions ..... SUCCESS [ 0.174 s]
[INFO] Eclipse SmartHome IoT Marketplace Extension Service SUCCESS [ 18.225 s]
[INFO] Eclipse SmartHome IoT Marketplace Extension Automation Support SUCCESS [ 14.780 s]
[INFO] Eclipse SmartHome IoT Marketplace Extension Service Test SUCCESS [ 11.646 s]
[INFO] Eclipse SmartHome I/O Services ..................... SUCCESS [ 1.024 s]
[INFO] Eclipse SmartHome JavaSound I/O .................... SUCCESS [ 13.175 s]
[INFO] Eclipse SmartHome Web Audio Support ................ SUCCESS [ 12.162 s]
[INFO] Eclipse SmartHome Transformation Services .......... SUCCESS [ 0.245 s]
[INFO] Eclipse SmartHome Exec Transformation Service ...... SUCCESS [ 9.753 s]
[INFO] Eclipse SmartHome Javascript Transformation Service SUCCESS [ 9.522 s]
[INFO] Eclipse SmartHome Map Transformation Service ....... SUCCESS [ 12.475 s]
[INFO] Eclipse SmartHome Map Transformation Service Tests . SUCCESS [ 13.442 s]
[INFO] Eclipse SmartHome Scale Transformation Service ..... SUCCESS [ 13.106 s]
[INFO] Eclipse SmartHome Scale Transformation Service Tests SUCCESS [ 11.957 s]
[INFO] Eclipse SmartHome RegEx Transformation Service ..... SUCCESS [ 37.658 s]
[INFO] Eclipse SmartHome RegEx Transformation Service Tests SUCCESS [ 14.003 s]
[INFO] Eclipse SmartHome XPath Transformation Service ..... SUCCESS [ 9.590 s]
[INFO] Eclipse SmartHome XPath Transformation Service Tests SUCCESS [ 9.511 s]
[INFO] Eclipse SmartHome JSonPath Transformation Service .. SUCCESS [ 11.287 s]
[INFO] Eclipse SmartHome JSonPath Transformation Service Tests SUCCESS [ 8.460 s]
[INFO] Eclipse SmartHome Xslt Transformation Service ...... SUCCESS [ 12.223 s]
[INFO] Eclipse SmartHome Xslt Transformation Service Tests SUCCESS [ 10.041 s]
[INFO] Eclipse SmartHome UI Extensions .................... SUCCESS [ 0.171 s]
[INFO] Eclipse SmartHome Icon Sets ........................ SUCCESS [ 0.122 s]
[INFO] Eclipse SmartHome Classic Icon Set ................. SUCCESS [ 29.392 s]
[INFO] Eclipse SmartHome Basic UI ......................... SUCCESS [02:01 min]
[INFO] Eclipse SmartHome Classic UI ....................... SUCCESS [ 21.770 s]
[INFO] Eclipse SmartHome Paper UI ......................... FAILURE [05:33 min]
[INFO] Eclipse SmartHome Voice Services ................... SKIPPED
[INFO] Eclipse SmartHome MacOS TTS ........................ SKIPPED
[INFO] Eclipse SmartHome Mac TTS Tests .................... SKIPPED
[INFO] Eclipse SmartHome Features ......................... SKIPPED
[INFO] Eclipse SmartHome Runtime Core Feature ............. SKIPPED
[INFO] Eclipse SmartHome Runtime Model Feature ............ SKIPPED
[INFO] Eclipse SmartHome Runtime UI Feature ............... SKIPPED
[INFO] Eclipse SmartHome Runtime REST Feature ............. SKIPPED
[INFO] Eclipse SmartHome Runtime Automation Feature ....... SKIPPED
[INFO] Eclipse SmartHome Runtime Equinox Console Feature .. SKIPPED
[INFO] Eclipse SmartHome Runtime RfC147 Console Feature ... SKIPPED
[INFO] Eclipse SmartHome Runtime Binding Feature .......... SKIPPED
[INFO] Eclipse SmartHome Test Dependencies ................ SKIPPED
[INFO] Eclipse SmartHome Karaf Features ................... SKIPPED
[INFO] Eclipse SmartHome Target Platform Feature .......... SKIPPED
[INFO] Eclipse SmartHome Core Feature ..................... SKIPPED
[INFO] Eclipse SmartHome Extensions Feature ............... SKIPPED
[INFO] Eclipse SmartHome Karaf Feature Verification ....... SKIPPED
[INFO] Eclipse SmartHome Products ......................... SKIPPED
[INFO] Eclipse SmartHome p2 Repository .................... SKIPPED
[INFO] Eclipse SmartHome Tools ............................ SKIPPED
[INFO] Eclipse SmartHome Archetypes ....................... SKIPPED
[INFO] Eclipse Smarthome Binding Archetype ................ SKIPPED
[INFO] Eclipse Smarthome Binding Archetype Testsuite ...... SKIPPED
[INFO] Eclipse SmartHome Target Platform .................. SKIPPED
[INFO] Eclipse SmartHome Distribution ..................... SKIPPED
[INFO] ------------------------------------------------------------------------
[INFO] BUILD FAILURE
[INFO] ------------------------------------------------------------------------
[INFO] Total time: 55:10 min
[INFO] Finished at: 2018-01-25T12:13:46+05:30
[INFO] Final Memory: 391M/931M
[INFO] ------------------------------------------------------------------------
[ERROR] Failed to execute goal com.github.eirslett:frontend-maven-plugin:1.0:npm (npm install) on project org.eclipse.smarthome.ui.paper: Failed to run task: 'npm install' failed. (error code 1) -> [Help 1]
[ERROR]
[ERROR] To see the full stack trace of the errors, re-run Maven with the -e switch.
[ERROR] Re-run Maven using the -X switch to enable full debug logging.
[ERROR]
[ERROR] For more information about the errors and possible solutions, please read the following articles:
[ERROR] [Help 1] http://cwiki.apache.org/confluence/display/MAVEN/MojoFailureException
[ERROR]
[ERROR] After correcting the problems, you can resume the build with the command
[ERROR] mvn <goals> -rf :org.eclipse.smarthome.ui.paper


Previous Topic:Recommended update strategy of channels in binding
Next Topic:Firmware API
Goto Forum:
  


Current Time: Wed Jun 20 00:30:38 GMT 2018

Powered by FUDForum. Page generated in 0.03203 seconds
.:: Contact :: Home ::.

Powered by: FUDforum 3.0.2.
Copyright ©2001-2010 FUDforum Bulletin Board Software

Back to the top