Eclipse Community Forums
Forum Search:

Search      Help    Register    Login    Home
    Replies Views Last message
  How to script renaming a directory? (Windows)
By: Andrew Small on Tue, 12 December 2017
2 3085 Fri, 15 December 2017 15:11
By: Andrew Small
  Unable to Launch AUT from Jenkins using window batch command
Unable to Launch AUT from Jenkins using window batch command
By: Rajesh Singh on Tue, 16 August 2016
3 7275 Wed, 13 December 2017 14:37
By: Roman Rutsevich
  How Can I fetch environment variable in RCPTT?
I need to fetch an environment variable in rcptt test case. The variables value is coming at runtime.I tried using the command :"global [val TestVar [ substitute-variables " ${system_propert
By: Mayur Sancheti on Thu, 23 November 2017
6 4531 Mon, 11 December 2017 06:28
By: Mayur Sancheti
  get-workspace-location: Resources/Variables Plugin error (Resources plugin cannot be found)
By: Stephan Druskat on Wed, 29 November 2017
5 1209 Fri, 01 December 2017 11:46
By: Stephan Druskat
  values are not updated in AUT
RCPTT
By: Lavanya nagamalla on Fri, 24 November 2017
1 2174 Fri, 01 December 2017 09:42
By: Viktoria Dlugopolskaya
  Problem opening a internal browser
By: Agustin Celentano on Fri, 24 November 2017
1 3282 Fri, 01 December 2017 09:34
By: Viktoria Dlugopolskaya
  Scriptlet ReadExcelFile not found at read-excel-file
I am getting this error while using the read-excel-file command.
By: Dileep Nair on Thu, 23 November 2017
4 1261 Fri, 01 December 2017 09:23
By: Viktoria Dlugopolskaya
  Setting value of checkbox editor in wizard table doesn't work
By: Stephan Druskat on Wed, 29 November 2017
1 414 Wed, 29 November 2017 11:34
By: Stephan Druskat
  RCPTT does not register that it has executed the command on RH7
Most probably related to NAT tables and GEF's
By: keith davis on Thu, 26 October 2017
4 3183 Mon, 27 November 2017 10:59
By: keith davis
  RCPTT Testing tool startup failure
Also related to NAT table and Graphical editor capability
By: keith davis on Wed, 19 July 2017
2 6003 Fri, 24 November 2017 16:36
By: keith davis
  RCP Tester not working
RCP tester not able to run the recorded testcases. While executing the recorded test cases I am getting the following error.
By: Dileep Nair on Thu, 16 November 2017
0 4157 Thu, 16 November 2017 12:52
By: Dileep Nair
  Random timeout errors on remote machines
TestRunner fails randomly in specific cases when the screen is not active
By: Hicyo LA on Tue, 31 October 2017
1 3983 Tue, 14 November 2017 11:49
By: Viktoria Dlugopolskaya
  Create dependent test case inside a test suite
Create dependent test case inside a test suite
By: noor shiblee on Tue, 07 November 2017
1 3000 Tue, 14 November 2017 09:58
By: Viktoria Dlugopolskaya
  RCPTT Maven Build can't find class
RCPTT Maven buld fails with NoClassDefFoundError
By: Bruce Edgerton on Fri, 10 November 2017
1 3234 Tue, 14 November 2017 06:55
By: Viktoria Dlugopolskaya
  Random failures when loading eclipse projects lead to invalid configuration
Workspace context
By: Hicyo LA on Thu, 26 October 2017
2 2865 Tue, 31 October 2017 11:05
By: Hicyo LA
  nested context procs do not work
when an inline proc is moved to a context, exection fails
By: Walt Stone on Mon, 16 October 2017
3 1164 Mon, 30 October 2017 09:14
By: Viktoria Dlugopolskaya
  RCPTT with Selenium
By: Agustin Celentano on Tue, 29 August 2017
3 5038 Mon, 30 October 2017 08:17
By: Viktoria Dlugopolskaya
  Failed to close report node: Connection reset
I've often encountered this bug
By: Tu Ton on Tue, 03 October 2017
3 6265 Mon, 30 October 2017 08:03
By: Viktoria Dlugopolskaya
  How to differentiate between menu entries with the same name
By: Kim Triebig on Tue, 10 October 2017
4 1417 Wed, 18 October 2017 11:25
By: Kim Triebig
  RCPTT - Execute test cases in background
Execute test cases from RCPTT in the background, without AUT coming to front
By: Katalin Boros on Wed, 14 September 2016
2 3012 Tue, 17 October 2017 12:07
By: Viktoria Dlugopolskaya
  RCPTT playback as IDE feature demonstration tool
RCPTT API
By: Phyo phyokyaw.ukgmail.com on Wed, 06 September 2017
1 7921 Thu, 12 October 2017 11:59
By: Viktoria Dlugopolskaya
  Could not validate integrity of the runner
2.3.0-SNAPSHOT
By: Elena Grigore on Wed, 13 September 2017
4 3236 Thu, 12 October 2017 08:49
By: Viktoria Dlugopolskaya
  "get-item -path" reqular expressions not working
By: Zbyszek Kieliszek on Fri, 01 September 2017
1 11852 Wed, 06 September 2017 03:37
By: Viktoria Dlugopolskaya
  NPE when capturing Launch context
By: Ralf Sieger on Fri, 04 August 2017
7 17333 Tue, 05 September 2017 07:10
By: Ralf Sieger
  RCPTT Test Runner not finishing its job
By: Zbyszek Kieliszek on Tue, 22 August 2017
1 13316 Thu, 31 August 2017 08:33
By: Viktoria Dlugopolskaya
  RCPTT command has been recorded but this command not executed if script running
RCPTT command has been recorded for actions on certain window (in record mode) but this command not executed if script running.
By: Alexander Chernyaev on Fri, 25 August 2017
4 12677 Thu, 31 August 2017 08:19
By: Viktoria Dlugopolskaya
  AUT vm argument value with spaces in maven plugin
By: Alfonso Rios on Wed, 23 August 2017
2 9391 Tue, 29 August 2017 15:51
By: Alfonso Rios
  RCPTT Test Runner not finishing its job
By: Zbyszek Kieliszek on Tue, 22 August 2017
1 13240 Tue, 29 August 2017 11:01
By: Viktoria Dlugopolskaya
  Error log verification issue
By: Alfonso Rios on Wed, 10 May 2017
2 2335 Wed, 23 August 2017 20:35
By: Alfonso Rios
  RCPTT runner with suites option
RCPTT runner with suites option: test order question
By: Page Wang on Wed, 09 August 2017
1 9152 Wed, 16 August 2017 10:09
By: Viktoria Dlugopolskaya
  right click not being recorded correctly
By: Ravi Mallajosyula on Fri, 04 August 2017
5 10219 Thu, 10 August 2017 13:42
By: Ravi Mallajosyula
  Nightly runner (2.2.0) fails with target platform initialization
By: Andreas Falter on Wed, 01 March 2017
4 16636 Wed, 09 August 2017 10:22
By: Viktoria Dlugopolskaya
  AUT Connection Error
Timeout error: AUT doesn't respond
By: Martine Staessen on Thu, 27 July 2017
1 10974 Wed, 09 August 2017 03:53
By: Viktoria Dlugopolskaya
  The control "Next >" is disabled.
After I recorded a test case sucessfuly I found that an text fill doesnt not turn the next button on, but if I type a letter manually it turns out to be enabled.
By: ilke Muhtaroglu on Mon, 18 January 2016
1 6535 Thu, 03 August 2017 13:09
By: Yvan Lussaud
  Tests with SWING components
I would like to add support for testing swing components in my application. I know I have to create a custom command. I would like to set values for textfield and combobox. How do I approach the prob
By: Vaidhy Kumar on Fri, 07 July 2017
1 9119 Thu, 27 July 2017 08:52
By: Viktoria Dlugopolskaya
  Guidance on SWING components
Newbie looking for guidance on recording swing UI interactions
By: Vaidhy Kumar on Fri, 07 July 2017
1 9004 Thu, 27 July 2017 08:51
By: Viktoria Dlugopolskaya
  Random Exit code 13 while running maven suite
By: Guillermo Reobasco on Mon, 24 July 2017
1 5141 Thu, 27 July 2017 08:27
By: Viktoria Dlugopolskaya
  Why Runner 2.2 fetches dependencies on each testrun
By: Krzysztof Jozefowicz on Tue, 18 July 2017
1 3554 Tue, 18 July 2017 10:12
By: Andrey Sobolev
  Assertion mode & Icon
Get an icon from pop-up Menu
By: Quentin Bourguignon d'Herbigny on Tue, 20 June 2017
1 12700 Fri, 07 July 2017 09:06
By: Viktoria Dlugopolskaya
  AUT-0: Launch failed. Reason: Process was terminated while waiting for AUT startup data
org.osgi.framework.BundleException: Could not resolve module: org.eclipse.emf.ant [126] Unresolved requirement: Require-Bundle: org.eclipse.emf.codegen; bundle-version="[2.9.0,3.0.0)"
By: Muntasim Munim on Fri, 16 September 2016
1 4053 Thu, 06 July 2017 19:58
By: Lampros Gk
  RCPTT 2.2 (Oxygen) release notes?
By: Krzysztof Jozefowicz on Thu, 29 June 2017
1 12999 Thu, 06 July 2017 09:09
By: Viktoria Dlugopolskaya
  Can we pass path of existing config.ini file in Test Runner
By: Satyam Sekhri on Fri, 23 June 2017
0 833 Fri, 23 June 2017 04:13
By: Satyam Sekhri
  Failed to Launch RCPTT Application
RCPTT Application Launch Error
By: Jeevan Rex on Wed, 28 June 2017
4 4809 Wed, 28 June 2017 06:40
By: Jeevan Rex
  RCPTT IDE testOption testExecTimeout
Replaying a test times out on a command and fails with "Execution has timed out after 300.0 seconds".
By: Jon Kurisu on Thu, 09 June 2016
4 12276 Wed, 14 June 2017 12:43
By: Zbyszek Kieliszek
  It is not possible to get The full list of ECL commands with their usage examples
It is not possible to get The full list of ECL commands with their usage examples
By: Angelo Luciani on Wed, 07 June 2017
3 6283 Thu, 08 June 2017 13:13
By: Agustin Celentano
  Failed to launch product while trying to record or run a test case
By: Vikhyat Prabhu on Thu, 01 June 2017
6 16519 Tue, 06 June 2017 13:30
By: Viktoria Dlugopolskaya
  freezing problem - RCPTT loses connection with AUT
By: Zbyszek Kieliszek on Wed, 31 May 2017
1 9622 Fri, 02 June 2017 06:27
By: Viktoria Dlugopolskaya
  check if object appears
By: Zbyszek Kieliszek on Mon, 22 May 2017
3 20908 Fri, 02 June 2017 06:20
By: Viktoria Dlugopolskaya
  Odd behavior with Maven runner and toolbars under KDE
By: Matias Pentreath on Fri, 28 April 2017
2 25864 Fri, 19 May 2017 14:49
By: Matias Pentreath
  Direct the .log files from configuration directory to my running directory
By: Mohamed Nafea on Wed, 10 May 2017
1 36566 Fri, 19 May 2017 10:48
By: Viktoria Dlugopolskaya
  Getting and processing HeapStatus
By: shay leon on Thu, 27 April 2017
2 26592 Fri, 19 May 2017 10:41
By: shay leon
  Passing parameters between scripts
parameters
By: Zbyszek Kieliszek on Fri, 21 April 2017
1 28686 Fri, 19 May 2017 10:12
By: Viktoria Dlugopolskaya
icon14.gif [SOLVED] externalize in a file global variables and procedures to handle huge project
#hack #breakers #brainstorming #externalize_in_a_file_global_variables_and_procedures #organize_the_job #improve_quality #improve_productivity #test_standard
By: Angelo Luciani on Fri, 16 October 2015
4 6997 Fri, 19 May 2017 10:08
By: Viktoria Dlugopolskaya
  Setting a preference context using ECL language?
By: Agustin Celentano on Sat, 15 April 2017
2 24507 Fri, 19 May 2017 10:06
By: Viktoria Dlugopolskaya
  Reading .properties file
Problem in reading a ,properties file using an ECL Command
By: Radman sheikh on Tue, 09 May 2017
1 37261 Fri, 19 May 2017 09:39
By: Viktoria Dlugopolskaya
  Excel import and export example
By: Arek J. on Tue, 25 April 2017
4 8671 Fri, 19 May 2017 09:21
By: Viktoria Dlugopolskaya
  RCPTT 2.0 and test count with super contexts
By: Matias Pentreath on Fri, 03 July 2015
3 2595 Thu, 18 May 2017 19:57
By: Matias Pentreath
icon1.gif File comparison Dynamically
File comparison Dynamically in Java
By: Poorvy Sharma on Fri, 05 May 2017
0 18046 Fri, 05 May 2017 13:58
By: Poorvy Sharma
  RCPTT 2.2 (Nightly build) with E4 Application not works.
By: Fran AB on Tue, 17 January 2017
5 6406 Fri, 28 April 2017 08:51
By: Steve Bolton
  RCPTT Test Runner
Can we invoke AUT (eg: eclipse) with command line option of AUT?
By: Le Grace on Wed, 01 March 2017
1 7907 Tue, 25 April 2017 17:06
By: Hans-Peter Schreiter
  Format of printing .. How to display results in the same row instead of different rows?
When I was using Q7 for GUI testing and dumping the results into output files the results are displayed with the same format they appear with in the AUT , however when I use RCPTT with the same AUT th
By: Mohamed Nafea on Mon, 06 March 2017
2 15023 Mon, 17 April 2017 03:36
By: Viktoria Dlugopolskaya
  Eclipse Oxygen
By: Francois Le Fevre on Wed, 12 April 2017
2 4367 Wed, 12 April 2017 03:25
By: Francois Le Fevre
  using RCPTT with RAP to simulate concurrent users
using RCPTT with RAP to simulate concurrent users
By: Neil Mackenzie on Wed, 05 April 2017
2 14579 Tue, 11 April 2017 15:01
By: Neil Mackenzie
  Using TestRunner, how to run a TestSuite in parallel (for diff sets of values passed in cmd args)
With TestRunner, how to run same test suite for different sets of data in parallel where data is supplied from command line
By: Shilpee Kh on Fri, 03 March 2017
1 13096 Mon, 10 April 2017 16:52
By: Andrey Sobolev
  Can we run 2 RCPTT instance simultaneously?
Running 2 test suite simultaneously is it possible?
By: Vanta Black on Thu, 06 April 2017
1 10967 Mon, 10 April 2017 16:33
By: Andrey Sobolev
  Pass parameter value from Maven to the Parameters Context
By: Michael Müller on Mon, 10 April 2017
1 2978 Mon, 10 April 2017 16:25
By: Andrey Sobolev
  RCPTT + GEF: scrolling does not work
By: Stefan Winkler on Mon, 03 April 2017
0 10647 Mon, 03 April 2017 08:56
By: Stefan Winkler
  RCPTT Developer Documentation
By: Tobias Markus on Thu, 30 March 2017
1 6434 Mon, 03 April 2017 09:37
By: Stefan Winkler
  Feature: Test script active while AUT is off
By: Markus Manck on Tue, 21 March 2017
0 6839 Tue, 21 March 2017 07:57
By: Markus Manck
  Link to ECL commands is broken
By: Markus Manck on Mon, 20 March 2017
1 1365 Mon, 20 March 2017 23:34
By: Andrey Sobolev
  How to wait for workspace build
Making the RCP Test Runner to wait only for workspace build
By: Ramesh Sampenga on Thu, 16 March 2017
5 58806 Tue, 21 March 2017 15:42
By: Markus Manck
  RCPPT doesn't records RMB on main toolbar
RCPTT Testing
By: Swanand Nagarkar on Tue, 14 March 2017
0 39505 Tue, 14 March 2017 12:03
By: Swanand Nagarkar
  Problem Recording certain Views in Rcptt
By: Ram Bose on Mon, 13 March 2017
0 37140 Mon, 13 March 2017 14:38
By: Ram Bose
  Problem With Recording certain Views in Rcptt
By: Ram Bose on Mon, 13 March 2017
0 37088 Mon, 13 March 2017 14:31
By: Ram Bose
  How to Upper Case or to Lower Case Function
Lower and Upper case function
By: Vanta Black on Thu, 09 March 2017
1 4541 Fri, 10 March 2017 06:06
By: Ulyana Skorokhodova
  Timming issue in the test case
By: Yinghui Wang on Wed, 08 March 2017
0 4670 Wed, 08 March 2017 19:50
By: Yinghui Wang
icon9.gif Selecting a list item
Unable to select list items
By: JD ya on Wed, 22 February 2017
0 13201 Wed, 22 February 2017 11:13
By: JD ya
  Test report dont show test suite name.
By: Amol Dasmale on Fri, 17 February 2017
0 12979 Fri, 17 February 2017 06:56
By: Amol Dasmale
  Closing intermittent startup popups without generating errors?
(is there a way to tell if there's a window other than "get-window"?)
By: Victor Dulepov on Thu, 16 February 2017
3 2337 Fri, 17 February 2017 08:54
By: Victor Dulepov
  Can I capture the error marker in RCPTT?
By: Tran Neo on Wed, 15 February 2017
0 22807 Wed, 15 February 2017 10:03
By: Tran Neo
  Running context once per session
By: Pascal Rapicault on Tue, 14 February 2017
0 30543 Tue, 14 February 2017 21:31
By: Pascal Rapicault
  RCPTT cucumber
Do we have any extention to work with cucumber like framework to make it easy?
By: amit Mising name on Tue, 14 February 2017
0 31433 Tue, 14 February 2017 06:46
By: amit Mising name
  RCPTT: Available Software Sites (update sites) list empty?
By: John Moule on Mon, 13 February 2017
0 29984 Mon, 13 February 2017 18:10
By: John Moule
  Vector or array in RCPTT
#get-tree #get-items #foreach
By: Angelo Luciani on Fri, 10 February 2017
1 21393 Thu, 16 March 2017 15:04
By: Daniel Herding
icon3.gif Unable to Expand a section of a View
Unable to find the object or command to expand a sub section of a View
By: JD ya on Thu, 02 February 2017
0 10306 Thu, 02 February 2017 11:00
By: JD ya
  Runner and repeating testcases in suites
By: Markus Manck on Fri, 27 January 2017
0 15365 Fri, 27 January 2017 11:32
By: Markus Manck
  Testing NAT tables with RCPTT
Is it possible to automate tests of NAT tables with RCPTT?
By: Markus Farnung on Wed, 25 January 2017
0 23678 Wed, 25 January 2017 10:41
By: Markus Farnung
  Reset MessageBoxInfo
By: Markus Manck on Tue, 24 January 2017
1 955 Tue, 24 January 2017 16:08
By: Markus Manck
  Vaadin new project displays blank Maven archetype selection
Linux Mint 18 Mate Eclipse Neon 4.6.2
By: Rod Naugler on Fri, 20 January 2017
0 99414 Fri, 20 January 2017 14:49
By: Rod Naugler
  How to check log output of Tomcat runtime with RCPTT
I like to check runtime logs (Tomcat, JBoss and more)
By: Dennis Dingeldein on Wed, 18 January 2017
0 94800 Wed, 18 January 2017 07:03
By: Dennis Dingeldein
  how to get code base path
By: karthik krishnamoorthy on Tue, 17 January 2017
2 5581 Wed, 18 January 2017 05:27
By: karthik krishnamoorthy
  Delay execution of test case commands
By: Tobias Rezmann on Fri, 13 January 2017
1 12336 Tue, 17 January 2017 14:05
By: Artem Kovalev
  close the pop up dialog while launching the product
By: karthik krishnamoorthy on Tue, 10 January 2017
1 17725 Wed, 18 January 2017 04:43
By: Artem Kovalev
  HTML-Report on Jenkins is huge for only a few failed
By: Marcus Höpfner on Mon, 09 January 2017
0 15636 Mon, 09 January 2017 09:39
By: Marcus Höpfner
  [RAP] How can i test Browser widget?
By: Cho HyunJong on Thu, 29 December 2016
1 16608 Tue, 17 January 2017 14:39
By: Artem Kovalev
  Test login dialog before workbenchWindowAdvisor starts
By: Cho HyunJong on Thu, 29 December 2016
2 1712 Thu, 29 December 2016 10:36
By: Cho HyunJong
  Can I use ECL as macro inside my IDE?
ECL as Eclipse macro language
By: Peter Kirschner on Mon, 19 December 2016
1 15866 Wed, 01 February 2017 15:08
By: Hans-Peter Schreiter
  NPE from RcpttRapLaunchDelegate
I'm getting a NPE when trying to launch RAP AUT
By: Andre Popa on Fri, 16 December 2016
2 898 Tue, 20 December 2016 12:03
By: Andre Popa
  gogo: InterruptedException: sleep interrupted on RCPTT 2.1 official
gogo: InterruptedException: sleep interrupted on RCPTT 2.1 official
By: Krzysztof Jozefowicz on Fri, 16 December 2016
1 804 Fri, 16 December 2016 08:37
By: Artem Kovalev
  How to access resource via JNDI in RCPTT
Can't access resource via JNDI while running RCPTT
By: Nick Gr on Wed, 14 December 2016
2 925 Fri, 16 December 2016 22:54
By: Nick Gr
  RCPTT RAP testing with a deployed application
RCPTT RAP testing with a deployed application
By: Rob B. on Tue, 13 December 2016
2 1722 Fri, 16 December 2016 23:03
By: Rob B.
  problems converting long
By: Violaine Batthish on Wed, 07 December 2016
1 4388 Fri, 16 December 2016 09:31
By: Artem Kovalev
  Explicit refresh with F5 key doesn't work in diagram and table editors
Regarding the keys usage
By: Sambasivarao Akula on Fri, 02 December 2016
2 5906 Wed, 21 December 2016 09:21
By: Sambasivarao Akula
  AUT workspace changing test does not work normally.
By: Cho HyunJong on Fri, 02 December 2016
2 6564 Thu, 29 December 2016 04:24
By: Cho HyunJong
  RCPTT cannot record a SWT based application
By: Mohamed Nafea on Thu, 01 December 2016
3 4203 Tue, 17 January 2017 15:38
By: Artem Kovalev
  Support for Nebula TableCombo
By: Michael Barrett-Lennard on Mon, 28 November 2016
0 4111 Mon, 28 November 2016 07:26
By: Michael Barrett-Lennard
icon5.gif When I run a test suite from JENKINS sometimes is to able to complete the execution and return an ex
#JENKINS #Exception_in_thread_"Output Stream Monitor"
By: Angelo Luciani on Thu, 17 November 2016
0 58276 Thu, 17 November 2016 16:05
By: Angelo Luciani
  Try-Catch-Exception
need to retrieve exception message in rcptt
By: Md. Mosiur Rahman Palash on Thu, 17 November 2016
0 61338 Thu, 17 November 2016 09:56
By: Md. Mosiur Rahman Palash
  Select a data in a list
How to select a data of a list, without providing its value ?
By: francois quetin on Wed, 16 November 2016
0 49955 Wed, 16 November 2016 17:12
By: francois quetin
icon5.gif If I run the test suite using Jenkins results a lot of FAIL test cases.
JENKINS FAILED TEST CASES Exception java.lang.Throwable: java.lang.Throwable: java.lang.Throwable: org.eclipse.swt.SWTError: Item not added
By: Angelo Luciani on Mon, 14 November 2016
0 63468 Mon, 14 November 2016 11:14
By: Angelo Luciani
  Set workspace or autWsPrefix in pom.xml
how to set aut workspace
By: Abhishek Chakraborty on Tue, 08 November 2016
0 17020 Tue, 08 November 2016 15:16
By: Abhishek Chakraborty
  java.lang.OutOfMemoryError: Java heap space in Runner
236 test cases, after about 170 runner exits with java.lang.OutOfMemoryError: Java heap space
By: Marcus Höpfner on Fri, 04 November 2016
6 2141 Mon, 09 January 2017 09:33
By: Marcus Höpfner
  documentation on exec-with-options
IDE generated this method when verifying a status popup,
By: Walt Stone on Wed, 19 October 2016
0 9354 Wed, 19 October 2016 15:51
By: Walt Stone
  How to setup what java version to create projects
By: Agustin Celentano on Tue, 18 October 2016
0 12568 Tue, 18 October 2016 18:59
By: Agustin Celentano
  How to use Context from different project in Runner
When using runner I can not execute a context ECL file from another project
By: Walt Stone on Tue, 18 October 2016
0 12820 Tue, 18 October 2016 14:26
By: Walt Stone
  How to verify that menu items contains a separator
By: smaoui asma on Thu, 13 October 2016
0 9053 Thu, 13 October 2016 23:39
By: smaoui asma
  Custom ECL Commands
Returning a value from the custom command to the code where it was called
By: Komal Sorte on Wed, 12 October 2016
2 9513 Fri, 16 December 2016 10:42
By: Artem Kovalev
  Failing to launch RCPTT on my Application
By: Benjamin Davis on Mon, 10 October 2016
3 1829 Fri, 28 October 2016 15:27
By: Benjamin Davis
  Failed to execute context: ClearWorkspace
By: Tu Ton on Mon, 10 October 2016
1 1467 Wed, 12 October 2016 02:36
By: Andrey Sobolev
  Testing the e4 RCP sample programm
By: Harald Kornmayer on Fri, 07 October 2016
3 1595 Wed, 12 October 2016 09:51
By: Harald Kornmayer
  Failed to find org.eclipse.rcptt.tesla.swt.rap.workbenchProvider extension.
Failed to find org.eclipse.rcptt.tesla.swt.rap.workbenchProvider extension.
By: Andre Popa on Wed, 05 October 2016
2 3022 Sat, 15 October 2016 12:55
By: Artem Kovalev
icon5.gif RCPTT to parameterize test cases
RCPTT doesnt provide option to parameterize test cases, I would like to extend RCPTT to allow parameterize test cases
By: Sandhya Kumari on Sun, 02 October 2016
1 2597 Wed, 12 October 2016 03:05
By: Andrey Sobolev
  Bad call to getCoolBarManager()
By: Tirtho De on Wed, 28 September 2016
1 4168 Wed, 12 October 2016 03:10
By: Andrey Sobolev
  Declare variables and pass the values during execution !
By: surin komi on Wed, 28 September 2016
2 5867 Wed, 19 October 2016 10:57
By: surin komi
  Parameters in launch contexts?
By: Joel Matthews on Fri, 23 September 2016
0 3383 Fri, 23 September 2016 13:47
By: Joel Matthews
  Stop test suite when a test fails
By: Agustin Celentano on Thu, 22 September 2016
0 3152 Thu, 22 September 2016 01:40
By: Agustin Celentano
  How to handle dynamic parameter values using RCPTT ECL commands ?
By: surin komi on Tue, 20 September 2016
0 2673 Tue, 20 September 2016 02:37
By: surin komi
  get-nebula-grid error with RCPTT 2.1.0 and Eclipse 4.6 Neo
By: Georg Koch on Mon, 19 September 2016
2 3770 Mon, 24 October 2016 04:02
By: Artem Kovalev
icon6.gif [Solve] RAP Testing tool start
By: Cho HyunJong on Fri, 16 September 2016
1 1332 Sat, 17 September 2016 18:30
By: Cho HyunJong
  Cannot restart AUT inside IF section
wait-until-eclipse-is-ready failure when it is invoked in some code section
By: Hicyo LA on Fri, 16 September 2016
1 943 Fri, 16 September 2016 10:26
By: Tomasz Od
  RCPTT Does not run on Ubuntu
Latest RCPTT does not run on ubuntu environment
By: Md. Mosiur Rahman Palash on Thu, 08 September 2016
0 3536 Thu, 08 September 2016 04:41
By: Md. Mosiur Rahman Palash
  RCPTT Does not run on Ubuntu
Latest RCPTT does not run on ubuntu environment
By: Md. Mosiur Rahman Palash on Thu, 08 September 2016
0 3464 Thu, 08 September 2016 04:41
By: Md. Mosiur Rahman Palash
  Popup dialog window
By: Cho HyunJong on Tue, 06 September 2016
0 3130 Tue, 06 September 2016 23:55
By: Cho HyunJong
  Error while connecting two components with mouse (org.eclipse.rcptt.tesla.gef)
By: Oguz Yildirim on Mon, 05 September 2016
0 2731 Mon, 05 September 2016 14:42
By: Oguz Yildirim
  Failed to launch RCPTT runner.
By: Gabi Baba on Fri, 02 September 2016
2 32333 Wed, 01 March 2017 07:40
By: Andreas Falter
  SWING UI Automation
Recording SWING UI
By: amit Mising name on Thu, 01 September 2016
2 779 Fri, 02 September 2016 08:23
By: amit Mising name
  How to use tab next key to move next control
proper usage of keyboard buttons to travelling across the screen
By: Imre Molnar on Mon, 29 August 2016
1 30244 Sun, 04 September 2016 10:58
By: Imre Molnar
  get-label when text has underscores?
how to get a combo-box whose label has all underscored characters
By: Steven Hovater on Fri, 26 August 2016
0 1725 Fri, 26 August 2016 20:51
By: Steven Hovater
  Nightly build git repo
Where can I find the nightly build git repo
By: András Danyi on Fri, 19 August 2016
0 3460 Fri, 19 August 2016 11:59
By: András Danyi
  How to configure pom.xml file to run test suit from Jenkins, without building the application
How to configure pom.xml file to run test suit from Jenkins, without building the application
By: Rajesh Singh on Tue, 16 August 2016
0 4304 Tue, 16 August 2016 12:53
By: Rajesh Singh
  rcptt process was terminated while waiting for aut startup data
calls DebugDisplayAspect.logStackTrace till SWTError: No more callbacks
By: András Danyi on Mon, 15 August 2016
3 2327 Thu, 18 August 2016 14:08
By: András Danyi
icon7.gif [SOLVED] Get the current time using RCPTT
#current_time
By: Angelo Luciani on Thu, 11 August 2016
2 1158 Thu, 11 August 2016 12:12
By: Angelo Luciani
  Difference in the results obtained for test cases from JENKINS and RCPTT IDE
The test run on RCPTT IDE passes all the time, but when the same is run on JENKINS it fails.
By: Ranjitha Devaraju on Tue, 09 August 2016
1 1756 Thu, 11 August 2016 09:46
By: Angelo Luciani
  Resolving AUT in maven
By: Daniel K. on Mon, 08 August 2016
0 2430 Mon, 08 August 2016 12:16
By: Daniel K.
  RCPTT RAP support.
RCPTT can now test Eclipse RAP Applications.
By: Ulyana Skorokhodova on Fri, 05 August 2016
1 2119 Tue, 06 September 2016 23:30
By: Cho HyunJong
  how to use listen api for AUT's console log
how to use listen api for AUT's console log
By: Shilpee Kh on Wed, 03 August 2016
0 2292 Wed, 03 August 2016 06:55
By: Shilpee Kh
  Runner exit codes
help
By: Joseph Chantiny on Thu, 28 July 2016
0 2287 Thu, 28 July 2016 19:20
By: Joseph Chantiny
  AUT based on target platform works but AUT based on final does not work
By: Joseph Chantiny on Thu, 28 July 2016
1 563 Thu, 28 July 2016 14:38
By: Joseph Chantiny
  selecting item in table based on the 2nd column value
selecting item in table based on the 2nd column value
By: karthik krishnamoorthy on Thu, 28 July 2016
1 475 Thu, 28 July 2016 10:38
By: Ulyana Skorokhodova
  Debugging custom ECL commands
By: Pascal Rapicault on Mon, 25 July 2016
1 416 Mon, 25 July 2016 16:43
By: Pascal Rapicault
  Error: Failed to find org.eclipse.rcptt.tesla.swt.workbenchProvider extension. Is org.eclipse.rcptt
By: jeremie gr on Wed, 20 July 2016
4 2711 Mon, 13 February 2017 07:53
By: jeremie gr
  Here we can post Job positions
#job_positions
By: Angelo Luciani on Mon, 18 July 2016
0 4674 Mon, 18 July 2016 09:00
By: Angelo Luciani
  Problems with Nebula Nattalbe
By: Miguel Moreo on Fri, 15 July 2016
0 2721 Fri, 15 July 2016 12:53
By: Miguel Moreo
  How to store value in variable
I want to get value from editbox and store it in variable.
By: Aditya Mahakulkar on Thu, 14 July 2016
3 2399 Thu, 11 August 2016 12:54
By: Agustin Celentano
  Checking checkbox results to error org.eclipse.rcptt.tesla.core
Checkbox manipulation and org.eclipse.rcptt.tesla.core error
By: Vanta Black on Thu, 14 July 2016
0 3259 Thu, 14 July 2016 04:05
By: Vanta Black
  get-item doesn't find tree node given tree node name
By: Endi Wu on Tue, 12 July 2016
4 1102 Thu, 14 July 2016 19:03
By: Endi Wu
  Unable to select Records from column if column name is "I/O Name"
Unable to select Records from column if column name is "I/O Name"
By: Rajesh Singh on Mon, 11 July 2016
1 1171 Wed, 13 July 2016 03:46
By: Rajesh Singh
  Change AUT workspace in POM file using maven plugin
By: Alfonso Rios on Fri, 08 July 2016
1 2484 Tue, 08 November 2016 13:42
By: Abhishek Chakraborty
  how to select the tree item which has special character special character
By: karthik krishnamoorthy on Tue, 05 July 2016
2 881 Wed, 06 July 2016 04:46
By: karthik krishnamoorthy
  How to check New pop up window ?
By: karthik krishnamoorthy on Tue, 05 July 2016
2 3804 Wed, 24 August 2016 11:51
By: karthik krishnamoorthy
  Unable to launch RCPTT 2.1
Unable to launch RCPTT
By: veena uppar on Thu, 30 June 2016
3 1528 Tue, 05 July 2016 06:00
By: Andrey Sobolev
  Unable to Launch AUT with RCPTT
AUT Launch Issue as message displays root constraints are not resolved
By: Rajesh Singh on Thu, 30 June 2016
3 3788 Thu, 01 September 2016 05:46
By: Rajesh Singh
  e4Application
By: Hilger Steenblock on Tue, 28 June 2016
4 1369 Mon, 12 September 2016 13:05
By: Rajesh Singh
  Custom Reporting
Custom reports using Junit
By: Amit Kumar on Mon, 27 June 2016
4 3405 Fri, 10 March 2017 15:21
By: Shilpee Kh
icon9.gif AUT does not run (but the same application with the same RCPTT version Works in another computer )
#Version: 2.0.2 M4 #AUT does not run (but the same application with the same RCPTT version Works in another computer )
By: Angelo Luciani on Fri, 24 June 2016
1 3947 Tue, 05 July 2016 06:42
By: Andrey Sobolev
icon9.gif [SOLVED] rcptt ide 2.1.0
rcptt ide 2.1.0 issue JAVA 1.7
By: Angelo Luciani on Thu, 23 June 2016
3 3150 Thu, 30 June 2016 16:16
By: Andrey Sobolev
  RCPTT test result should be integrate with sonar
Test result should be viewable in sonar
By: karthik krishnamoorthy on Thu, 23 June 2016
0 3629 Thu, 23 June 2016 05:51
By: karthik krishnamoorthy
  Runner.cmd
How to run test cases using command line
By: Aditya Mahakulkar on Tue, 21 June 2016
1 1471 Wed, 22 June 2016 07:57
By: Angelo Luciani
icon5.gif Different results between Jenkins and test cases run from RCPTT IDE
#Jenkins #RCPTT_IDE #different_results #frustrating
By: Angelo Luciani on Tue, 21 June 2016
1 4772 Tue, 05 July 2016 06:47
By: Andrey Sobolev
icon5.gif [SOLVED] When I run some test from Jenkins, It opens 2 distinct AUT (Application Under Test)
#AUT_contains_both_launcher_plugins #Jenkins #AUT #configurations #double_AUT
By: Angelo Luciani on Tue, 21 June 2016
2 4702 Thu, 10 November 2016 17:31
By: Angelo Luciani
icon5.gif Exception: org.eclipse.swt.SWTException: Widget is disposed
By: Minnie P on Thu, 16 June 2016
2 3167 Tue, 21 June 2016 13:26
By: Angelo Luciani
icon9.gif AUT from sources
Launching RCPTT tests on AUT from sources (runtime workbench) hangs
By: John Moule on Tue, 14 June 2016
1 2165 Fri, 17 June 2016 16:24
By: John Moule
  org.osgi.framework.BundleException when starting AUT with RCPTT
multiple errors loading my AUT with RCPTT for testing
By: Walt Stone on Mon, 13 June 2016
1 3739 Tue, 05 July 2016 06:54
By: Andrey Sobolev
  Recording Editor issue in Eclipse AUT vs. Application Under Test (RCPTT)
By: Tim Kosacek on Fri, 10 June 2016
1 2795 Tue, 05 July 2016 06:59
By: Andrey Sobolev
  Does ECL map support multiple dimensions?
Can ECL map entries also be map entries
By: Walt Stone on Tue, 07 June 2016
0 3344 Tue, 07 June 2016 15:53
By: Walt Stone
  matching complex xml text
what dielect of regex is implemnented in ECL for matches?
By: Walt Stone on Mon, 06 June 2016
0 3715 Mon, 06 June 2016 14:37
By: Walt Stone
  How to wait until an upgrade is done.
By: Agustin Celentano on Sun, 05 June 2016
1 4490 Tue, 05 July 2016 07:15
By: Andrey Sobolev
  Bypass the waiting time for the loading the entities under a tree
By: Vanta Black on Tue, 31 May 2016
2 4133 Tue, 05 July 2016 08:56
By: Vanta Black
  set-text for integer doesn't work
set-text for integer doesn't work
By: Vanta Black on Tue, 31 May 2016
4 1556 Tue, 31 May 2016 09:22
By: Vanta Black
  Pass params to tests through Maven
By: Agustin Celentano on Tue, 31 May 2016
2 2510 Sun, 05 June 2016 14:52
By: Agustin Celentano
  RCPTT cannot recognize the plugin dropdown list while replaying
customer plugin dropdown list can not be found while replaying with RCPTT
By: Gabriel Zhang on Fri, 27 May 2016
0 3028 Fri, 27 May 2016 09:09
By: Gabriel Zhang
  Release pom.xml files have parent pom versions ending with -SNAPSHOT
By: Fabian Baboschi on Tue, 24 May 2016
0 2269 Tue, 24 May 2016 12:29
By: Fabian Baboschi
  Error using the drag-action cmd
When using the drag-action cmd, error, "Scriplet DragAction not found", is issued
By: Dave Dresser on Mon, 23 May 2016
0 2195 Mon, 23 May 2016 17:06
By: Dave Dresser
  ECL: Double click on TreeItem cell
By: Richard Meyer on Mon, 23 May 2016
3 4576 Wed, 22 June 2016 08:52
By: Angelo Luciani
  Error in connecting BIRT withe SQLserver 2014
org.eclipse.birt.report.data.oda.jdbc.JDBCException: There is an error in get connection, Login failed for user
By: ness info on Sun, 22 May 2016
1 3247 Mon, 30 May 2016 05:45
By: Andrey Sobolev
  Installing custom plugins on RCPTT configured AUT instance using p2 update-site
By: Vishal Purohit on Fri, 20 May 2016
2 2882 Thu, 16 June 2016 19:25
By: Vishal Purohit
  Cannot launch AUT
Cannot launch aut with rcptt
By: romain ognier on Fri, 13 May 2016
1 5860 Mon, 30 May 2016 06:25
By: Andrey Sobolev
  Using relative path
Loading a file we need to use a relative path
By: karthik krishnamoorthy on Fri, 13 May 2016
1 6367 Mon, 30 May 2016 06:28
By: Andrey Sobolev
  Issue in recording
Getting nullpointer Exception at org.eclipse.ui.internal.ViewReference.getPartName(ViewReference.java:69)
By: karthik krishnamoorthy on Thu, 12 May 2016
1 6213 Mon, 30 May 2016 07:20
By: Andrey Sobolev
  Integre My own java class on RCPTT IDE
By: jeremie gr on Wed, 11 May 2016
4 7712 Tue, 12 July 2016 15:40
By: jeremie gr
  Accessing a window by name
Facing problem in Getting a window named "Filter & Find"
By: Rohit Patel on Wed, 11 May 2016
1 4546 Mon, 30 May 2016 07:08
By: Andrey Sobolev
  Error in loop / recur?
recur does not seem to work in certain situations
By: Hans-Peter Schreiter on Wed, 04 May 2016
1 4943 Wed, 01 June 2016 17:09
By: Hans-Peter Schreiter
  verification of partial text
verify only the fixed part of the text
By: Walt Stone on Wed, 04 May 2016
1 5567 Thu, 19 May 2016 11:37
By: Pete Eremeykin
  RCPTT Hangs because of a loading window present in AUT
RCPTT Hangs because of a loading window present in AUT
By: Vanta Black on Wed, 04 May 2016
0 4464 Wed, 04 May 2016 11:33
By: Vanta Black
  GEF3 validation selects the properties of Figure rather than EditPart
By: ModelGeek Mising name on Wed, 04 May 2016
0 4754 Wed, 04 May 2016 09:23
By: ModelGeek Mising name
  Concat a list of strings
By: Eddy Cheong on Tue, 03 May 2016
2 4847 Wed, 22 June 2016 08:10
By: Angelo Luciani
  TOD in logs and/or reports
I need the Time-Of-Day to debug remote dependent error issues
By: Walt Stone on Tue, 03 May 2016
0 4336 Tue, 03 May 2016 17:10
By: Walt Stone
  Relative-Path for exec-process
By: Jeanie Suparman on Fri, 29 April 2016
1 4954 Tue, 31 May 2016 10:02
By: Hicyo LA
  Aut-Arg from pom.xml wrongly passed
By: Marcus Höpfner on Thu, 28 April 2016
2 5147 Mon, 09 May 2016 07:06
By: Marcus Höpfner
  Can't add bundle pool based installation as AUT
By: Alexander Koptelov on Fri, 22 April 2016
2 1538 Fri, 22 April 2016 13:06
By: Alexander Koptelov
Goto Forum:
  
Legend New Messages New Messages   No New messages No New messages   Locked (w/ unread messages) Locked (w/ unread messages)   Locked Locked   Moved to another forum Moved to another forum

Current Time: Sun Dec 17 16:04:35 GMT 2017

Powered by FUDForum. Page generated in 0.02263 seconds
.:: Contact :: Home ::.

Powered by: FUDforum 3.0.2.
Copyright ©2001-2010 FUDforum Bulletin Board Software