Skip to main content


Eclipse Community Forums
Forum Search:

Search      Help    Register    Login    Home
Home » Eclipse Projects » Plugin Development Environment (PDE) » p2 director can't find binary,org.eclipse.equinox.executable_root
p2 director can't find binary,org.eclipse.equinox.executable_root [message #55503] Thu, 16 April 2009 02:45 Go to next message
Eclipse UserFriend
Originally posted by: wbeckwith.gmail.com

The director complains of not finding the
org.eclipse.equinox.executable_root binary @ version
3.3.200.v20090306-1900-7M-FhJFHQfz-5DbTcLIwDaa. Where is this coming
from? Since I'm building a windows product with a windows SDK pointed
at a target with Eclipse 3.5M6 SDK + Eclipse 3.5M6 Delta Pack, there
should be no reason it can't find the executable I imagine.

1.) Where is this org.eclipse.equinox.executable_root
plugin/feature/fragment?

2.) What does the director application used it for?

If I can get those question answered then I can hopefully get a product
actually provisioned.



runDirector:
Project base dir set to: D:\dev\workspace-main\lisa-product.builder\build
[ant] calling target(s) [runDirector] in build file
D:\dev\eclipse-3.5M6\plugins\org.eclipse.pde.build_3.5.0.v20 090312-1500\scripts\genericTargets.xml
parsing buildfile
D:\dev\eclipse-3.5M6\plugins\org.eclipse.pde.build_3.5.0.v20 090312-1500\scripts\genericTargets.xml
with URI =
file:/D:/dev/eclipse-3.5M6/plugins/org.eclipse.pde.build_3.5 .0.v20090312-1500/scripts/genericTargets.xml
Project base dir set to: D:\dev\workspace-main\lisa-product.builder\build
Override ignored for property "configs"
Override ignored for property "fetchTag"
Override ignored for property "customEESources"
Override ignored for property "transformedRepoLocation"
Override ignored for property "buildingOSGi"
Override ignored for property "generateJnlp"
Override ignored for property "signJars"
Override ignored for property "generateFeatureVersionSuffix"
Override ignored for property "generateVersionsLists"
Override ignored for property "groupConfigurations"
Override ignored for property "pluginPath"
Override ignored for property "filteredDependencyCheck"
Override ignored for property "filterP2Base"
[ant] Entering
D:\dev\eclipse-3.5M6\plugins\org.eclipse.pde.build_3.5.0.v20 090312-1500\scripts\genericTargets.xml...
Build sequence for target(s) `runDirector' is [runDirector]
Complete build sequence is [runDirector, noDefault, transformRepos,
init, assembleElement, processElement, processFlat, gatherLogs,
gatherSources, packageElement, processViaFeature, generateScript,
fetchElement, gatherBinaries, cleanElement, ]

runDirector:
Override ignored for property "p2.director.version"
[java] Executing 'C:\jdk1.5.x\jre\bin\java.exe' with arguments:
[java]
'-Declipse.p2.data.area=D:\dev\workspace-main\lisa-product.b uilder/build/tmp/eclipse/p2'
[java] '-Declipse.p2.MD5Check=false'
[java] '-jar'
[java]
'D:\dev\eclipse-3.5M6\plugins\org.eclipse.equinox.launcher_1 .0.200.v20090306-1900.jar'
[java] '-application'
[java] 'org.eclipse.equinox.p2.director.app.application'
[java] '-nosplash'
[java] '--launcher.suppressErrors'
[java] '-consoleLog'
[java] '-flavor'
[java] 'tooling'
[java] '-installIU'
[java] 'com.itko.lisa.workstation.product'
[java] '-version'
[java] '1.0.0'
[java] '-p2.os'
[java] 'win32'
[java] '-p2.ws'
[java] 'win32'
[java] '-p2.arch'
[java] 'x86'
[java] '-roaming'
[java] '-profile'
[java] 'profile'
[java] '-profileProperties'
[java] 'org.eclipse.update.install.features=true'
[java] '-metadataRepository'
[java]
'file:D:\dev\workspace-main\lisa-product.builder/build/build Repo'
[java] '-artifactRepository'
[java]
'file:D:\dev\workspace-main\lisa-product.builder/build/build Repo'
[java] '-destination'
[java] 'D:\dev\workspace-main\lisa-product.builder/build/tmp/eclips e'
[java] '-bundlepool'
[java] 'D:\dev\workspace-main\lisa-product.builder/build/tmp/eclips e'
[java]
[java] The ' characters around the executable and arguments are
[java] not part of the command.
[java] Installing com.itko.lisa.workstation.product 1.0.0.
[java] Installation failed.
[java] !SESSION 2009-04-15 19:10:19.179
-----------------------------------------------
[java] eclipse.buildId=I20090313-0100
[java] java.version=1.5.0_17
[java] java.vendor=Sun Microsystems Inc.
[java] BootLoader constants: OS=win32, ARCH=x86, WS=win32, NL=en_US
[java] Framework arguments: -application
org.eclipse.equinox.p2.director.app.application
--launcher.suppressErrors -flavor tooling -installIU
com.itko.lisa.workstation.product -version 1.0.0 -p2.os win32 -p2.ws
win32 -p2.arch x86 -roaming -profile profile -profileProperties
org.eclipse.update.install.features=true -metadataRepository
file:D:\dev\workspace-main\lisa-product.builder/build/buildR epo
-artifactRepository
file:D:\dev\workspace-main\lisa-product.builder/build/buildR epo
-destination
D:\dev\workspace-main\lisa-product.builder/build/tmp/eclipse -bundlepool
D:\dev\workspace-main\lisa-product.builder/build/tmp/eclipse
[java] Command-line arguments: -application
org.eclipse.equinox.p2.director.app.application
--launcher.suppressErrors -consoleLog -flavor tooling -installIU
com.itko.lisa.workstation.product -version 1.0.0 -p2.os win32 -p2.ws
win32 -p2.arch x86 -roaming -profile profile -profileProperties
org.eclipse.update.install.features=true -metadataRepository
file:D:\dev\workspace-main\lisa-product.builder/build/buildR epo
-artifactRepository
file:D:\dev\workspace-main\lisa-product.builder/build/buildR epo
-destination
D:\dev\workspace-main\lisa-product.builder/build/tmp/eclipse -bundlepool
D:\dev\workspace-main\lisa-product.builder/build/tmp/eclipse
[java]
[java] !ENTRY org.eclipse.equinox.p2.engine 4 4 2009-04-15
19:10:31.557
[java] !MESSAGE An error occurred while collecting items to be
installed
[java] !SUBENTRY 1 org.eclipse.equinox.p2.engine 4 0 2009-04-15
19:10:31.557
[java] !MESSAGE session context was:(profile=profile, phase=,
operand=, action=).
[java] !SUBENTRY 1 org.eclipse.equinox.p2.artifact.repository 4 0
2009-04-15 19:10:31.557
[java] !MESSAGE No repository found containing:
binary,org.eclipse.equinox.executable_root,3.3.200.v20090306 -1900-7M-FhJFHQfz-5DbTcLIwDaa
[ant] Exiting
D:\dev\eclipse-3.5M6\plugins\org.eclipse.pde.build_3.5.0.v20 090312-1500\scripts\genericTargets.xml.
[antcall] Exiting
D:\dev\workspace-main\lisa-product.builder\build\package.org .eclipse.pde.build.container.feature.win32.win32.x86.xml.
[ant] Exiting
D:\dev\workspace-main\lisa-product.builder\build\package.org .eclipse.pde.build.container.feature.win32.win32.x86.xml.
[ant] Exiting
D:\dev\workspace-main\lisa-product.builder\customTargets.xml .
[ant] Exiting
D:\dev\workspace-main\lisa-product.builder\build\package.org .eclipse.pde.build.container.feature.all.xml.
[ant] Exiting
D:\dev\eclipse-3.5M6\plugins\org.eclipse.pde.build_3.5.0.v20 090312-1500\scripts\genericTargets.xml.
[antcall] Exiting
D:\dev\workspace-main\lisa-product.builder\customTargets.xml .
[ant] Exiting
D:\dev\workspace-main\lisa-product.builder\customTargets.xml .
[antcall] Exiting
D:\dev\eclipse-3.5M6\plugins\org.eclipse.pde.build_3.5.0.v20 090312-1500\scripts\productBuild\productBuild.xml.

BUILD FAILED
D:\dev\eclipse-3.5M6\plugins\org.eclipse.pde.build_3.5.0.v20 090312-1500\scripts\productBuild\productBuild.xml:32:
The following error occurred while executing this line:
D:\dev\eclipse-3.5M6\plugins\org.eclipse.pde.build_3.5.0.v20 090312-1500\scripts\build.xml:115:
The following error occurred while executing this line:
D:\dev\workspace-main\lisa-product.builder\customTargets.xml :12: The
following error occurred while executing this line:
D:\dev\eclipse-3.5M6\plugins\org.eclipse.pde.build_3.5.0.v20 090312-1500\scripts\productBuild\allElements.xml:10:
The following error occurred while executing this line:
D:\dev\eclipse-3.5M6\plugins\org.eclipse.pde.build_3.5.0.v20 090312-1500\scripts\genericTargets.xml:182:
The following error occurred while executing this line:
D:\dev\workspace-main\lisa-product.builder\build\package.org .eclipse.pde.build.container.feature.all.xml:23:
The following error occurred while executing this line:
D:\dev\workspace-main\lisa-product.builder\build\package.org .eclipse.pde.build.container.feature.all.xml:15:
The following error occurred while executing this line:
D:\dev\eclipse-3.5M6\plugins\org.eclipse.pde.build_3.5.0.v20 090312-1500\scripts\productBuild\allElements.xml:44:
The following error occurred while executing this line:
D:\dev\workspace-main\lisa-product.builder\build\package.org .eclipse.pde.build.container.feature.win32.win32.x86.xml:89:
The following error occurred while executing this line:
D:\dev\workspace-main\lisa-product.builder\build\package.org .eclipse.pde.build.container.feature.win32.win32.x86.xml:766 :
The following error occurred while executing this line:
D:\dev\eclipse-3.5M6\plugins\org.eclipse.pde.build_3.5.0.v20 090312-1500\scripts\genericTargets.xml:213:
Java returned: 13

Wb
Re: p2 director can't find binary,org.eclipse.equinox.executable_root [message #56265 is a reply to message #55503] Thu, 16 April 2009 20:13 Go to previous messageGo to next message
Andrew Niefer is currently offline Andrew NieferFriend
Messages: 990
Registered: July 2009
Senior Member
This is a bug, I raised 272572.

You are probably including the org.eclipse.equinox.executable feature
directly in your product. If you removed it and instead let it be
automatically included, then you will probably be able to install.

-Andrew
Wendell Beckwith wrote:
> The director complains of not finding the
> org.eclipse.equinox.executable_root binary @ version
> 3.3.200.v20090306-1900-7M-FhJFHQfz-5DbTcLIwDaa. Where is this coming
> from? Since I'm building a windows product with a windows SDK pointed
> at a target with Eclipse 3.5M6 SDK + Eclipse 3.5M6 Delta Pack, there
> should be no reason it can't find the executable I imagine.
>
> 1.) Where is this org.eclipse.equinox.executable_root
> plugin/feature/fragment?
>
> 2.) What does the director application used it for?
>
> If I can get those question answered then I can hopefully get a product
> actually provisioned.
>
>
>
> runDirector:
> Project base dir set to: D:\dev\workspace-main\lisa-product.builder\build
> [ant] calling target(s) [runDirector] in build file
> D:\dev\eclipse-3.5M6\plugins\org.eclipse.pde.build_3.5.0.v20 090312-1500\scripts\genericTargets.xml
>
> parsing buildfile
> D:\dev\eclipse-3.5M6\plugins\org.eclipse.pde.build_3.5.0.v20 090312-1500\scripts\genericTargets.xml
> with URI =
> file:/D:/dev/eclipse-3.5M6/plugins/org.eclipse.pde.build_3.5 .0.v20090312-1500/scripts/genericTargets.xml
>
> Project base dir set to: D:\dev\workspace-main\lisa-product.builder\build
> Override ignored for property "configs"
> Override ignored for property "fetchTag"
> Override ignored for property "customEESources"
> Override ignored for property "transformedRepoLocation"
> Override ignored for property "buildingOSGi"
> Override ignored for property "generateJnlp"
> Override ignored for property "signJars"
> Override ignored for property "generateFeatureVersionSuffix"
> Override ignored for property "generateVersionsLists"
> Override ignored for property "groupConfigurations"
> Override ignored for property "pluginPath"
> Override ignored for property "filteredDependencyCheck"
> Override ignored for property "filterP2Base"
> [ant] Entering
> D:\dev\eclipse-3.5M6\plugins\org.eclipse.pde.build_3.5.0.v20 090312-1500\scripts\genericTargets.xml...
>
> Build sequence for target(s) `runDirector' is [runDirector]
> Complete build sequence is [runDirector, noDefault, transformRepos,
> init, assembleElement, processElement, processFlat, gatherLogs,
> gatherSources, packageElement, processViaFeature, generateScript,
> fetchElement, gatherBinaries, cleanElement, ]
>
> runDirector:
> Override ignored for property "p2.director.version"
> [java] Executing 'C:\jdk1.5.x\jre\bin\java.exe' with arguments:
> [java]
> '-Declipse.p2.data.area=D:\dev\workspace-main\lisa-product.b uilder/build/tmp/eclipse/p2'
>
> [java] '-Declipse.p2.MD5Check=false'
> [java] '-jar'
> [java]
> 'D:\dev\eclipse-3.5M6\plugins\org.eclipse.equinox.launcher_1 .0.200.v20090306-1900.jar'
>
> [java] '-application'
> [java] 'org.eclipse.equinox.p2.director.app.application'
> [java] '-nosplash'
> [java] '--launcher.suppressErrors'
> [java] '-consoleLog'
> [java] '-flavor'
> [java] 'tooling'
> [java] '-installIU'
> [java] 'com.itko.lisa.workstation.product'
> [java] '-version'
> [java] '1.0.0'
> [java] '-p2.os'
> [java] 'win32'
> [java] '-p2.ws'
> [java] 'win32'
> [java] '-p2.arch'
> [java] 'x86'
> [java] '-roaming'
> [java] '-profile'
> [java] 'profile'
> [java] '-profileProperties'
> [java] 'org.eclipse.update.install.features=true'
> [java] '-metadataRepository'
> [java]
> 'file:D:\dev\workspace-main\lisa-product.builder/build/build Repo'
> [java] '-artifactRepository'
> [java]
> 'file:D:\dev\workspace-main\lisa-product.builder/build/build Repo'
> [java] '-destination'
> [java] 'D:\dev\workspace-main\lisa-product.builder/build/tmp/eclips e'
> [java] '-bundlepool'
> [java] 'D:\dev\workspace-main\lisa-product.builder/build/tmp/eclips e'
> [java]
> [java] The ' characters around the executable and arguments are
> [java] not part of the command.
> [java] Installing com.itko.lisa.workstation.product 1.0.0.
> [java] Installation failed.
> [java] !SESSION 2009-04-15 19:10:19.179
> -----------------------------------------------
> [java] eclipse.buildId=I20090313-0100
> [java] java.version=1.5.0_17
> [java] java.vendor=Sun Microsystems Inc.
> [java] BootLoader constants: OS=win32, ARCH=x86, WS=win32, NL=en_US
> [java] Framework arguments: -application
> org.eclipse.equinox.p2.director.app.application
> --launcher.suppressErrors -flavor tooling -installIU
> com.itko.lisa.workstation.product -version 1.0.0 -p2.os win32 -p2.ws
> win32 -p2.arch x86 -roaming -profile profile -profileProperties
> org.eclipse.update.install.features=true -metadataRepository
> file:D:\dev\workspace-main\lisa-product.builder/build/buildR epo
> -artifactRepository
> file:D:\dev\workspace-main\lisa-product.builder/build/buildR epo
> -destination
> D:\dev\workspace-main\lisa-product.builder/build/tmp/eclipse -bundlepool
> D:\dev\workspace-main\lisa-product.builder/build/tmp/eclipse
> [java] Command-line arguments: -application
> org.eclipse.equinox.p2.director.app.application
> --launcher.suppressErrors -consoleLog -flavor tooling -installIU
> com.itko.lisa.workstation.product -version 1.0.0 -p2.os win32 -p2.ws
> win32 -p2.arch x86 -roaming -profile profile -profileProperties
> org.eclipse.update.install.features=true -metadataRepository
> file:D:\dev\workspace-main\lisa-product.builder/build/buildR epo
> -artifactRepository
> file:D:\dev\workspace-main\lisa-product.builder/build/buildR epo
> -destination
> D:\dev\workspace-main\lisa-product.builder/build/tmp/eclipse -bundlepool
> D:\dev\workspace-main\lisa-product.builder/build/tmp/eclipse
> [java]
> [java] !ENTRY org.eclipse.equinox.p2.engine 4 4 2009-04-15
> 19:10:31.557
> [java] !MESSAGE An error occurred while collecting items to be
> installed
> [java] !SUBENTRY 1 org.eclipse.equinox.p2.engine 4 0 2009-04-15
> 19:10:31.557
> [java] !MESSAGE session context was:(profile=profile, phase=,
> operand=, action=).
> [java] !SUBENTRY 1 org.eclipse.equinox.p2.artifact.repository 4 0
> 2009-04-15 19:10:31.557
> [java] !MESSAGE No repository found containing:
> binary,org.eclipse.equinox.executable_root,3.3.200.v20090306 -1900-7M-FhJFHQfz-5DbTcLIwDaa
>
> [ant] Exiting
> D:\dev\eclipse-3.5M6\plugins\org.eclipse.pde.build_3.5.0.v20 090312-1500\scripts\genericTargets.xml.
>
> [antcall] Exiting
> D:\dev\workspace-main\lisa-product.builder\build\package.org .eclipse.pde.build.container.feature.win32.win32.x86.xml.
>
> [ant] Exiting
> D:\dev\workspace-main\lisa-product.builder\build\package.org .eclipse.pde.build.container.feature.win32.win32.x86.xml.
>
> [ant] Exiting
> D:\dev\workspace-main\lisa-product.builder\customTargets.xml .
> [ant] Exiting
> D:\dev\workspace-main\lisa-product.builder\build\package.org .eclipse.pde.build.container.feature.all.xml.
>
> [ant] Exiting
> D:\dev\eclipse-3.5M6\plugins\org.eclipse.pde.build_3.5.0.v20 090312-1500\scripts\genericTargets.xml.
>
> [antcall] Exiting
> D:\dev\workspace-main\lisa-product.builder\customTargets.xml .
> [ant] Exiting
> D:\dev\workspace-main\lisa-product.builder\customTargets.xml .
> [antcall] Exiting
> D:\dev\eclipse-3.5M6\plugins\org.eclipse.pde.build_3.5.0.v20 090312-1500\scripts\productBuild\productBuild.xml.
>
>
> BUILD FAILED
> D:\dev\eclipse-3.5M6\plugins\org.eclipse.pde.build_3.5.0.v20 090312-1500\scripts\productBuild\productBuild.xml:32:
> The following error occurred while executing this line:
> D:\dev\eclipse-3.5M6\plugins\org.eclipse.pde.build_3.5.0.v20 090312-1500\scripts\build.xml:115:
> The following error occurred while executing this line:
> D:\dev\workspace-main\lisa-product.builder\customTargets.xml :12: The
> following error occurred while executing this line:
> D:\dev\eclipse-3.5M6\plugins\org.eclipse.pde.build_3.5.0.v20 090312-1500\scripts\productBuild\allElements.xml:10:
> The following error occurred while executing this line:
> D:\dev\eclipse-3.5M6\plugins\org.eclipse.pde.build_3.5.0.v20 090312-1500\scripts\genericTargets.xml:182:
> The following error occurred while executing this line:
> D:\dev\workspace-main\lisa-product.builder\build\package.org .eclipse.pde.build.container.feature.all.xml:23:
> The following error occurred while executing this line:
> D:\dev\workspace-main\lisa-product.builder\build\package.org .eclipse.pde.build.container.feature.all.xml:15:
> The following error occurred while executing this line:
> D:\dev\eclipse-3.5M6\plugins\org.eclipse.pde.build_3.5.0.v20 090312-1500\scripts\productBuild\allElements.xml:44:
> The following error occurred while executing this line:
> D:\dev\workspace-main\lisa-product.builder\build\package.org .eclipse.pde.build.container.feature.win32.win32.x86.xml:89:
> The following error occurred while executing this line:
> D:\dev\workspace-main\lisa-product.builder\build\package.org .eclipse.pde.build.container.feature.win32.win32.x86.xml:766 :
> The following error occurred while executing this line:
> D:\dev\eclipse-3.5M6\plugins\org.eclipse.pde.build_3.5.0.v20 090312-1500\scripts\genericTargets.xml:213:
> Java returned: 13
>
> Wb
Re: p2 director can't find binary,org.eclipse.equinox.executable_root [message #56324 is a reply to message #56265] Thu, 16 April 2009 20:16 Go to previous messageGo to next message
Andrew Niefer is currently offline Andrew NieferFriend
Messages: 990
Registered: July 2009
Senior Member
BTW, this is a binary artifact.
If you look in
D:\dev\workspace-main\lisa-product.builder/build/buildRepo/b inary
you will should see at least
org.eclipse.equinox.executable_root.win32.win32.x86

-Andrew
Andrew Niefer wrote:
> This is a bug, I raised 272572.
>
> You are probably including the org.eclipse.equinox.executable feature
> directly in your product. If you removed it and instead let it be
> automatically included, then you will probably be able to install.
>
> -Andrew
> Wendell Beckwith wrote:
>> The director complains of not finding the
>> org.eclipse.equinox.executable_root binary @ version
>> 3.3.200.v20090306-1900-7M-FhJFHQfz-5DbTcLIwDaa. Where is this coming
>> from? Since I'm building a windows product with a windows SDK pointed
>> at a target with Eclipse 3.5M6 SDK + Eclipse 3.5M6 Delta Pack, there
>> should be no reason it can't find the executable I imagine.
>>
>> 1.) Where is this org.eclipse.equinox.executable_root
>> plugin/feature/fragment?
>>
>> 2.) What does the director application used it for?
>>
>> If I can get those question answered then I can hopefully get a
>> product actually provisioned.
>>
>>
>>
>> runDirector:
>> Project base dir set to: D:\dev\workspace-main\lisa-product.builder\build
>> [ant] calling target(s) [runDirector] in build file
>> D:\dev\eclipse-3.5M6\plugins\org.eclipse.pde.build_3.5.0.v20 090312-1500\scripts\genericTargets.xml
>>
>> parsing buildfile
>> D:\dev\eclipse-3.5M6\plugins\org.eclipse.pde.build_3.5.0.v20 090312-1500\scripts\genericTargets.xml
>> with URI =
>> file:/D:/dev/eclipse-3.5M6/plugins/org.eclipse.pde.build_3.5 .0.v20090312-1500/scripts/genericTargets.xml
>>
>> Project base dir set to: D:\dev\workspace-main\lisa-product.builder\build
>> Override ignored for property "configs"
>> Override ignored for property "fetchTag"
>> Override ignored for property "customEESources"
>> Override ignored for property "transformedRepoLocation"
>> Override ignored for property "buildingOSGi"
>> Override ignored for property "generateJnlp"
>> Override ignored for property "signJars"
>> Override ignored for property "generateFeatureVersionSuffix"
>> Override ignored for property "generateVersionsLists"
>> Override ignored for property "groupConfigurations"
>> Override ignored for property "pluginPath"
>> Override ignored for property "filteredDependencyCheck"
>> Override ignored for property "filterP2Base"
>> [ant] Entering
>> D:\dev\eclipse-3.5M6\plugins\org.eclipse.pde.build_3.5.0.v20 090312-1500\scripts\genericTargets.xml...
>>
>> Build sequence for target(s) `runDirector' is [runDirector]
>> Complete build sequence is [runDirector, noDefault, transformRepos,
>> init, assembleElement, processElement, processFlat, gatherLogs,
>> gatherSources, packageElement, processViaFeature, generateScript,
>> fetchElement, gatherBinaries, cleanElement, ]
>>
>> runDirector:
>> Override ignored for property "p2.director.version"
>> [java] Executing 'C:\jdk1.5.x\jre\bin\java.exe' with arguments:
>> [java]
>> '-Declipse.p2.data.area=D:\dev\workspace-main\lisa-product.b uilder/build/tmp/eclipse/p2'
>>
>> [java] '-Declipse.p2.MD5Check=false'
>> [java] '-jar'
>> [java]
>> 'D:\dev\eclipse-3.5M6\plugins\org.eclipse.equinox.launcher_1 .0.200.v20090306-1900.jar'
>>
>> [java] '-application'
>> [java] 'org.eclipse.equinox.p2.director.app.application'
>> [java] '-nosplash'
>> [java] '--launcher.suppressErrors'
>> [java] '-consoleLog'
>> [java] '-flavor'
>> [java] 'tooling'
>> [java] '-installIU'
>> [java] 'com.itko.lisa.workstation.product'
>> [java] '-version'
>> [java] '1.0.0'
>> [java] '-p2.os'
>> [java] 'win32'
>> [java] '-p2.ws'
>> [java] 'win32'
>> [java] '-p2.arch'
>> [java] 'x86'
>> [java] '-roaming'
>> [java] '-profile'
>> [java] 'profile'
>> [java] '-profileProperties'
>> [java] 'org.eclipse.update.install.features=true'
>> [java] '-metadataRepository'
>> [java]
>> 'file:D:\dev\workspace-main\lisa-product.builder/build/build Repo'
>> [java] '-artifactRepository'
>> [java]
>> 'file:D:\dev\workspace-main\lisa-product.builder/build/build Repo'
>> [java] '-destination'
>> [java]
>> 'D:\dev\workspace-main\lisa-product.builder/build/tmp/eclips e'
>> [java] '-bundlepool'
>> [java]
>> 'D:\dev\workspace-main\lisa-product.builder/build/tmp/eclips e'
>> [java]
>> [java] The ' characters around the executable and arguments are
>> [java] not part of the command.
>> [java] Installing com.itko.lisa.workstation.product 1.0.0.
>> [java] Installation failed.
>> [java] !SESSION 2009-04-15 19:10:19.179
>> -----------------------------------------------
>> [java] eclipse.buildId=I20090313-0100
>> [java] java.version=1.5.0_17
>> [java] java.vendor=Sun Microsystems Inc.
>> [java] BootLoader constants: OS=win32, ARCH=x86, WS=win32, NL=en_US
>> [java] Framework arguments: -application
>> org.eclipse.equinox.p2.director.app.application
>> --launcher.suppressErrors -flavor tooling -installIU
>> com.itko.lisa.workstation.product -version 1.0.0 -p2.os win32 -p2.ws
>> win32 -p2.arch x86 -roaming -profile profile -profileProperties
>> org.eclipse.update.install.features=true -metadataRepository
>> file:D:\dev\workspace-main\lisa-product.builder/build/buildR epo
>> -artifactRepository
>> file:D:\dev\workspace-main\lisa-product.builder/build/buildR epo
>> -destination
>> D:\dev\workspace-main\lisa-product.builder/build/tmp/eclipse
>> -bundlepool D:\dev\workspace-main\lisa-product.builder/build/tmp/eclipse
>> [java] Command-line arguments: -application
>> org.eclipse.equinox.p2.director.app.application
>> --launcher.suppressErrors -consoleLog -flavor tooling -installIU
>> com.itko.lisa.workstation.product -version 1.0.0 -p2.os win32 -p2.ws
>> win32 -p2.arch x86 -roaming -profile profile -profileProperties
>> org.eclipse.update.install.features=true -metadataRepository
>> file:D:\dev\workspace-main\lisa-product.builder/build/buildR epo
>> -artifactRepository
>> file:D:\dev\workspace-main\lisa-product.builder/build/buildR epo
>> -destination
>> D:\dev\workspace-main\lisa-product.builder/build/tmp/eclipse
>> -bundlepool D:\dev\workspace-main\lisa-product.builder/build/tmp/eclipse
>> [java]
>> [java] !ENTRY org.eclipse.equinox.p2.engine 4 4 2009-04-15
>> 19:10:31.557
>> [java] !MESSAGE An error occurred while collecting items to be
>> installed
>> [java] !SUBENTRY 1 org.eclipse.equinox.p2.engine 4 0 2009-04-15
>> 19:10:31.557
>> [java] !MESSAGE session context was:(profile=profile, phase=,
>> operand=, action=).
>> [java] !SUBENTRY 1 org.eclipse.equinox.p2.artifact.repository 4 0
>> 2009-04-15 19:10:31.557
>> [java] !MESSAGE No repository found containing:
>> binary,org.eclipse.equinox.executable_root,3.3.200.v20090306 -1900-7M-FhJFHQfz-5DbTcLIwDaa
>>
>> [ant] Exiting
>> D:\dev\eclipse-3.5M6\plugins\org.eclipse.pde.build_3.5.0.v20 090312-1500\scripts\genericTargets.xml.
>>
>> [antcall] Exiting
>> D:\dev\workspace-main\lisa-product.builder\build\package.org .eclipse.pde.build.container.feature.win32.win32.x86.xml.
>>
>> [ant] Exiting
>> D:\dev\workspace-main\lisa-product.builder\build\package.org .eclipse.pde.build.container.feature.win32.win32.x86.xml.
>>
>> [ant] Exiting
>> D:\dev\workspace-main\lisa-product.builder\customTargets.xml .
>> [ant] Exiting
>> D:\dev\workspace-main\lisa-product.builder\build\package.org .eclipse.pde.build.container.feature.all.xml.
>>
>> [ant] Exiting
>> D:\dev\eclipse-3.5M6\plugins\org.eclipse.pde.build_3.5.0.v20 090312-1500\scripts\genericTargets.xml.
>>
>> [antcall] Exiting
>> D:\dev\workspace-main\lisa-product.builder\customTargets.xml .
>> [ant] Exiting
>> D:\dev\workspace-main\lisa-product.builder\customTargets.xml .
>> [antcall] Exiting
>> D:\dev\eclipse-3.5M6\plugins\org.eclipse.pde.build_3.5.0.v20 090312-1500\scripts\productBuild\productBuild.xml.
>>
>>
>> BUILD FAILED
>> D:\dev\eclipse-3.5M6\plugins\org.eclipse.pde.build_3.5.0.v20 090312-1500\scripts\productBuild\productBuild.xml:32:
>> The following error occurred while executing this line:
>> D:\dev\eclipse-3.5M6\plugins\org.eclipse.pde.build_3.5.0.v20 090312-1500\scripts\build.xml:115:
>> The following error occurred while executing this line:
>> D:\dev\workspace-main\lisa-product.builder\customTargets.xml :12: The
>> following error occurred while executing this line:
>> D:\dev\eclipse-3.5M6\plugins\org.eclipse.pde.build_3.5.0.v20 090312-1500\scripts\productBuild\allElements.xml:10:
>> The following error occurred while executing this line:
>> D:\dev\eclipse-3.5M6\plugins\org.eclipse.pde.build_3.5.0.v20 090312-1500\scripts\genericTargets.xml:182:
>> The following error occurred while executing this line:
>> D:\dev\workspace-main\lisa-product.builder\build\package.org .eclipse.pde.build.container.feature.all.xml:23:
>> The following error occurred while executing this line:
>> D:\dev\workspace-main\lisa-product.builder\build\package.org .eclipse.pde.build.container.feature.all.xml:15:
>> The following error occurred while executing this line:
>> D:\dev\eclipse-3.5M6\plugins\org.eclipse.pde.build_3.5.0.v20 090312-1500\scripts\productBuild\allElements.xml:44:
>> The following error occurred while executing this line:
>> D:\dev\workspace-main\lisa-product.builder\build\package.org .eclipse.pde.build.container.feature.win32.win32.x86.xml:89:
>> The following error occurred while executing this line:
>> D:\dev\workspace-main\lisa-product.builder\build\package.org .eclipse.pde.build.container.feature.win32.win32.x86.xml:766 :
>> The following error occurred while executing this line:
>> D:\dev\eclipse-3.5M6\plugins\org.eclipse.pde.build_3.5.0.v20 090312-1500\scripts\genericTargets.xml:213:
>> Java returned: 13
>>
>> Wb
Re: p2 director can't find binary,org.eclipse.equinox.executable_root [message #56719 is a reply to message #56265] Fri, 17 April 2009 15:32 Go to previous messageGo to next message
Eclipse UserFriend
Originally posted by: wbeckwith.gmail.com

That was indeed my issue. Once I removed the inclusion of the
org.eclipse.equinox.feature, then the director application succeeded.

Wb

Andrew Niefer wrote:
> This is a bug, I raised 272572.
>
> You are probably including the org.eclipse.equinox.executable feature
> directly in your product. If you removed it and instead let it be
> automatically included, then you will probably be able to install.
>
> -Andrew
Re: p2 director can't find binary,org.eclipse.equinox.executable_root [message #63321 is a reply to message #56265] Tue, 26 May 2009 18:33 Go to previous messageGo to next message
Euclides Neto is currently offline Euclides NetoFriend
Messages: 8
Registered: July 2009
Junior Member
I've just downloaded the Galileo RC2 and tried to build and install my
main feature using director app, and the same issue was raised. I verified
my features and none of them includes org.eclipse.equinox.executable. Can
someone point how to "fix" this issue? Following I'll paste the error log.

Thanks,
-- Euclides

Log:
----

!SESSION 2009-05-26 14:59:54.770
-----------------------------------------------
eclipse.buildId=I20090522-1710
java.version=1.5.0_15
java.vendor=Sun Microsystems Inc.
BootLoader constants: OS=linux, ARCH=x86, WS=gtk, NL=en_US
Framework arguments: -application
org.eclipse.equinox.p2.director.app.application -metadataRepository
file:/components/myproduct/repo -artifactRepository
file:/components/myproduct/repo -installIU my.feature.feature.group
-version 2.2.0 -destination /components/dist/tmp/MyProduct -profile
MyProfile -profileProperties org.eclipse.update.install.features=true
-bundlepool /components/dist/tmp/MyProduct -p2.os win32 -p2.ws win32
-p2.arch x86 -roaming
Command-line arguments: -application
org.eclipse.equinox.p2.director.app.application -metadataRepository
file:/components/myproduct/repo -artifactRepository
file:/components/myproduct/repo -installIU my.feature.feature.group
-version 2.2.0 -destination /components/dist/tmp/MyProduct -profile
MyProfile -profileProperties org.eclipse.update.install.features=true
-bundlepool /components/dist/tmp/MyProduct -p2.os win32 -p2.ws win32
-p2.arch x86 -roaming

!ENTRY org.eclipse.equinox.p2.directorywatcher 4 0 2009-05-26 14:59:58.976
!MESSAGE The installable unit
org.eclipse.equinox.executable_root.gtk.solaris.x86 is missing the
filename property.

!ENTRY org.eclipse.equinox.p2.directorywatcher 4 0 2009-05-26 14:59:58.978
!MESSAGE The installable unit
org.eclipse.equinox.executable_root.gtk.linux.x86 is missing the filename
property.

!ENTRY org.eclipse.equinox.p2.directorywatcher 4 0 2009-05-26 14:59:58.980
!MESSAGE The installable unit
org.eclipse.equinox.executable_root.motif.aix.ppc is missing the filename
property.

!ENTRY org.eclipse.equinox.p2.directorywatcher 4 0 2009-05-26 14:59:58.982
!MESSAGE The installable unit
org.eclipse.equinox.executable_root.motif.linux.x86 is missing the
filename property.

!ENTRY org.eclipse.equinox.p2.directorywatcher 4 0 2009-05-26 14:59:58.984
!MESSAGE The installable unit
org.eclipse.equinox.executable_root.cocoa.macosx.x86_64 is missing the
filename property.

!ENTRY org.eclipse.equinox.p2.directorywatcher 4 0 2009-05-26 14:59:58.985
!MESSAGE The installable unit
org.eclipse.equinox.executable_root.motif.hpux.ia64_32 is missing the
filename property.

!ENTRY org.eclipse.equinox.p2.directorywatcher 4 0 2009-05-26 14:59:58.987
!MESSAGE The installable unit
org.eclipse.equinox.executable_root.cocoa.macosx.ppc is missing the
filename property.

!ENTRY org.eclipse.equinox.p2.directorywatcher 4 0 2009-05-26 14:59:58.989
!MESSAGE The installable unit org.eclipse.equinox.executable_root is
missing the filename property.

!ENTRY org.eclipse.equinox.p2.directorywatcher 4 0 2009-05-26 14:59:58.990
!MESSAGE The installable unit
org.eclipse.equinox.executable_root.motif.hpux.PA_RISC is missing the
filename property.

!ENTRY org.eclipse.equinox.p2.directorywatcher 4 0 2009-05-26 14:59:58.992
!MESSAGE The installable unit
org.eclipse.equinox.executable_root.motif.solaris.sparc is missing the
filename property.

!ENTRY org.eclipse.equinox.p2.directorywatcher 4 0 2009-05-26 14:59:58.995
!MESSAGE The installable unit
org.eclipse.equinox.executable_root.wpf.win32.x86 is missing the filename
property.

!ENTRY org.eclipse.equinox.p2.directorywatcher 4 0 2009-05-26 14:59:58.998
!MESSAGE The installable unit
org.eclipse.equinox.executable_root.win32.win32.ia64 is missing the
filename property.

!ENTRY org.eclipse.equinox.p2.directorywatcher 4 0 2009-05-26 14:59:59.000
!MESSAGE The installable unit
org.eclipse.equinox.executable_root.carbon.macosx.ppc is missing the
filename property.

!ENTRY org.eclipse.equinox.p2.directorywatcher 4 0 2009-05-26 14:59:59.002
!MESSAGE The installable unit
org.eclipse.equinox.executable_root.gtk.linux.ppc is missing the filename
property.

!ENTRY org.eclipse.equinox.p2.directorywatcher 4 0 2009-05-26 14:59:59.003
!MESSAGE The installable unit
org.eclipse.equinox.executable_root.gtk.linux.x86_64 is missing the
filename property.

!ENTRY org.eclipse.equinox.p2.directorywatcher 4 0 2009-05-26 14:59:59.005
!MESSAGE The installable unit
org.eclipse.equinox.executable_root.cocoa.macosx.x86 is missing the
filename property.

!ENTRY org.eclipse.equinox.p2.directorywatcher 4 0 2009-05-26 14:59:59.007
!MESSAGE The installable unit
org.eclipse.equinox.executable_root.photon.qnx.x86 is missing the filename
property.

!ENTRY org.eclipse.equinox.p2.directorywatcher 4 0 2009-05-26 14:59:59.009
!MESSAGE The installable unit
org.eclipse.equinox.executable_root.gtk.solaris.sparc is missing the
filename property.

!ENTRY org.eclipse.equinox.p2.directorywatcher 4 0 2009-05-26 14:59:59.011
!MESSAGE The installable unit
org.eclipse.equinox.executable_root.carbon.macosx.x86 is missing the
filename property.

!ENTRY org.eclipse.equinox.p2.directorywatcher 4 0 2009-05-26 14:59:59.012
!MESSAGE The installable unit
org.eclipse.equinox.executable_root.win32.win32.x86 is missing the
filename property.

!ENTRY org.eclipse.equinox.p2.directorywatcher 4 0 2009-05-26 14:59:59.014
!MESSAGE The installable unit
org.eclipse.equinox.executable_root.win32.win32.x86_64 is missing the
filename property.

!ENTRY org.eclipse.equinox.p2.directorywatcher 4 0 2009-05-26 14:59:59.353
!MESSAGE The installable unit
org.eclipse.equinox.executable_root.gtk.solaris.x86 is missing the
filename property.

!ENTRY org.eclipse.equinox.p2.directorywatcher 4 0 2009-05-26 14:59:59.355
!MESSAGE The installable unit
org.eclipse.equinox.executable_root.gtk.linux.x86 is missing the filename
property.

!ENTRY org.eclipse.equinox.p2.directorywatcher 4 0 2009-05-26 14:59:59.356
!MESSAGE The installable unit
org.eclipse.equinox.executable_root.motif.aix.ppc is missing the filename
property.

!ENTRY org.eclipse.equinox.p2.directorywatcher 4 0 2009-05-26 14:59:59.361
!MESSAGE The installable unit
org.eclipse.equinox.executable_root.motif.linux.x86 is missing the
filename property.

!ENTRY org.eclipse.equinox.p2.directorywatcher 4 0 2009-05-26 14:59:59.363
!MESSAGE The installable unit
org.eclipse.equinox.executable_root.cocoa.macosx.x86_64 is missing the
filename property.

!ENTRY org.eclipse.equinox.p2.directorywatcher 4 0 2009-05-26 14:59:59.364
!MESSAGE The installable unit
org.eclipse.equinox.executable_root.motif.hpux.ia64_32 is missing the
filename property.

!ENTRY org.eclipse.equinox.p2.directorywatcher 4 0 2009-05-26 14:59:59.366
!MESSAGE The installable unit
org.eclipse.equinox.executable_root.cocoa.macosx.ppc is missing the
filename property.

!ENTRY org.eclipse.equinox.p2.directorywatcher 4 0 2009-05-26 14:59:59.368
!MESSAGE The installable unit org.eclipse.equinox.executable_root is
missing the filename property.

!ENTRY org.eclipse.equinox.p2.directorywatcher 4 0 2009-05-26 14:59:59.371
!MESSAGE The installable unit
org.eclipse.equinox.executable_root.motif.hpux.PA_RISC is missing the
filename property.

!ENTRY org.eclipse.equinox.p2.directorywatcher 4 0 2009-05-26 14:59:59.372
!MESSAGE The installable unit
org.eclipse.equinox.executable_root.motif.solaris.sparc is missing the
filename property.

!ENTRY org.eclipse.equinox.p2.directorywatcher 4 0 2009-05-26 14:59:59.374
!MESSAGE The installable unit
org.eclipse.equinox.executable_root.wpf.win32.x86 is missing the filename
property.

!ENTRY org.eclipse.equinox.p2.directorywatcher 4 0 2009-05-26 14:59:59.376
!MESSAGE The installable unit
org.eclipse.equinox.executable_root.win32.win32.ia64 is missing the
filename property.

!ENTRY org.eclipse.equinox.p2.directorywatcher 4 0 2009-05-26 14:59:59.377
!MESSAGE The installable unit
org.eclipse.equinox.executable_root.carbon.macosx.ppc is missing the
filename property.

!ENTRY org.eclipse.equinox.p2.directorywatcher 4 0 2009-05-26 14:59:59.380
!MESSAGE The installable unit
org.eclipse.equinox.executable_root.gtk.linux.ppc is missing the filename
property.

!ENTRY org.eclipse.equinox.p2.directorywatcher 4 0 2009-05-26 14:59:59.382
!MESSAGE The installable unit
org.eclipse.equinox.executable_root.gtk.linux.x86_64 is missing the
filename property.

!ENTRY org.eclipse.equinox.p2.directorywatcher 4 0 2009-05-26 14:59:59.384
!MESSAGE The installable unit
org.eclipse.equinox.executable_root.cocoa.macosx.x86 is missing the
filename property.

!ENTRY org.eclipse.equinox.p2.directorywatcher 4 0 2009-05-26 14:59:59.390
!MESSAGE The installable unit
org.eclipse.equinox.executable_root.photon.qnx.x86 is missing the filename
property.

!ENTRY org.eclipse.equinox.p2.directorywatcher 4 0 2009-05-26 14:59:59.392
!MESSAGE The installable unit
org.eclipse.equinox.executable_root.gtk.solaris.sparc is missing the
filename property.

!ENTRY org.eclipse.equinox.p2.directorywatcher 4 0 2009-05-26 14:59:59.394
!MESSAGE The installable unit
org.eclipse.equinox.executable_root.carbon.macosx.x86 is missing the
filename property.

!ENTRY org.eclipse.equinox.p2.directorywatcher 4 0 2009-05-26 14:59:59.395
!MESSAGE The installable unit
org.eclipse.equinox.executable_root.win32.win32.x86 is missing the
filename property.

!ENTRY org.eclipse.equinox.p2.directorywatcher 4 0 2009-05-26 14:59:59.397
!MESSAGE The installable unit
org.eclipse.equinox.executable_root.win32.win32.x86_64 is missing the
filename property.

!ENTRY org.eclipse.equinox.p2.engine 4 4 2009-05-26 15:00:02.844
!MESSAGE An error occurred while installing the items
!SUBENTRY 1 org.eclipse.equinox.p2.engine 4 0 2009-05-26 15:00:02.844
!MESSAGE session context was:(profile=SDKProfile,
phase=org.eclipse.equinox.internal.provisional.p2.engine.pha ses.Install,
operand=null --> [R]org.eclipse.equinox.executable_root
3.3.200.v20090521-1800-7M-Fm-FI3UouOe61h3BYGC,
action=org.eclipse.equinox.internal.p2.touchpoint.natives.ac tions.UnzipAction).
!SUBENTRY 1 org.eclipse.equinox.p2.touchpoint.natives 4 0 2009-05-26
15:00:02.844
!MESSAGE The artifact for
binary,org.eclipse.equinox.executable_root,3.3.200.v20090521 -1800-7M-Fm-FI3UouOe61h3BYGC
is not available.

!ENTRY org.eclipse.equinox.p2.director 4 1 2009-05-26 15:00:03.036
!MESSAGE Cannot complete the install because one or more required items
could not be found.
!SUBENTRY 1 org.eclipse.equinox.p2.director 4 0 2009-05-26 15:00:03.036
!MESSAGE Software being installed: My Platform 2.2.0
(my.feature.feature.group 2.2.0)
!SUBENTRY 1 org.eclipse.equinox.p2.director 4 0 2009-05-26 15:00:03.036
!MESSAGE Missing requirement: My RCP 2.2.0 (my.feature.rcp.feature.group
2.2.0) requires 'org.eclipse.rcp.feature.group
[3.5.0.v20090519-9SA-FwxFv6x-rk8-j91Tg58C,3.6.0)' but it could not be found
!SUBENTRY 1 org.eclipse.equinox.p2.director 4 1 2009-05-26 15:00:03.036
!MESSAGE Cannot satisfy dependency:
!SUBENTRY 2 org.eclipse.equinox.p2.director 4 0 2009-05-26 15:00:03.036
!MESSAGE From: My Platform 2.2.0 (my.feature.feature.group 2.2.0)
!SUBENTRY 2 org.eclipse.equinox.p2.director 4 0 2009-05-26 15:00:03.036
!MESSAGE To: my.feature.rcp.feature.group [2.2.0]
Re: p2 director can't find binary,org.eclipse.equinox.executable_root [message #63526 is a reply to message #63321] Wed, 27 May 2009 19:14 Go to previous message
Andrew Niefer is currently offline Andrew NieferFriend
Messages: 990
Registered: July 2009
Senior Member
There are a couple of bugs that are probably related to this:
https://bugs.eclipse.org/bugs/show_bug.cgi?id=248578
https://bugs.eclipse.org/bugs/show_bug.cgi?id=278086

I believe this is related to how you installed the deltapack.
For best results, you want the delta pack to be in your target, but not
in the eclipse that is running the build.
For export, this means don't unzip the deltapack on top of your eclipse
(or into dropins), but instead unzip it into its own directory. Then in
Preferences -> Plug-in Development -> Target Platform, edit the active
target, and add the directory where you extracted the deltapack.

-Andrew
Euclides Neto wrote:
> I've just downloaded the Galileo RC2 and tried to build and install my
> main feature using director app, and the same issue was raised. I
> verified my features and none of them includes
> org.eclipse.equinox.executable. Can someone point how to "fix" this
> issue? Following I'll paste the error log.
>
> Thanks,
> -- Euclides
>
> Log:
> ----
>
> !SESSION 2009-05-26 14:59:54.770
> -----------------------------------------------
> eclipse.buildId=I20090522-1710
> java.version=1.5.0_15
> java.vendor=Sun Microsystems Inc.
> BootLoader constants: OS=linux, ARCH=x86, WS=gtk, NL=en_US
> Framework arguments: -application
> org.eclipse.equinox.p2.director.app.application -metadataRepository
> file:/components/myproduct/repo -artifactRepository
> file:/components/myproduct/repo -installIU my.feature.feature.group
> -version 2.2.0 -destination /components/dist/tmp/MyProduct -profile
> MyProfile -profileProperties org.eclipse.update.install.features=true
> -bundlepool /components/dist/tmp/MyProduct -p2.os win32 -p2.ws win32
> -p2.arch x86 -roaming
> Command-line arguments: -application
> org.eclipse.equinox.p2.director.app.application -metadataRepository
> file:/components/myproduct/repo -artifactRepository
> file:/components/myproduct/repo -installIU my.feature.feature.group
> -version 2.2.0 -destination /components/dist/tmp/MyProduct -profile
> MyProfile -profileProperties org.eclipse.update.install.features=true
> -bundlepool /components/dist/tmp/MyProduct -p2.os win32 -p2.ws win32
> -p2.arch x86 -roaming
>
> !ENTRY org.eclipse.equinox.p2.directorywatcher 4 0 2009-05-26 14:59:58.976
> !MESSAGE The installable unit
> org.eclipse.equinox.executable_root.gtk.solaris.x86 is missing the
> filename property.
>
> !ENTRY org.eclipse.equinox.p2.directorywatcher 4 0 2009-05-26 14:59:58.978
> !MESSAGE The installable unit
> org.eclipse.equinox.executable_root.gtk.linux.x86 is missing the
> filename property.
>
> !ENTRY org.eclipse.equinox.p2.directorywatcher 4 0 2009-05-26 14:59:58.980
> !MESSAGE The installable unit
> org.eclipse.equinox.executable_root.motif.aix.ppc is missing the
> filename property.
>
> !ENTRY org.eclipse.equinox.p2.directorywatcher 4 0 2009-05-26 14:59:58.982
> !MESSAGE The installable unit
> org.eclipse.equinox.executable_root.motif.linux.x86 is missing the
> filename property.
>
> !ENTRY org.eclipse.equinox.p2.directorywatcher 4 0 2009-05-26 14:59:58.984
> !MESSAGE The installable unit
> org.eclipse.equinox.executable_root.cocoa.macosx.x86_64 is missing the
> filename property.
>
> !ENTRY org.eclipse.equinox.p2.directorywatcher 4 0 2009-05-26 14:59:58.985
> !MESSAGE The installable unit
> org.eclipse.equinox.executable_root.motif.hpux.ia64_32 is missing the
> filename property.
>
> !ENTRY org.eclipse.equinox.p2.directorywatcher 4 0 2009-05-26 14:59:58.987
> !MESSAGE The installable unit
> org.eclipse.equinox.executable_root.cocoa.macosx.ppc is missing the
> filename property.
>
> !ENTRY org.eclipse.equinox.p2.directorywatcher 4 0 2009-05-26 14:59:58.989
> !MESSAGE The installable unit org.eclipse.equinox.executable_root is
> missing the filename property.
>
> !ENTRY org.eclipse.equinox.p2.directorywatcher 4 0 2009-05-26 14:59:58.990
> !MESSAGE The installable unit
> org.eclipse.equinox.executable_root.motif.hpux.PA_RISC is missing the
> filename property.
>
> !ENTRY org.eclipse.equinox.p2.directorywatcher 4 0 2009-05-26 14:59:58.992
> !MESSAGE The installable unit
> org.eclipse.equinox.executable_root.motif.solaris.sparc is missing the
> filename property.
>
> !ENTRY org.eclipse.equinox.p2.directorywatcher 4 0 2009-05-26 14:59:58.995
> !MESSAGE The installable unit
> org.eclipse.equinox.executable_root.wpf.win32.x86 is missing the
> filename property.
>
> !ENTRY org.eclipse.equinox.p2.directorywatcher 4 0 2009-05-26 14:59:58.998
> !MESSAGE The installable unit
> org.eclipse.equinox.executable_root.win32.win32.ia64 is missing the
> filename property.
>
> !ENTRY org.eclipse.equinox.p2.directorywatcher 4 0 2009-05-26 14:59:59.000
> !MESSAGE The installable unit
> org.eclipse.equinox.executable_root.carbon.macosx.ppc is missing the
> filename property.
>
> !ENTRY org.eclipse.equinox.p2.directorywatcher 4 0 2009-05-26 14:59:59.002
> !MESSAGE The installable unit
> org.eclipse.equinox.executable_root.gtk.linux.ppc is missing the
> filename property.
>
> !ENTRY org.eclipse.equinox.p2.directorywatcher 4 0 2009-05-26 14:59:59.003
> !MESSAGE The installable unit
> org.eclipse.equinox.executable_root.gtk.linux.x86_64 is missing the
> filename property.
>
> !ENTRY org.eclipse.equinox.p2.directorywatcher 4 0 2009-05-26 14:59:59.005
> !MESSAGE The installable unit
> org.eclipse.equinox.executable_root.cocoa.macosx.x86 is missing the
> filename property.
>
> !ENTRY org.eclipse.equinox.p2.directorywatcher 4 0 2009-05-26 14:59:59.007
> !MESSAGE The installable unit
> org.eclipse.equinox.executable_root.photon.qnx.x86 is missing the
> filename property.
>
> !ENTRY org.eclipse.equinox.p2.directorywatcher 4 0 2009-05-26 14:59:59.009
> !MESSAGE The installable unit
> org.eclipse.equinox.executable_root.gtk.solaris.sparc is missing the
> filename property.
>
> !ENTRY org.eclipse.equinox.p2.directorywatcher 4 0 2009-05-26 14:59:59.011
> !MESSAGE The installable unit
> org.eclipse.equinox.executable_root.carbon.macosx.x86 is missing the
> filename property.
>
> !ENTRY org.eclipse.equinox.p2.directorywatcher 4 0 2009-05-26 14:59:59.012
> !MESSAGE The installable unit
> org.eclipse.equinox.executable_root.win32.win32.x86 is missing the
> filename property.
>
> !ENTRY org.eclipse.equinox.p2.directorywatcher 4 0 2009-05-26 14:59:59.014
> !MESSAGE The installable unit
> org.eclipse.equinox.executable_root.win32.win32.x86_64 is missing the
> filename property.
>
> !ENTRY org.eclipse.equinox.p2.directorywatcher 4 0 2009-05-26 14:59:59.353
> !MESSAGE The installable unit
> org.eclipse.equinox.executable_root.gtk.solaris.x86 is missing the
> filename property.
>
> !ENTRY org.eclipse.equinox.p2.directorywatcher 4 0 2009-05-26 14:59:59.355
> !MESSAGE The installable unit
> org.eclipse.equinox.executable_root.gtk.linux.x86 is missing the
> filename property.
>
> !ENTRY org.eclipse.equinox.p2.directorywatcher 4 0 2009-05-26 14:59:59.356
> !MESSAGE The installable unit
> org.eclipse.equinox.executable_root.motif.aix.ppc is missing the
> filename property.
>
> !ENTRY org.eclipse.equinox.p2.directorywatcher 4 0 2009-05-26 14:59:59.361
> !MESSAGE The installable unit
> org.eclipse.equinox.executable_root.motif.linux.x86 is missing the
> filename property.
>
> !ENTRY org.eclipse.equinox.p2.directorywatcher 4 0 2009-05-26 14:59:59.363
> !MESSAGE The installable unit
> org.eclipse.equinox.executable_root.cocoa.macosx.x86_64 is missing the
> filename property.
>
> !ENTRY org.eclipse.equinox.p2.directorywatcher 4 0 2009-05-26 14:59:59.364
> !MESSAGE The installable unit
> org.eclipse.equinox.executable_root.motif.hpux.ia64_32 is missing the
> filename property.
>
> !ENTRY org.eclipse.equinox.p2.directorywatcher 4 0 2009-05-26 14:59:59.366
> !MESSAGE The installable unit
> org.eclipse.equinox.executable_root.cocoa.macosx.ppc is missing the
> filename property.
>
> !ENTRY org.eclipse.equinox.p2.directorywatcher 4 0 2009-05-26 14:59:59.368
> !MESSAGE The installable unit org.eclipse.equinox.executable_root is
> missing the filename property.
>
> !ENTRY org.eclipse.equinox.p2.directorywatcher 4 0 2009-05-26 14:59:59.371
> !MESSAGE The installable unit
> org.eclipse.equinox.executable_root.motif.hpux.PA_RISC is missing the
> filename property.
>
> !ENTRY org.eclipse.equinox.p2.directorywatcher 4 0 2009-05-26 14:59:59.372
> !MESSAGE The installable unit
> org.eclipse.equinox.executable_root.motif.solaris.sparc is missing the
> filename property.
>
> !ENTRY org.eclipse.equinox.p2.directorywatcher 4 0 2009-05-26 14:59:59.374
> !MESSAGE The installable unit
> org.eclipse.equinox.executable_root.wpf.win32.x86 is missing the
> filename property.
>
> !ENTRY org.eclipse.equinox.p2.directorywatcher 4 0 2009-05-26 14:59:59.376
> !MESSAGE The installable unit
> org.eclipse.equinox.executable_root.win32.win32.ia64 is missing the
> filename property.
>
> !ENTRY org.eclipse.equinox.p2.directorywatcher 4 0 2009-05-26 14:59:59.377
> !MESSAGE The installable unit
> org.eclipse.equinox.executable_root.carbon.macosx.ppc is missing the
> filename property.
>
> !ENTRY org.eclipse.equinox.p2.directorywatcher 4 0 2009-05-26 14:59:59.380
> !MESSAGE The installable unit
> org.eclipse.equinox.executable_root.gtk.linux.ppc is missing the
> filename property.
>
> !ENTRY org.eclipse.equinox.p2.directorywatcher 4 0 2009-05-26 14:59:59.382
> !MESSAGE The installable unit
> org.eclipse.equinox.executable_root.gtk.linux.x86_64 is missing the
> filename property.
>
> !ENTRY org.eclipse.equinox.p2.directorywatcher 4 0 2009-05-26 14:59:59.384
> !MESSAGE The installable unit
> org.eclipse.equinox.executable_root.cocoa.macosx.x86 is missing the
> filename property.
>
> !ENTRY org.eclipse.equinox.p2.directorywatcher 4 0 2009-05-26 14:59:59.390
> !MESSAGE The installable unit
> org.eclipse.equinox.executable_root.photon.qnx.x86 is missing the
> filename property.
>
> !ENTRY org.eclipse.equinox.p2.directorywatcher 4 0 2009-05-26 14:59:59.392
> !MESSAGE The installable unit
> org.eclipse.equinox.executable_root.gtk.solaris.sparc is missing the
> filename property.
>
> !ENTRY org.eclipse.equinox.p2.directorywatcher 4 0 2009-05-26 14:59:59.394
> !MESSAGE The installable unit
> org.eclipse.equinox.executable_root.carbon.macosx.x86 is missing the
> filename property.
>
> !ENTRY org.eclipse.equinox.p2.directorywatcher 4 0 2009-05-26 14:59:59.395
> !MESSAGE The installable unit
> org.eclipse.equinox.executable_root.win32.win32.x86 is missing the
> filename property.
>
> !ENTRY org.eclipse.equinox.p2.directorywatcher 4 0 2009-05-26 14:59:59.397
> !MESSAGE The installable unit
> org.eclipse.equinox.executable_root.win32.win32.x86_64 is missing the
> filename property.
>
> !ENTRY org.eclipse.equinox.p2.engine 4 4 2009-05-26 15:00:02.844
> !MESSAGE An error occurred while installing the items
> !SUBENTRY 1 org.eclipse.equinox.p2.engine 4 0 2009-05-26 15:00:02.844
> !MESSAGE session context was:(profile=SDKProfile,
> phase=org.eclipse.equinox.internal.provisional.p2.engine.pha ses.Install,
> operand=null --> [R]org.eclipse.equinox.executable_root
> 3.3.200.v20090521-1800-7M-Fm-FI3UouOe61h3BYGC,
> action=org.eclipse.equinox.internal.p2.touchpoint.natives.ac tions.UnzipAction).
>
> !SUBENTRY 1 org.eclipse.equinox.p2.touchpoint.natives 4 0 2009-05-26
> 15:00:02.844
> !MESSAGE The artifact for
> binary,org.eclipse.equinox.executable_root,3.3.200.v20090521 -1800-7M-Fm-FI3UouOe61h3BYGC
> is not available.
>
> !ENTRY org.eclipse.equinox.p2.director 4 1 2009-05-26 15:00:03.036
> !MESSAGE Cannot complete the install because one or more required items
> could not be found.
> !SUBENTRY 1 org.eclipse.equinox.p2.director 4 0 2009-05-26 15:00:03.036
> !MESSAGE Software being installed: My Platform 2.2.0
> (my.feature.feature.group 2.2.0)
> !SUBENTRY 1 org.eclipse.equinox.p2.director 4 0 2009-05-26 15:00:03.036
> !MESSAGE Missing requirement: My RCP 2.2.0 (my.feature.rcp.feature.group
> 2.2.0) requires 'org.eclipse.rcp.feature.group
> [3.5.0.v20090519-9SA-FwxFv6x-rk8-j91Tg58C,3.6.0)' but it could not be found
> !SUBENTRY 1 org.eclipse.equinox.p2.director 4 1 2009-05-26 15:00:03.036
> !MESSAGE Cannot satisfy dependency:
> !SUBENTRY 2 org.eclipse.equinox.p2.director 4 0 2009-05-26 15:00:03.036
> !MESSAGE From: My Platform 2.2.0 (my.feature.feature.group 2.2.0)
> !SUBENTRY 2 org.eclipse.equinox.p2.director 4 0 2009-05-26 15:00:03.036
> !MESSAGE To: my.feature.rcp.feature.group [2.2.0]
>
>
Re: p2 director can't find binary,org.eclipse.equinox.executable_root [message #595603 is a reply to message #55503] Thu, 16 April 2009 20:13 Go to previous message
Andrew Niefer is currently offline Andrew NieferFriend
Messages: 990
Registered: July 2009
Senior Member
This is a bug, I raised 272572.

You are probably including the org.eclipse.equinox.executable feature
directly in your product. If you removed it and instead let it be
automatically included, then you will probably be able to install.

-Andrew
Wendell Beckwith wrote:
> The director complains of not finding the
> org.eclipse.equinox.executable_root binary @ version
> 3.3.200.v20090306-1900-7M-FhJFHQfz-5DbTcLIwDaa. Where is this coming
> from? Since I'm building a windows product with a windows SDK pointed
> at a target with Eclipse 3.5M6 SDK + Eclipse 3.5M6 Delta Pack, there
> should be no reason it can't find the executable I imagine.
>
> 1.) Where is this org.eclipse.equinox.executable_root
> plugin/feature/fragment?
>
> 2.) What does the director application used it for?
>
> If I can get those question answered then I can hopefully get a product
> actually provisioned.
>
>
>
> runDirector:
> Project base dir set to: D:\dev\workspace-main\lisa-product.builder\build
> [ant] calling target(s) [runDirector] in build file
> D:\dev\eclipse-3.5M6\plugins\org.eclipse.pde.build_3.5.0.v20 090312-1500\scripts\genericTargets.xml
>
> parsing buildfile
> D:\dev\eclipse-3.5M6\plugins\org.eclipse.pde.build_3.5.0.v20 090312-1500\scripts\genericTargets.xml
> with URI =
> file:/D:/dev/eclipse-3.5M6/plugins/org.eclipse.pde.build_3.5 .0.v20090312-1500/scripts/genericTargets.xml
>
> Project base dir set to: D:\dev\workspace-main\lisa-product.builder\build
> Override ignored for property "configs"
> Override ignored for property "fetchTag"
> Override ignored for property "customEESources"
> Override ignored for property "transformedRepoLocation"
> Override ignored for property "buildingOSGi"
> Override ignored for property "generateJnlp"
> Override ignored for property "signJars"
> Override ignored for property "generateFeatureVersionSuffix"
> Override ignored for property "generateVersionsLists"
> Override ignored for property "groupConfigurations"
> Override ignored for property "pluginPath"
> Override ignored for property "filteredDependencyCheck"
> Override ignored for property "filterP2Base"
> [ant] Entering
> D:\dev\eclipse-3.5M6\plugins\org.eclipse.pde.build_3.5.0.v20 090312-1500\scripts\genericTargets.xml...
>
> Build sequence for target(s) `runDirector' is [runDirector]
> Complete build sequence is [runDirector, noDefault, transformRepos,
> init, assembleElement, processElement, processFlat, gatherLogs,
> gatherSources, packageElement, processViaFeature, generateScript,
> fetchElement, gatherBinaries, cleanElement, ]
>
> runDirector:
> Override ignored for property "p2.director.version"
> [java] Executing 'C:\jdk1.5.x\jre\bin\java.exe' with arguments:
> [java]
> '-Declipse.p2.data.area=D:\dev\workspace-main\lisa-product.b uilder/build/tmp/eclipse/p2'
>
> [java] '-Declipse.p2.MD5Check=false'
> [java] '-jar'
> [java]
> 'D:\dev\eclipse-3.5M6\plugins\org.eclipse.equinox.launcher_1 .0.200.v20090306-1900.jar'
>
> [java] '-application'
> [java] 'org.eclipse.equinox.p2.director.app.application'
> [java] '-nosplash'
> [java] '--launcher.suppressErrors'
> [java] '-consoleLog'
> [java] '-flavor'
> [java] 'tooling'
> [java] '-installIU'
> [java] 'com.itko.lisa.workstation.product'
> [java] '-version'
> [java] '1.0.0'
> [java] '-p2.os'
> [java] 'win32'
> [java] '-p2.ws'
> [java] 'win32'
> [java] '-p2.arch'
> [java] 'x86'
> [java] '-roaming'
> [java] '-profile'
> [java] 'profile'
> [java] '-profileProperties'
> [java] 'org.eclipse.update.install.features=true'
> [java] '-metadataRepository'
> [java]
> 'file:D:\dev\workspace-main\lisa-product.builder/build/build Repo'
> [java] '-artifactRepository'
> [java]
> 'file:D:\dev\workspace-main\lisa-product.builder/build/build Repo'
> [java] '-destination'
> [java] 'D:\dev\workspace-main\lisa-product.builder/build/tmp/eclips e'
> [java] '-bundlepool'
> [java] 'D:\dev\workspace-main\lisa-product.builder/build/tmp/eclips e'
> [java]
> [java] The ' characters around the executable and arguments are
> [java] not part of the command.
> [java] Installing com.itko.lisa.workstation.product 1.0.0.
> [java] Installation failed.
> [java] !SESSION 2009-04-15 19:10:19.179
> -----------------------------------------------
> [java] eclipse.buildId=I20090313-0100
> [java] java.version=1.5.0_17
> [java] java.vendor=Sun Microsystems Inc.
> [java] BootLoader constants: OS=win32, ARCH=x86, WS=win32, NL=en_US
> [java] Framework arguments: -application
> org.eclipse.equinox.p2.director.app.application
> --launcher.suppressErrors -flavor tooling -installIU
> com.itko.lisa.workstation.product -version 1.0.0 -p2.os win32 -p2.ws
> win32 -p2.arch x86 -roaming -profile profile -profileProperties
> org.eclipse.update.install.features=true -metadataRepository
> file:D:\dev\workspace-main\lisa-product.builder/build/buildR epo
> -artifactRepository
> file:D:\dev\workspace-main\lisa-product.builder/build/buildR epo
> -destination
> D:\dev\workspace-main\lisa-product.builder/build/tmp/eclipse -bundlepool
> D:\dev\workspace-main\lisa-product.builder/build/tmp/eclipse
> [java] Command-line arguments: -application
> org.eclipse.equinox.p2.director.app.application
> --launcher.suppressErrors -consoleLog -flavor tooling -installIU
> com.itko.lisa.workstation.product -version 1.0.0 -p2.os win32 -p2.ws
> win32 -p2.arch x86 -roaming -profile profile -profileProperties
> org.eclipse.update.install.features=true -metadataRepository
> file:D:\dev\workspace-main\lisa-product.builder/build/buildR epo
> -artifactRepository
> file:D:\dev\workspace-main\lisa-product.builder/build/buildR epo
> -destination
> D:\dev\workspace-main\lisa-product.builder/build/tmp/eclipse -bundlepool
> D:\dev\workspace-main\lisa-product.builder/build/tmp/eclipse
> [java]
> [java] !ENTRY org.eclipse.equinox.p2.engine 4 4 2009-04-15
> 19:10:31.557
> [java] !MESSAGE An error occurred while collecting items to be
> installed
> [java] !SUBENTRY 1 org.eclipse.equinox.p2.engine 4 0 2009-04-15
> 19:10:31.557
> [java] !MESSAGE session context was:(profile=profile, phase=,
> operand=, action=).
> [java] !SUBENTRY 1 org.eclipse.equinox.p2.artifact.repository 4 0
> 2009-04-15 19:10:31.557
> [java] !MESSAGE No repository found containing:
> binary,org.eclipse.equinox.executable_root,3.3.200.v20090306 -1900-7M-FhJFHQfz-5DbTcLIwDaa
>
> [ant] Exiting
> D:\dev\eclipse-3.5M6\plugins\org.eclipse.pde.build_3.5.0.v20 090312-1500\scripts\genericTargets.xml.
>
> [antcall] Exiting
> D:\dev\workspace-main\lisa-product.builder\build\package.org .eclipse.pde.build.container.feature.win32.win32.x86.xml.
>
> [ant] Exiting
> D:\dev\workspace-main\lisa-product.builder\build\package.org .eclipse.pde.build.container.feature.win32.win32.x86.xml.
>
> [ant] Exiting
> D:\dev\workspace-main\lisa-product.builder\customTargets.xml .
> [ant] Exiting
> D:\dev\workspace-main\lisa-product.builder\build\package.org .eclipse.pde.build.container.feature.all.xml.
>
> [ant] Exiting
> D:\dev\eclipse-3.5M6\plugins\org.eclipse.pde.build_3.5.0.v20 090312-1500\scripts\genericTargets.xml.
>
> [antcall] Exiting
> D:\dev\workspace-main\lisa-product.builder\customTargets.xml .
> [ant] Exiting
> D:\dev\workspace-main\lisa-product.builder\customTargets.xml .
> [antcall] Exiting
> D:\dev\eclipse-3.5M6\plugins\org.eclipse.pde.build_3.5.0.v20 090312-1500\scripts\productBuild\productBuild.xml.
>
>
> BUILD FAILED
> D:\dev\eclipse-3.5M6\plugins\org.eclipse.pde.build_3.5.0.v20 090312-1500\scripts\productBuild\productBuild.xml:32:
> The following error occurred while executing this line:
> D:\dev\eclipse-3.5M6\plugins\org.eclipse.pde.build_3.5.0.v20 090312-1500\scripts\build.xml:115:
> The following error occurred while executing this line:
> D:\dev\workspace-main\lisa-product.builder\customTargets.xml :12: The
> following error occurred while executing this line:
> D:\dev\eclipse-3.5M6\plugins\org.eclipse.pde.build_3.5.0.v20 090312-1500\scripts\productBuild\allElements.xml:10:
> The following error occurred while executing this line:
> D:\dev\eclipse-3.5M6\plugins\org.eclipse.pde.build_3.5.0.v20 090312-1500\scripts\genericTargets.xml:182:
> The following error occurred while executing this line:
> D:\dev\workspace-main\lisa-product.builder\build\package.org .eclipse.pde.build.container.feature.all.xml:23:
> The following error occurred while executing this line:
> D:\dev\workspace-main\lisa-product.builder\build\package.org .eclipse.pde.build.container.feature.all.xml:15:
> The following error occurred while executing this line:
> D:\dev\eclipse-3.5M6\plugins\org.eclipse.pde.build_3.5.0.v20 090312-1500\scripts\productBuild\allElements.xml:44:
> The following error occurred while executing this line:
> D:\dev\workspace-main\lisa-product.builder\build\package.org .eclipse.pde.build.container.feature.win32.win32.x86.xml:89:
> The following error occurred while executing this line:
> D:\dev\workspace-main\lisa-product.builder\build\package.org .eclipse.pde.build.container.feature.win32.win32.x86.xml:766 :
> The following error occurred while executing this line:
> D:\dev\eclipse-3.5M6\plugins\org.eclipse.pde.build_3.5.0.v20 090312-1500\scripts\genericTargets.xml:213:
> Java returned: 13
>
> Wb
Re: p2 director can't find binary,org.eclipse.equinox.executable_root [message #595613 is a reply to message #56265] Thu, 16 April 2009 20:16 Go to previous message
Andrew Niefer is currently offline Andrew NieferFriend
Messages: 990
Registered: July 2009
Senior Member
BTW, this is a binary artifact.
If you look in
D:\dev\workspace-main\lisa-product.builder/build/buildRepo/b inary
you will should see at least
org.eclipse.equinox.executable_root.win32.win32.x86

-Andrew
Andrew Niefer wrote:
> This is a bug, I raised 272572.
>
> You are probably including the org.eclipse.equinox.executable feature
> directly in your product. If you removed it and instead let it be
> automatically included, then you will probably be able to install.
>
> -Andrew
> Wendell Beckwith wrote:
>> The director complains of not finding the
>> org.eclipse.equinox.executable_root binary @ version
>> 3.3.200.v20090306-1900-7M-FhJFHQfz-5DbTcLIwDaa. Where is this coming
>> from? Since I'm building a windows product with a windows SDK pointed
>> at a target with Eclipse 3.5M6 SDK + Eclipse 3.5M6 Delta Pack, there
>> should be no reason it can't find the executable I imagine.
>>
>> 1.) Where is this org.eclipse.equinox.executable_root
>> plugin/feature/fragment?
>>
>> 2.) What does the director application used it for?
>>
>> If I can get those question answered then I can hopefully get a
>> product actually provisioned.
>>
>>
>>
>> runDirector:
>> Project base dir set to: D:\dev\workspace-main\lisa-product.builder\build
>> [ant] calling target(s) [runDirector] in build file
>> D:\dev\eclipse-3.5M6\plugins\org.eclipse.pde.build_3.5.0.v20 090312-1500\scripts\genericTargets.xml
>>
>> parsing buildfile
>> D:\dev\eclipse-3.5M6\plugins\org.eclipse.pde.build_3.5.0.v20 090312-1500\scripts\genericTargets.xml
>> with URI =
>> file:/D:/dev/eclipse-3.5M6/plugins/org.eclipse.pde.build_3.5 .0.v20090312-1500/scripts/genericTargets.xml
>>
>> Project base dir set to: D:\dev\workspace-main\lisa-product.builder\build
>> Override ignored for property "configs"
>> Override ignored for property "fetchTag"
>> Override ignored for property "customEESources"
>> Override ignored for property "transformedRepoLocation"
>> Override ignored for property "buildingOSGi"
>> Override ignored for property "generateJnlp"
>> Override ignored for property "signJars"
>> Override ignored for property "generateFeatureVersionSuffix"
>> Override ignored for property "generateVersionsLists"
>> Override ignored for property "groupConfigurations"
>> Override ignored for property "pluginPath"
>> Override ignored for property "filteredDependencyCheck"
>> Override ignored for property "filterP2Base"
>> [ant] Entering
>> D:\dev\eclipse-3.5M6\plugins\org.eclipse.pde.build_3.5.0.v20 090312-1500\scripts\genericTargets.xml...
>>
>> Build sequence for target(s) `runDirector' is [runDirector]
>> Complete build sequence is [runDirector, noDefault, transformRepos,
>> init, assembleElement, processElement, processFlat, gatherLogs,
>> gatherSources, packageElement, processViaFeature, generateScript,
>> fetchElement, gatherBinaries, cleanElement, ]
>>
>> runDirector:
>> Override ignored for property "p2.director.version"
>> [java] Executing 'C:\jdk1.5.x\jre\bin\java.exe' with arguments:
>> [java]
>> '-Declipse.p2.data.area=D:\dev\workspace-main\lisa-product.b uilder/build/tmp/eclipse/p2'
>>
>> [java] '-Declipse.p2.MD5Check=false'
>> [java] '-jar'
>> [java]
>> 'D:\dev\eclipse-3.5M6\plugins\org.eclipse.equinox.launcher_1 .0.200.v20090306-1900.jar'
>>
>> [java] '-application'
>> [java] 'org.eclipse.equinox.p2.director.app.application'
>> [java] '-nosplash'
>> [java] '--launcher.suppressErrors'
>> [java] '-consoleLog'
>> [java] '-flavor'
>> [java] 'tooling'
>> [java] '-installIU'
>> [java] 'com.itko.lisa.workstation.product'
>> [java] '-version'
>> [java] '1.0.0'
>> [java] '-p2.os'
>> [java] 'win32'
>> [java] '-p2.ws'
>> [java] 'win32'
>> [java] '-p2.arch'
>> [java] 'x86'
>> [java] '-roaming'
>> [java] '-profile'
>> [java] 'profile'
>> [java] '-profileProperties'
>> [java] 'org.eclipse.update.install.features=true'
>> [java] '-metadataRepository'
>> [java]
>> 'file:D:\dev\workspace-main\lisa-product.builder/build/build Repo'
>> [java] '-artifactRepository'
>> [java]
>> 'file:D:\dev\workspace-main\lisa-product.builder/build/build Repo'
>> [java] '-destination'
>> [java]
>> 'D:\dev\workspace-main\lisa-product.builder/build/tmp/eclips e'
>> [java] '-bundlepool'
>> [java]
>> 'D:\dev\workspace-main\lisa-product.builder/build/tmp/eclips e'
>> [java]
>> [java] The ' characters around the executable and arguments are
>> [java] not part of the command.
>> [java] Installing com.itko.lisa.workstation.product 1.0.0.
>> [java] Installation failed.
>> [java] !SESSION 2009-04-15 19:10:19.179
>> -----------------------------------------------
>> [java] eclipse.buildId=I20090313-0100
>> [java] java.version=1.5.0_17
>> [java] java.vendor=Sun Microsystems Inc.
>> [java] BootLoader constants: OS=win32, ARCH=x86, WS=win32, NL=en_US
>> [java] Framework arguments: -application
>> org.eclipse.equinox.p2.director.app.application
>> --launcher.suppressErrors -flavor tooling -installIU
>> com.itko.lisa.workstation.product -version 1.0.0 -p2.os win32 -p2.ws
>> win32 -p2.arch x86 -roaming -profile profile -profileProperties
>> org.eclipse.update.install.features=true -metadataRepository
>> file:D:\dev\workspace-main\lisa-product.builder/build/buildR epo
>> -artifactRepository
>> file:D:\dev\workspace-main\lisa-product.builder/build/buildR epo
>> -destination
>> D:\dev\workspace-main\lisa-product.builder/build/tmp/eclipse
>> -bundlepool D:\dev\workspace-main\lisa-product.builder/build/tmp/eclipse
>> [java] Command-line arguments: -application
>> org.eclipse.equinox.p2.director.app.application
>> --launcher.suppressErrors -consoleLog -flavor tooling -installIU
>> com.itko.lisa.workstation.product -version 1.0.0 -p2.os win32 -p2.ws
>> win32 -p2.arch x86 -roaming -profile profile -profileProperties
>> org.eclipse.update.install.features=true -metadataRepository
>> file:D:\dev\workspace-main\lisa-product.builder/build/buildR epo
>> -artifactRepository
>> file:D:\dev\workspace-main\lisa-product.builder/build/buildR epo
>> -destination
>> D:\dev\workspace-main\lisa-product.builder/build/tmp/eclipse
>> -bundlepool D:\dev\workspace-main\lisa-product.builder/build/tmp/eclipse
>> [java]
>> [java] !ENTRY org.eclipse.equinox.p2.engine 4 4 2009-04-15
>> 19:10:31.557
>> [java] !MESSAGE An error occurred while collecting items to be
>> installed
>> [java] !SUBENTRY 1 org.eclipse.equinox.p2.engine 4 0 2009-04-15
>> 19:10:31.557
>> [java] !MESSAGE session context was:(profile=profile, phase=,
>> operand=, action=).
>> [java] !SUBENTRY 1 org.eclipse.equinox.p2.artifact.repository 4 0
>> 2009-04-15 19:10:31.557
>> [java] !MESSAGE No repository found containing:
>> binary,org.eclipse.equinox.executable_root,3.3.200.v20090306 -1900-7M-FhJFHQfz-5DbTcLIwDaa
>>
>> [ant] Exiting
>> D:\dev\eclipse-3.5M6\plugins\org.eclipse.pde.build_3.5.0.v20 090312-1500\scripts\genericTargets.xml.
>>
>> [antcall] Exiting
>> D:\dev\workspace-main\lisa-product.builder\build\package.org .eclipse.pde.build.container.feature.win32.win32.x86.xml.
>>
>> [ant] Exiting
>> D:\dev\workspace-main\lisa-product.builder\build\package.org .eclipse.pde.build.container.feature.win32.win32.x86.xml.
>>
>> [ant] Exiting
>> D:\dev\workspace-main\lisa-product.builder\customTargets.xml .
>> [ant] Exiting
>> D:\dev\workspace-main\lisa-product.builder\build\package.org .eclipse.pde.build.container.feature.all.xml.
>>
>> [ant] Exiting
>> D:\dev\eclipse-3.5M6\plugins\org.eclipse.pde.build_3.5.0.v20 090312-1500\scripts\genericTargets.xml.
>>
>> [antcall] Exiting
>> D:\dev\workspace-main\lisa-product.builder\customTargets.xml .
>> [ant] Exiting
>> D:\dev\workspace-main\lisa-product.builder\customTargets.xml .
>> [antcall] Exiting
>> D:\dev\eclipse-3.5M6\plugins\org.eclipse.pde.build_3.5.0.v20 090312-1500\scripts\productBuild\productBuild.xml.
>>
>>
>> BUILD FAILED
>> D:\dev\eclipse-3.5M6\plugins\org.eclipse.pde.build_3.5.0.v20 090312-1500\scripts\productBuild\productBuild.xml:32:
>> The following error occurred while executing this line:
>> D:\dev\eclipse-3.5M6\plugins\org.eclipse.pde.build_3.5.0.v20 090312-1500\scripts\build.xml:115:
>> The following error occurred while executing this line:
>> D:\dev\workspace-main\lisa-product.builder\customTargets.xml :12: The
>> following error occurred while executing this line:
>> D:\dev\eclipse-3.5M6\plugins\org.eclipse.pde.build_3.5.0.v20 090312-1500\scripts\productBuild\allElements.xml:10:
>> The following error occurred while executing this line:
>> D:\dev\eclipse-3.5M6\plugins\org.eclipse.pde.build_3.5.0.v20 090312-1500\scripts\genericTargets.xml:182:
>> The following error occurred while executing this line:
>> D:\dev\workspace-main\lisa-product.builder\build\package.org .eclipse.pde.build.container.feature.all.xml:23:
>> The following error occurred while executing this line:
>> D:\dev\workspace-main\lisa-product.builder\build\package.org .eclipse.pde.build.container.feature.all.xml:15:
>> The following error occurred while executing this line:
>> D:\dev\eclipse-3.5M6\plugins\org.eclipse.pde.build_3.5.0.v20 090312-1500\scripts\productBuild\allElements.xml:44:
>> The following error occurred while executing this line:
>> D:\dev\workspace-main\lisa-product.builder\build\package.org .eclipse.pde.build.container.feature.win32.win32.x86.xml:89:
>> The following error occurred while executing this line:
>> D:\dev\workspace-main\lisa-product.builder\build\package.org .eclipse.pde.build.container.feature.win32.win32.x86.xml:766 :
>> The following error occurred while executing this line:
>> D:\dev\eclipse-3.5M6\plugins\org.eclipse.pde.build_3.5.0.v20 090312-1500\scripts\genericTargets.xml:213:
>> Java returned: 13
>>
>> Wb
Re: p2 director can't find binary,org.eclipse.equinox.executable_root [message #595743 is a reply to message #56265] Fri, 17 April 2009 15:32 Go to previous message
Eclipse UserFriend
Originally posted by: wbeckwith.gmail.com

That was indeed my issue. Once I removed the inclusion of the
org.eclipse.equinox.feature, then the director application succeeded.

Wb

Andrew Niefer wrote:
> This is a bug, I raised 272572.
>
> You are probably including the org.eclipse.equinox.executable feature
> directly in your product. If you removed it and instead let it be
> automatically included, then you will probably be able to install.
>
> -Andrew
Re: p2 director can't find binary,org.eclipse.equinox.executable_root [message #597875 is a reply to message #56265] Tue, 26 May 2009 18:33 Go to previous message
Euclides Neto is currently offline Euclides NetoFriend
Messages: 8
Registered: July 2009
Junior Member
I've just downloaded the Galileo RC2 and tried to build and install my
main feature using director app, and the same issue was raised. I verified
my features and none of them includes org.eclipse.equinox.executable. Can
someone point how to "fix" this issue? Following I'll paste the error log.

Thanks,
-- Euclides

Log:
----

!SESSION 2009-05-26 14:59:54.770
-----------------------------------------------
eclipse.buildId=I20090522-1710
java.version=1.5.0_15
java.vendor=Sun Microsystems Inc.
BootLoader constants: OS=linux, ARCH=x86, WS=gtk, NL=en_US
Framework arguments: -application
org.eclipse.equinox.p2.director.app.application -metadataRepository
file:/components/myproduct/repo -artifactRepository
file:/components/myproduct/repo -installIU my.feature.feature.group
-version 2.2.0 -destination /components/dist/tmp/MyProduct -profile
MyProfile -profileProperties org.eclipse.update.install.features=true
-bundlepool /components/dist/tmp/MyProduct -p2.os win32 -p2.ws win32
-p2.arch x86 -roaming
Command-line arguments: -application
org.eclipse.equinox.p2.director.app.application -metadataRepository
file:/components/myproduct/repo -artifactRepository
file:/components/myproduct/repo -installIU my.feature.feature.group
-version 2.2.0 -destination /components/dist/tmp/MyProduct -profile
MyProfile -profileProperties org.eclipse.update.install.features=true
-bundlepool /components/dist/tmp/MyProduct -p2.os win32 -p2.ws win32
-p2.arch x86 -roaming

!ENTRY org.eclipse.equinox.p2.directorywatcher 4 0 2009-05-26 14:59:58.976
!MESSAGE The installable unit
org.eclipse.equinox.executable_root.gtk.solaris.x86 is missing the
filename property.

!ENTRY org.eclipse.equinox.p2.directorywatcher 4 0 2009-05-26 14:59:58.978
!MESSAGE The installable unit
org.eclipse.equinox.executable_root.gtk.linux.x86 is missing the filename
property.

!ENTRY org.eclipse.equinox.p2.directorywatcher 4 0 2009-05-26 14:59:58.980
!MESSAGE The installable unit
org.eclipse.equinox.executable_root.motif.aix.ppc is missing the filename
property.

!ENTRY org.eclipse.equinox.p2.directorywatcher 4 0 2009-05-26 14:59:58.982
!MESSAGE The installable unit
org.eclipse.equinox.executable_root.motif.linux.x86 is missing the
filename property.

!ENTRY org.eclipse.equinox.p2.directorywatcher 4 0 2009-05-26 14:59:58.984
!MESSAGE The installable unit
org.eclipse.equinox.executable_root.cocoa.macosx.x86_64 is missing the
filename property.

!ENTRY org.eclipse.equinox.p2.directorywatcher 4 0 2009-05-26 14:59:58.985
!MESSAGE The installable unit
org.eclipse.equinox.executable_root.motif.hpux.ia64_32 is missing the
filename property.

!ENTRY org.eclipse.equinox.p2.directorywatcher 4 0 2009-05-26 14:59:58.987
!MESSAGE The installable unit
org.eclipse.equinox.executable_root.cocoa.macosx.ppc is missing the
filename property.

!ENTRY org.eclipse.equinox.p2.directorywatcher 4 0 2009-05-26 14:59:58.989
!MESSAGE The installable unit org.eclipse.equinox.executable_root is
missing the filename property.

!ENTRY org.eclipse.equinox.p2.directorywatcher 4 0 2009-05-26 14:59:58.990
!MESSAGE The installable unit
org.eclipse.equinox.executable_root.motif.hpux.PA_RISC is missing the
filename property.

!ENTRY org.eclipse.equinox.p2.directorywatcher 4 0 2009-05-26 14:59:58.992
!MESSAGE The installable unit
org.eclipse.equinox.executable_root.motif.solaris.sparc is missing the
filename property.

!ENTRY org.eclipse.equinox.p2.directorywatcher 4 0 2009-05-26 14:59:58.995
!MESSAGE The installable unit
org.eclipse.equinox.executable_root.wpf.win32.x86 is missing the filename
property.

!ENTRY org.eclipse.equinox.p2.directorywatcher 4 0 2009-05-26 14:59:58.998
!MESSAGE The installable unit
org.eclipse.equinox.executable_root.win32.win32.ia64 is missing the
filename property.

!ENTRY org.eclipse.equinox.p2.directorywatcher 4 0 2009-05-26 14:59:59.000
!MESSAGE The installable unit
org.eclipse.equinox.executable_root.carbon.macosx.ppc is missing the
filename property.

!ENTRY org.eclipse.equinox.p2.directorywatcher 4 0 2009-05-26 14:59:59.002
!MESSAGE The installable unit
org.eclipse.equinox.executable_root.gtk.linux.ppc is missing the filename
property.

!ENTRY org.eclipse.equinox.p2.directorywatcher 4 0 2009-05-26 14:59:59.003
!MESSAGE The installable unit
org.eclipse.equinox.executable_root.gtk.linux.x86_64 is missing the
filename property.

!ENTRY org.eclipse.equinox.p2.directorywatcher 4 0 2009-05-26 14:59:59.005
!MESSAGE The installable unit
org.eclipse.equinox.executable_root.cocoa.macosx.x86 is missing the
filename property.

!ENTRY org.eclipse.equinox.p2.directorywatcher 4 0 2009-05-26 14:59:59.007
!MESSAGE The installable unit
org.eclipse.equinox.executable_root.photon.qnx.x86 is missing the filename
property.

!ENTRY org.eclipse.equinox.p2.directorywatcher 4 0 2009-05-26 14:59:59.009
!MESSAGE The installable unit
org.eclipse.equinox.executable_root.gtk.solaris.sparc is missing the
filename property.

!ENTRY org.eclipse.equinox.p2.directorywatcher 4 0 2009-05-26 14:59:59.011
!MESSAGE The installable unit
org.eclipse.equinox.executable_root.carbon.macosx.x86 is missing the
filename property.

!ENTRY org.eclipse.equinox.p2.directorywatcher 4 0 2009-05-26 14:59:59.012
!MESSAGE The installable unit
org.eclipse.equinox.executable_root.win32.win32.x86 is missing the
filename property.

!ENTRY org.eclipse.equinox.p2.directorywatcher 4 0 2009-05-26 14:59:59.014
!MESSAGE The installable unit
org.eclipse.equinox.executable_root.win32.win32.x86_64 is missing the
filename property.

!ENTRY org.eclipse.equinox.p2.directorywatcher 4 0 2009-05-26 14:59:59.353
!MESSAGE The installable unit
org.eclipse.equinox.executable_root.gtk.solaris.x86 is missing the
filename property.

!ENTRY org.eclipse.equinox.p2.directorywatcher 4 0 2009-05-26 14:59:59.355
!MESSAGE The installable unit
org.eclipse.equinox.executable_root.gtk.linux.x86 is missing the filename
property.

!ENTRY org.eclipse.equinox.p2.directorywatcher 4 0 2009-05-26 14:59:59.356
!MESSAGE The installable unit
org.eclipse.equinox.executable_root.motif.aix.ppc is missing the filename
property.

!ENTRY org.eclipse.equinox.p2.directorywatcher 4 0 2009-05-26 14:59:59.361
!MESSAGE The installable unit
org.eclipse.equinox.executable_root.motif.linux.x86 is missing the
filename property.

!ENTRY org.eclipse.equinox.p2.directorywatcher 4 0 2009-05-26 14:59:59.363
!MESSAGE The installable unit
org.eclipse.equinox.executable_root.cocoa.macosx.x86_64 is missing the
filename property.

!ENTRY org.eclipse.equinox.p2.directorywatcher 4 0 2009-05-26 14:59:59.364
!MESSAGE The installable unit
org.eclipse.equinox.executable_root.motif.hpux.ia64_32 is missing the
filename property.

!ENTRY org.eclipse.equinox.p2.directorywatcher 4 0 2009-05-26 14:59:59.366
!MESSAGE The installable unit
org.eclipse.equinox.executable_root.cocoa.macosx.ppc is missing the
filename property.

!ENTRY org.eclipse.equinox.p2.directorywatcher 4 0 2009-05-26 14:59:59.368
!MESSAGE The installable unit org.eclipse.equinox.executable_root is
missing the filename property.

!ENTRY org.eclipse.equinox.p2.directorywatcher 4 0 2009-05-26 14:59:59.371
!MESSAGE The installable unit
org.eclipse.equinox.executable_root.motif.hpux.PA_RISC is missing the
filename property.

!ENTRY org.eclipse.equinox.p2.directorywatcher 4 0 2009-05-26 14:59:59.372
!MESSAGE The installable unit
org.eclipse.equinox.executable_root.motif.solaris.sparc is missing the
filename property.

!ENTRY org.eclipse.equinox.p2.directorywatcher 4 0 2009-05-26 14:59:59.374
!MESSAGE The installable unit
org.eclipse.equinox.executable_root.wpf.win32.x86 is missing the filename
property.

!ENTRY org.eclipse.equinox.p2.directorywatcher 4 0 2009-05-26 14:59:59.376
!MESSAGE The installable unit
org.eclipse.equinox.executable_root.win32.win32.ia64 is missing the
filename property.

!ENTRY org.eclipse.equinox.p2.directorywatcher 4 0 2009-05-26 14:59:59.377
!MESSAGE The installable unit
org.eclipse.equinox.executable_root.carbon.macosx.ppc is missing the
filename property.

!ENTRY org.eclipse.equinox.p2.directorywatcher 4 0 2009-05-26 14:59:59.380
!MESSAGE The installable unit
org.eclipse.equinox.executable_root.gtk.linux.ppc is missing the filename
property.

!ENTRY org.eclipse.equinox.p2.directorywatcher 4 0 2009-05-26 14:59:59.382
!MESSAGE The installable unit
org.eclipse.equinox.executable_root.gtk.linux.x86_64 is missing the
filename property.

!ENTRY org.eclipse.equinox.p2.directorywatcher 4 0 2009-05-26 14:59:59.384
!MESSAGE The installable unit
org.eclipse.equinox.executable_root.cocoa.macosx.x86 is missing the
filename property.

!ENTRY org.eclipse.equinox.p2.directorywatcher 4 0 2009-05-26 14:59:59.390
!MESSAGE The installable unit
org.eclipse.equinox.executable_root.photon.qnx.x86 is missing the filename
property.

!ENTRY org.eclipse.equinox.p2.directorywatcher 4 0 2009-05-26 14:59:59.392
!MESSAGE The installable unit
org.eclipse.equinox.executable_root.gtk.solaris.sparc is missing the
filename property.

!ENTRY org.eclipse.equinox.p2.directorywatcher 4 0 2009-05-26 14:59:59.394
!MESSAGE The installable unit
org.eclipse.equinox.executable_root.carbon.macosx.x86 is missing the
filename property.

!ENTRY org.eclipse.equinox.p2.directorywatcher 4 0 2009-05-26 14:59:59.395
!MESSAGE The installable unit
org.eclipse.equinox.executable_root.win32.win32.x86 is missing the
filename property.

!ENTRY org.eclipse.equinox.p2.directorywatcher 4 0 2009-05-26 14:59:59.397
!MESSAGE The installable unit
org.eclipse.equinox.executable_root.win32.win32.x86_64 is missing the
filename property.

!ENTRY org.eclipse.equinox.p2.engine 4 4 2009-05-26 15:00:02.844
!MESSAGE An error occurred while installing the items
!SUBENTRY 1 org.eclipse.equinox.p2.engine 4 0 2009-05-26 15:00:02.844
!MESSAGE session context was:(profile=SDKProfile,
phase=org.eclipse.equinox.internal.provisional.p2.engine.pha ses.Install,
operand=null --> [R]org.eclipse.equinox.executable_root
3.3.200.v20090521-1800-7M-Fm-FI3UouOe61h3BYGC,
action=org.eclipse.equinox.internal.p2.touchpoint.natives.ac tions.UnzipAction).
!SUBENTRY 1 org.eclipse.equinox.p2.touchpoint.natives 4 0 2009-05-26
15:00:02.844
!MESSAGE The artifact for
binary,org.eclipse.equinox.executable_root,3.3.200.v20090521 -1800-7M-Fm-FI3UouOe61h3BYGC
is not available.

!ENTRY org.eclipse.equinox.p2.director 4 1 2009-05-26 15:00:03.036
!MESSAGE Cannot complete the install because one or more required items
could not be found.
!SUBENTRY 1 org.eclipse.equinox.p2.director 4 0 2009-05-26 15:00:03.036
!MESSAGE Software being installed: My Platform 2.2.0
(my.feature.feature.group 2.2.0)
!SUBENTRY 1 org.eclipse.equinox.p2.director 4 0 2009-05-26 15:00:03.036
!MESSAGE Missing requirement: My RCP 2.2.0 (my.feature.rcp.feature.group
2.2.0) requires 'org.eclipse.rcp.feature.group
[3.5.0.v20090519-9SA-FwxFv6x-rk8-j91Tg58C,3.6.0)' but it could not be found
!SUBENTRY 1 org.eclipse.equinox.p2.director 4 1 2009-05-26 15:00:03.036
!MESSAGE Cannot satisfy dependency:
!SUBENTRY 2 org.eclipse.equinox.p2.director 4 0 2009-05-26 15:00:03.036
!MESSAGE From: My Platform 2.2.0 (my.feature.feature.group 2.2.0)
!SUBENTRY 2 org.eclipse.equinox.p2.director 4 0 2009-05-26 15:00:03.036
!MESSAGE To: my.feature.rcp.feature.group [2.2.0]
Re: p2 director can't find binary,org.eclipse.equinox.executable_root [message #597932 is a reply to message #63321] Wed, 27 May 2009 19:14 Go to previous message
Andrew Niefer is currently offline Andrew NieferFriend
Messages: 990
Registered: July 2009
Senior Member
There are a couple of bugs that are probably related to this:
https://bugs.eclipse.org/bugs/show_bug.cgi?id=248578
https://bugs.eclipse.org/bugs/show_bug.cgi?id=278086

I believe this is related to how you installed the deltapack.
For best results, you want the delta pack to be in your target, but not
in the eclipse that is running the build.
For export, this means don't unzip the deltapack on top of your eclipse
(or into dropins), but instead unzip it into its own directory. Then in
Preferences -> Plug-in Development -> Target Platform, edit the active
target, and add the directory where you extracted the deltapack.

-Andrew
Euclides Neto wrote:
> I've just downloaded the Galileo RC2 and tried to build and install my
> main feature using director app, and the same issue was raised. I
> verified my features and none of them includes
> org.eclipse.equinox.executable. Can someone point how to "fix" this
> issue? Following I'll paste the error log.
>
> Thanks,
> -- Euclides
>
> Log:
> ----
>
> !SESSION 2009-05-26 14:59:54.770
> -----------------------------------------------
> eclipse.buildId=I20090522-1710
> java.version=1.5.0_15
> java.vendor=Sun Microsystems Inc.
> BootLoader constants: OS=linux, ARCH=x86, WS=gtk, NL=en_US
> Framework arguments: -application
> org.eclipse.equinox.p2.director.app.application -metadataRepository
> file:/components/myproduct/repo -artifactRepository
> file:/components/myproduct/repo -installIU my.feature.feature.group
> -version 2.2.0 -destination /components/dist/tmp/MyProduct -profile
> MyProfile -profileProperties org.eclipse.update.install.features=true
> -bundlepool /components/dist/tmp/MyProduct -p2.os win32 -p2.ws win32
> -p2.arch x86 -roaming
> Command-line arguments: -application
> org.eclipse.equinox.p2.director.app.application -metadataRepository
> file:/components/myproduct/repo -artifactRepository
> file:/components/myproduct/repo -installIU my.feature.feature.group
> -version 2.2.0 -destination /components/dist/tmp/MyProduct -profile
> MyProfile -profileProperties org.eclipse.update.install.features=true
> -bundlepool /components/dist/tmp/MyProduct -p2.os win32 -p2.ws win32
> -p2.arch x86 -roaming
>
> !ENTRY org.eclipse.equinox.p2.directorywatcher 4 0 2009-05-26 14:59:58.976
> !MESSAGE The installable unit
> org.eclipse.equinox.executable_root.gtk.solaris.x86 is missing the
> filename property.
>
> !ENTRY org.eclipse.equinox.p2.directorywatcher 4 0 2009-05-26 14:59:58.978
> !MESSAGE The installable unit
> org.eclipse.equinox.executable_root.gtk.linux.x86 is missing the
> filename property.
>
> !ENTRY org.eclipse.equinox.p2.directorywatcher 4 0 2009-05-26 14:59:58.980
> !MESSAGE The installable unit
> org.eclipse.equinox.executable_root.motif.aix.ppc is missing the
> filename property.
>
> !ENTRY org.eclipse.equinox.p2.directorywatcher 4 0 2009-05-26 14:59:58.982
> !MESSAGE The installable unit
> org.eclipse.equinox.executable_root.motif.linux.x86 is missing the
> filename property.
>
> !ENTRY org.eclipse.equinox.p2.directorywatcher 4 0 2009-05-26 14:59:58.984
> !MESSAGE The installable unit
> org.eclipse.equinox.executable_root.cocoa.macosx.x86_64 is missing the
> filename property.
>
> !ENTRY org.eclipse.equinox.p2.directorywatcher 4 0 2009-05-26 14:59:58.985
> !MESSAGE The installable unit
> org.eclipse.equinox.executable_root.motif.hpux.ia64_32 is missing the
> filename property.
>
> !ENTRY org.eclipse.equinox.p2.directorywatcher 4 0 2009-05-26 14:59:58.987
> !MESSAGE The installable unit
> org.eclipse.equinox.executable_root.cocoa.macosx.ppc is missing the
> filename property.
>
> !ENTRY org.eclipse.equinox.p2.directorywatcher 4 0 2009-05-26 14:59:58.989
> !MESSAGE The installable unit org.eclipse.equinox.executable_root is
> missing the filename property.
>
> !ENTRY org.eclipse.equinox.p2.directorywatcher 4 0 2009-05-26 14:59:58.990
> !MESSAGE The installable unit
> org.eclipse.equinox.executable_root.motif.hpux.PA_RISC is missing the
> filename property.
>
> !ENTRY org.eclipse.equinox.p2.directorywatcher 4 0 2009-05-26 14:59:58.992
> !MESSAGE The installable unit
> org.eclipse.equinox.executable_root.motif.solaris.sparc is missing the
> filename property.
>
> !ENTRY org.eclipse.equinox.p2.directorywatcher 4 0 2009-05-26 14:59:58.995
> !MESSAGE The installable unit
> org.eclipse.equinox.executable_root.wpf.win32.x86 is missing the
> filename property.
>
> !ENTRY org.eclipse.equinox.p2.directorywatcher 4 0 2009-05-26 14:59:58.998
> !MESSAGE The installable unit
> org.eclipse.equinox.executable_root.win32.win32.ia64 is missing the
> filename property.
>
> !ENTRY org.eclipse.equinox.p2.directorywatcher 4 0 2009-05-26 14:59:59.000
> !MESSAGE The installable unit
> org.eclipse.equinox.executable_root.carbon.macosx.ppc is missing the
> filename property.
>
> !ENTRY org.eclipse.equinox.p2.directorywatcher 4 0 2009-05-26 14:59:59.002
> !MESSAGE The installable unit
> org.eclipse.equinox.executable_root.gtk.linux.ppc is missing the
> filename property.
>
> !ENTRY org.eclipse.equinox.p2.directorywatcher 4 0 2009-05-26 14:59:59.003
> !MESSAGE The installable unit
> org.eclipse.equinox.executable_root.gtk.linux.x86_64 is missing the
> filename property.
>
> !ENTRY org.eclipse.equinox.p2.directorywatcher 4 0 2009-05-26 14:59:59.005
> !MESSAGE The installable unit
> org.eclipse.equinox.executable_root.cocoa.macosx.x86 is missing the
> filename property.
>
> !ENTRY org.eclipse.equinox.p2.directorywatcher 4 0 2009-05-26 14:59:59.007
> !MESSAGE The installable unit
> org.eclipse.equinox.executable_root.photon.qnx.x86 is missing the
> filename property.
>
> !ENTRY org.eclipse.equinox.p2.directorywatcher 4 0 2009-05-26 14:59:59.009
> !MESSAGE The installable unit
> org.eclipse.equinox.executable_root.gtk.solaris.sparc is missing the
> filename property.
>
> !ENTRY org.eclipse.equinox.p2.directorywatcher 4 0 2009-05-26 14:59:59.011
> !MESSAGE The installable unit
> org.eclipse.equinox.executable_root.carbon.macosx.x86 is missing the
> filename property.
>
> !ENTRY org.eclipse.equinox.p2.directorywatcher 4 0 2009-05-26 14:59:59.012
> !MESSAGE The installable unit
> org.eclipse.equinox.executable_root.win32.win32.x86 is missing the
> filename property.
>
> !ENTRY org.eclipse.equinox.p2.directorywatcher 4 0 2009-05-26 14:59:59.014
> !MESSAGE The installable unit
> org.eclipse.equinox.executable_root.win32.win32.x86_64 is missing the
> filename property.
>
> !ENTRY org.eclipse.equinox.p2.directorywatcher 4 0 2009-05-26 14:59:59.353
> !MESSAGE The installable unit
> org.eclipse.equinox.executable_root.gtk.solaris.x86 is missing the
> filename property.
>
> !ENTRY org.eclipse.equinox.p2.directorywatcher 4 0 2009-05-26 14:59:59.355
> !MESSAGE The installable unit
> org.eclipse.equinox.executable_root.gtk.linux.x86 is missing the
> filename property.
>
> !ENTRY org.eclipse.equinox.p2.directorywatcher 4 0 2009-05-26 14:59:59.356
> !MESSAGE The installable unit
> org.eclipse.equinox.executable_root.motif.aix.ppc is missing the
> filename property.
>
> !ENTRY org.eclipse.equinox.p2.directorywatcher 4 0 2009-05-26 14:59:59.361
> !MESSAGE The installable unit
> org.eclipse.equinox.executable_root.motif.linux.x86 is missing the
> filename property.
>
> !ENTRY org.eclipse.equinox.p2.directorywatcher 4 0 2009-05-26 14:59:59.363
> !MESSAGE The installable unit
> org.eclipse.equinox.executable_root.cocoa.macosx.x86_64 is missing the
> filename property.
>
> !ENTRY org.eclipse.equinox.p2.directorywatcher 4 0 2009-05-26 14:59:59.364
> !MESSAGE The installable unit
> org.eclipse.equinox.executable_root.motif.hpux.ia64_32 is missing the
> filename property.
>
> !ENTRY org.eclipse.equinox.p2.directorywatcher 4 0 2009-05-26 14:59:59.366
> !MESSAGE The installable unit
> org.eclipse.equinox.executable_root.cocoa.macosx.ppc is missing the
> filename property.
>
> !ENTRY org.eclipse.equinox.p2.directorywatcher 4 0 2009-05-26 14:59:59.368
> !MESSAGE The installable unit org.eclipse.equinox.executable_root is
> missing the filename property.
>
> !ENTRY org.eclipse.equinox.p2.directorywatcher 4 0 2009-05-26 14:59:59.371
> !MESSAGE The installable unit
> org.eclipse.equinox.executable_root.motif.hpux.PA_RISC is missing the
> filename property.
>
> !ENTRY org.eclipse.equinox.p2.directorywatcher 4 0 2009-05-26 14:59:59.372
> !MESSAGE The installable unit
> org.eclipse.equinox.executable_root.motif.solaris.sparc is missing the
> filename property.
>
> !ENTRY org.eclipse.equinox.p2.directorywatcher 4 0 2009-05-26 14:59:59.374
> !MESSAGE The installable unit
> org.eclipse.equinox.executable_root.wpf.win32.x86 is missing the
> filename property.
>
> !ENTRY org.eclipse.equinox.p2.directorywatcher 4 0 2009-05-26 14:59:59.376
> !MESSAGE The installable unit
> org.eclipse.equinox.executable_root.win32.win32.ia64 is missing the
> filename property.
>
> !ENTRY org.eclipse.equinox.p2.directorywatcher 4 0 2009-05-26 14:59:59.377
> !MESSAGE The installable unit
> org.eclipse.equinox.executable_root.carbon.macosx.ppc is missing the
> filename property.
>
> !ENTRY org.eclipse.equinox.p2.directorywatcher 4 0 2009-05-26 14:59:59.380
> !MESSAGE The installable unit
> org.eclipse.equinox.executable_root.gtk.linux.ppc is missing the
> filename property.
>
> !ENTRY org.eclipse.equinox.p2.directorywatcher 4 0 2009-05-26 14:59:59.382
> !MESSAGE The installable unit
> org.eclipse.equinox.executable_root.gtk.linux.x86_64 is missing the
> filename property.
>
> !ENTRY org.eclipse.equinox.p2.directorywatcher 4 0 2009-05-26 14:59:59.384
> !MESSAGE The installable unit
> org.eclipse.equinox.executable_root.cocoa.macosx.x86 is missing the
> filename property.
>
> !ENTRY org.eclipse.equinox.p2.directorywatcher 4 0 2009-05-26 14:59:59.390
> !MESSAGE The installable unit
> org.eclipse.equinox.executable_root.photon.qnx.x86 is missing the
> filename property.
>
> !ENTRY org.eclipse.equinox.p2.directorywatcher 4 0 2009-05-26 14:59:59.392
> !MESSAGE The installable unit
> org.eclipse.equinox.executable_root.gtk.solaris.sparc is missing the
> filename property.
>
> !ENTRY org.eclipse.equinox.p2.directorywatcher 4 0 2009-05-26 14:59:59.394
> !MESSAGE The installable unit
> org.eclipse.equinox.executable_root.carbon.macosx.x86 is missing the
> filename property.
>
> !ENTRY org.eclipse.equinox.p2.directorywatcher 4 0 2009-05-26 14:59:59.395
> !MESSAGE The installable unit
> org.eclipse.equinox.executable_root.win32.win32.x86 is missing the
> filename property.
>
> !ENTRY org.eclipse.equinox.p2.directorywatcher 4 0 2009-05-26 14:59:59.397
> !MESSAGE The installable unit
> org.eclipse.equinox.executable_root.win32.win32.x86_64 is missing the
> filename property.
>
> !ENTRY org.eclipse.equinox.p2.engine 4 4 2009-05-26 15:00:02.844
> !MESSAGE An error occurred while installing the items
> !SUBENTRY 1 org.eclipse.equinox.p2.engine 4 0 2009-05-26 15:00:02.844
> !MESSAGE session context was:(profile=SDKProfile,
> phase=org.eclipse.equinox.internal.provisional.p2.engine.pha ses.Install,
> operand=null --> [R]org.eclipse.equinox.executable_root
> 3.3.200.v20090521-1800-7M-Fm-FI3UouOe61h3BYGC,
> action=org.eclipse.equinox.internal.p2.touchpoint.natives.ac tions.UnzipAction).
>
> !SUBENTRY 1 org.eclipse.equinox.p2.touchpoint.natives 4 0 2009-05-26
> 15:00:02.844
> !MESSAGE The artifact for
> binary,org.eclipse.equinox.executable_root,3.3.200.v20090521 -1800-7M-Fm-FI3UouOe61h3BYGC
> is not available.
>
> !ENTRY org.eclipse.equinox.p2.director 4 1 2009-05-26 15:00:03.036
> !MESSAGE Cannot complete the install because one or more required items
> could not be found.
> !SUBENTRY 1 org.eclipse.equinox.p2.director 4 0 2009-05-26 15:00:03.036
> !MESSAGE Software being installed: My Platform 2.2.0
> (my.feature.feature.group 2.2.0)
> !SUBENTRY 1 org.eclipse.equinox.p2.director 4 0 2009-05-26 15:00:03.036
> !MESSAGE Missing requirement: My RCP 2.2.0 (my.feature.rcp.feature.group
> 2.2.0) requires 'org.eclipse.rcp.feature.group
> [3.5.0.v20090519-9SA-FwxFv6x-rk8-j91Tg58C,3.6.0)' but it could not be found
> !SUBENTRY 1 org.eclipse.equinox.p2.director 4 1 2009-05-26 15:00:03.036
> !MESSAGE Cannot satisfy dependency:
> !SUBENTRY 2 org.eclipse.equinox.p2.director 4 0 2009-05-26 15:00:03.036
> !MESSAGE From: My Platform 2.2.0 (my.feature.feature.group 2.2.0)
> !SUBENTRY 2 org.eclipse.equinox.p2.director 4 0 2009-05-26 15:00:03.036
> !MESSAGE To: my.feature.rcp.feature.group [2.2.0]
>
>
Previous Topic:Signing jars built from site.xml?
Next Topic:NewSearchUI EmptySearchView
Goto Forum:
  


Current Time: Tue Jun 15 11:08:33 GMT 2021

Powered by FUDForum. Page generated in 0.02228 seconds
.:: Contact :: Home ::.

Powered by: FUDforum 3.0.2.
Copyright ©2001-2010 FUDforum Bulletin Board Software

Back to the top