Skip to main content


Eclipse Community Forums
Forum Search:

Search      Help    Register    Login    Home
Home » Modeling » TMF (Xtext) » Error in building shadowJar in command prompt
Error in building shadowJar in command prompt [message #1801284] Wed, 16 January 2019 07:29 Go to next message
P J is currently offline P JFriend
Messages: 64
Registered: October 2018
Member
Hi,

I tried to build a shadowJar from a simple Xtext file (as it is by default) in a new machine. However, I get the below error when I executed the "gradle shadowJar" command. However, there is no error when running the MWE2 workflow in the Eclipse IDE. I have installed gradle in this machine. Could anyone please help to resolve this?

Failed to notify ProjectEvaluationListener.afterEvaluate(), but primary configuration failure takes precedence.
org.gradle.internal.event.ListenerNotificationException: Failed to notify project evaluation listener.
        at org.gradle.internal.event.AbstractBroadcastDispatch.dispatch(AbstractBroadcastDispatch.java:55)
        at org.gradle.internal.event.BroadcastDispatch.dispatch(BroadcastDispatch.java:79)
        at org.gradle.internal.event.BroadcastDispatch.dispatch(BroadcastDispatch.java:30)
        at org.gradle.messaging.dispatch.ProxyDispatchAdapter$DispatchingInvocationHandler.invoke(ProxyDispatchAdapter.java:93)
        at com.sun.proxy.$Proxy12.afterEvaluate(Unknown Source)
        at org.gradle.configuration.project.LifecycleProjectEvaluator.notifyAfterEvaluate(LifecycleProjectEvaluator.java:67)
        at org.gradle.configuration.project.LifecycleProjectEvaluator.evaluate(LifecycleProjectEvaluator.java:61)
        at org.gradle.api.internal.project.AbstractProject.evaluate(AbstractProject.java:499)
        at org.gradle.api.internal.project.AbstractProject.evaluate(AbstractProject.java:86)
        at org.gradle.execution.TaskPathProjectEvaluator.configureHierarchy(TaskPathProjectEvaluator.java:47)
        at org.gradle.configuration.DefaultBuildConfigurer.configure(DefaultBuildConfigurer.java:35)
        at org.gradle.initialization.DefaultGradleLauncher$2.run(DefaultGradleLauncher.java:125)
        at org.gradle.internal.Factories$1.create(Factories.java:22)
        at org.gradle.internal.progress.DefaultBuildOperationExecutor.run(DefaultBuildOperationExecutor.java:90)
        at org.gradle.internal.progress.DefaultBuildOperationExecutor.run(DefaultBuildOperationExecutor.java:52)
        at org.gradle.initialization.DefaultGradleLauncher.doBuildStages(DefaultGradleLauncher.java:122)
        at org.gradle.initialization.DefaultGradleLauncher.access$200(DefaultGradleLauncher.java:32)
        at org.gradle.initialization.DefaultGradleLauncher$1.create(DefaultGradleLauncher.java:99)
        at org.gradle.initialization.DefaultGradleLauncher$1.create(DefaultGradleLauncher.java:93)
        at org.gradle.internal.progress.DefaultBuildOperationExecutor.run(DefaultBuildOperationExecutor.java:90)
        at org.gradle.internal.progress.DefaultBuildOperationExecutor.run(DefaultBuildOperationExecutor.java:62)
        at org.gradle.initialization.DefaultGradleLauncher.doBuild(DefaultGradleLauncher.java:93)
        at org.gradle.initialization.DefaultGradleLauncher.run(DefaultGradleLauncher.java:82)
        at org.gradle.launcher.exec.InProcessBuildActionExecuter$DefaultBuildController.run(InProcessBuildActionExecuter.java:94)
        at org.gradle.tooling.internal.provider.ExecuteBuildActionRunner.run(ExecuteBuildActionRunner.java:28)
        at org.gradle.launcher.exec.ChainingBuildActionRunner.run(ChainingBuildActionRunner.java:35)
        at org.gradle.launcher.exec.InProcessBuildActionExecuter.execute(InProcessBuildActionExecuter.java:43)
        at org.gradle.launcher.exec.InProcessBuildActionExecuter.execute(InProcessBuildActionExecuter.java:28)
        at org.gradle.launcher.exec.ContinuousBuildActionExecuter.execute(ContinuousBuildActionExecuter.java:77)
        at org.gradle.launcher.exec.ContinuousBuildActionExecuter.execute(ContinuousBuildActionExecuter.java:47)
        at org.gradle.launcher.exec.DaemonUsageSuggestingBuildActionExecuter.execute(DaemonUsageSuggestingBuildActionExecuter.java:51)
        at org.gradle.launcher.exec.DaemonUsageSuggestingBuildActionExecuter.execute(DaemonUsageSuggestingBuildActionExecuter.java:28)
        at org.gradle.launcher.cli.RunBuildAction.run(RunBuildAction.java:43)
        at org.gradle.internal.Actions$RunnableActionAdapter.execute(Actions.java:170)
        at org.gradle.launcher.cli.CommandLineActionFactory$ParseAndBuildAction.execute(CommandLineActionFactory.java:237)
        at org.gradle.launcher.cli.CommandLineActionFactory$ParseAndBuildAction.execute(CommandLineActionFactory.java:210)
        at org.gradle.launcher.cli.JavaRuntimeValidationAction.execute(JavaRuntimeValidationAction.java:35)
        at org.gradle.launcher.cli.JavaRuntimeValidationAction.execute(JavaRuntimeValidationAction.java:24)
        at org.gradle.launcher.cli.CommandLineActionFactory$WithLogging.execute(CommandLineActionFactory.java:206)
        at org.gradle.launcher.cli.CommandLineActionFactory$WithLogging.execute(CommandLineActionFactory.java:169)
        at org.gradle.launcher.cli.ExceptionReportingAction.execute(ExceptionReportingAction.java:33)
        at org.gradle.launcher.cli.ExceptionReportingAction.execute(ExceptionReportingAction.java:22)
        at org.gradle.launcher.Main.doAction(Main.java:33)
        at org.gradle.launcher.bootstrap.EntryPoint.run(EntryPoint.java:45)
        at sun.reflect.NativeMethodAccessorImpl.invoke0(Native Method)
        at sun.reflect.NativeMethodAccessorImpl.invoke(NativeMethodAccessorImpl.java:62)
        at sun.reflect.DelegatingMethodAccessorImpl.invoke(DelegatingMethodAccessorImpl.java:43)
        at java.lang.reflect.Method.invoke(Method.java:498)
        at org.gradle.launcher.bootstrap.ProcessBootstrap.runNoExit(ProcessBootstrap.java:54)
        at org.gradle.launcher.bootstrap.ProcessBootstrap.run(ProcessBootstrap.java:35)
        at org.gradle.launcher.GradleMain.main(GradleMain.java:23)
Cause 1: java.lang.NoSuchMethodError: org.gradle.api.tasks.compile.CompileOptions.getBootstrapClasspath()Lorg/gradle/api/file/FileCollection;
        at org.xtext.gradle.XtextBuilderPlugin.lambda$null$24(XtextBuilderPlugin.java:394)
        at org.gradle.internal.event.BroadcastDispatch$ActionInvocationHandler.dispatch(BroadcastDispatch.java:93)
        at org.gradle.internal.event.BroadcastDispatch$ActionInvocationHandler.dispatch(BroadcastDispatch.java:82)
        at org.gradle.internal.event.AbstractBroadcastDispatch.dispatch(AbstractBroadcastDispatch.java:44)
        at org.gradle.internal.event.BroadcastDispatch.dispatch(BroadcastDispatch.java:79)
        at org.gradle.internal.event.BroadcastDispatch.dispatch(BroadcastDispatch.java:30)
        at org.gradle.messaging.dispatch.ProxyDispatchAdapter$DispatchingInvocationHandler.invoke(ProxyDispatchAdapter.java:93)
        at com.sun.proxy.$Proxy12.afterEvaluate(Unknown Source)
        at org.gradle.configuration.project.LifecycleProjectEvaluator.notifyAfterEvaluate(LifecycleProjectEvaluator.java:67)
        at org.gradle.configuration.project.LifecycleProjectEvaluator.evaluate(LifecycleProjectEvaluator.java:61)
        at org.gradle.api.internal.project.AbstractProject.evaluate(AbstractProject.java:499)
        at org.gradle.api.internal.project.AbstractProject.evaluate(AbstractProject.java:86)
        at org.gradle.execution.TaskPathProjectEvaluator.configureHierarchy(TaskPathProjectEvaluator.java:47)
        at org.gradle.configuration.DefaultBuildConfigurer.configure(DefaultBuildConfigurer.java:35)
        at org.gradle.initialization.DefaultGradleLauncher$2.run(DefaultGradleLauncher.java:125)
        at org.gradle.internal.Factories$1.create(Factories.java:22)
        at org.gradle.internal.progress.DefaultBuildOperationExecutor.run(DefaultBuildOperationExecutor.java:90)
        at org.gradle.internal.progress.DefaultBuildOperationExecutor.run(DefaultBuildOperationExecutor.java:52)
        at org.gradle.initialization.DefaultGradleLauncher.doBuildStages(DefaultGradleLauncher.java:122)
        at org.gradle.initialization.DefaultGradleLauncher.access$200(DefaultGradleLauncher.java:32)
        at org.gradle.initialization.DefaultGradleLauncher$1.create(DefaultGradleLauncher.java:99)
        at org.gradle.initialization.DefaultGradleLauncher$1.create(DefaultGradleLauncher.java:93)
        at org.gradle.internal.progress.DefaultBuildOperationExecutor.run(DefaultBuildOperationExecutor.java:90)
        at org.gradle.internal.progress.DefaultBuildOperationExecutor.run(DefaultBuildOperationExecutor.java:62)
        at org.gradle.initialization.DefaultGradleLauncher.doBuild(DefaultGradleLauncher.java:93)
        at org.gradle.initialization.DefaultGradleLauncher.run(DefaultGradleLauncher.java:82)
        at org.gradle.launcher.exec.InProcessBuildActionExecuter$DefaultBuildController.run(InProcessBuildActionExecuter.java:94)
        at org.gradle.tooling.internal.provider.ExecuteBuildActionRunner.run(ExecuteBuildActionRunner.java:28)
        at org.gradle.launcher.exec.ChainingBuildActionRunner.run(ChainingBuildActionRunner.java:35)
        at org.gradle.launcher.exec.InProcessBuildActionExecuter.execute(InProcessBuildActionExecuter.java:43)
        at org.gradle.launcher.exec.InProcessBuildActionExecuter.execute(InProcessBuildActionExecuter.java:28)
        at org.gradle.launcher.exec.ContinuousBuildActionExecuter.execute(ContinuousBuildActionExecuter.java:77)
        at org.gradle.launcher.exec.ContinuousBuildActionExecuter.execute(ContinuousBuildActionExecuter.java:47)
        at org.gradle.launcher.exec.DaemonUsageSuggestingBuildActionExecuter.execute(DaemonUsageSuggestingBuildActionExecuter.java:51)
        at org.gradle.launcher.exec.DaemonUsageSuggestingBuildActionExecuter.execute(DaemonUsageSuggestingBuildActionExecuter.java:28)
        at org.gradle.launcher.cli.RunBuildAction.run(RunBuildAction.java:43)
        at org.gradle.internal.Actions$RunnableActionAdapter.execute(Actions.java:170)
        at org.gradle.launcher.cli.CommandLineActionFactory$ParseAndBuildAction.execute(CommandLineActionFactory.java:237)
        at org.gradle.launcher.cli.CommandLineActionFactory$ParseAndBuildAction.execute(CommandLineActionFactory.java:210)
        at org.gradle.launcher.cli.JavaRuntimeValidationAction.execute(JavaRuntimeValidationAction.java:35)
        at org.gradle.launcher.cli.JavaRuntimeValidationAction.execute(JavaRuntimeValidationAction.java:24)
        at org.gradle.launcher.cli.CommandLineActionFactory$WithLogging.execute(CommandLineActionFactory.java:206)
        at org.gradle.launcher.cli.CommandLineActionFactory$WithLogging.execute(CommandLineActionFactory.java:169)
        at org.gradle.launcher.cli.ExceptionReportingAction.execute(ExceptionReportingAction.java:33)
        at org.gradle.launcher.cli.ExceptionReportingAction.execute(ExceptionReportingAction.java:22)
        at org.gradle.launcher.Main.doAction(Main.java:33)
        at org.gradle.launcher.bootstrap.EntryPoint.run(EntryPoint.java:45)
        at sun.reflect.NativeMethodAccessorImpl.invoke0(Native Method)
        at sun.reflect.NativeMethodAccessorImpl.invoke(NativeMethodAccessorImpl.java:62)
        at sun.reflect.DelegatingMethodAccessorImpl.invoke(DelegatingMethodAccessorImpl.java:43)
        at java.lang.reflect.Method.invoke(Method.java:498)
        at org.gradle.launcher.bootstrap.ProcessBootstrap.runNoExit(ProcessBootstrap.java:54)
        at org.gradle.launcher.bootstrap.ProcessBootstrap.run(ProcessBootstrap.java:35)
        at org.gradle.launcher.GradleMain.main(GradleMain.java:23)
Cause 2: java.lang.NoSuchMethodError: org.gradle.api.tasks.compile.CompileOptions.getBootstrapClasspath()Lorg/gradle/api/file/FileCollection;
        at org.xtext.gradle.XtextBuilderPlugin.lambda$null$24(XtextBuilderPlugin.java:394)
        at org.gradle.internal.event.BroadcastDispatch$ActionInvocationHandler.dispatch(BroadcastDispatch.java:93)
        at org.gradle.internal.event.BroadcastDispatch$ActionInvocationHandler.dispatch(BroadcastDispatch.java:82)
        at org.gradle.internal.event.AbstractBroadcastDispatch.dispatch(AbstractBroadcastDispatch.java:44)
        at org.gradle.internal.event.BroadcastDispatch.dispatch(BroadcastDispatch.java:79)
        at org.gradle.internal.event.BroadcastDispatch.dispatch(BroadcastDispatch.java:30)
        at org.gradle.messaging.dispatch.ProxyDispatchAdapter$DispatchingInvocationHandler.invoke(ProxyDispatchAdapter.java:93)
        at com.sun.proxy.$Proxy12.afterEvaluate(Unknown Source)
        at org.gradle.configuration.project.LifecycleProjectEvaluator.notifyAfterEvaluate(LifecycleProjectEvaluator.java:67)
        at org.gradle.configuration.project.LifecycleProjectEvaluator.evaluate(LifecycleProjectEvaluator.java:61)
        at org.gradle.api.internal.project.AbstractProject.evaluate(AbstractProject.java:499)
        at org.gradle.api.internal.project.AbstractProject.evaluate(AbstractProject.java:86)
        at org.gradle.execution.TaskPathProjectEvaluator.configureHierarchy(TaskPathProjectEvaluator.java:47)
        at org.gradle.configuration.DefaultBuildConfigurer.configure(DefaultBuildConfigurer.java:35)
        at org.gradle.initialization.DefaultGradleLauncher$2.run(DefaultGradleLauncher.java:125)
        at org.gradle.internal.Factories$1.create(Factories.java:22)
        at org.gradle.internal.progress.DefaultBuildOperationExecutor.run(DefaultBuildOperationExecutor.java:90)
        at org.gradle.internal.progress.DefaultBuildOperationExecutor.run(DefaultBuildOperationExecutor.java:52)
        at org.gradle.initialization.DefaultGradleLauncher.doBuildStages(DefaultGradleLauncher.java:122)
        at org.gradle.initialization.DefaultGradleLauncher.access$200(DefaultGradleLauncher.java:32)
        at org.gradle.initialization.DefaultGradleLauncher$1.create(DefaultGradleLauncher.java:99)
        at org.gradle.initialization.DefaultGradleLauncher$1.create(DefaultGradleLauncher.java:93)
        at org.gradle.internal.progress.DefaultBuildOperationExecutor.run(DefaultBuildOperationExecutor.java:90)
        at org.gradle.internal.progress.DefaultBuildOperationExecutor.run(DefaultBuildOperationExecutor.java:62)
        at org.gradle.initialization.DefaultGradleLauncher.doBuild(DefaultGradleLauncher.java:93)
        at org.gradle.initialization.DefaultGradleLauncher.run(DefaultGradleLauncher.java:82)
        at org.gradle.launcher.exec.InProcessBuildActionExecuter$DefaultBuildController.run(InProcessBuildActionExecuter.java:94)
        at org.gradle.tooling.internal.provider.ExecuteBuildActionRunner.run(ExecuteBuildActionRunner.java:28)
        at org.gradle.launcher.exec.ChainingBuildActionRunner.run(ChainingBuildActionRunner.java:35)
        at org.gradle.launcher.exec.InProcessBuildActionExecuter.execute(InProcessBuildActionExecuter.java:43)
        at org.gradle.launcher.exec.InProcessBuildActionExecuter.execute(InProcessBuildActionExecuter.java:28)
        at org.gradle.launcher.exec.ContinuousBuildActionExecuter.execute(ContinuousBuildActionExecuter.java:77)
        at org.gradle.launcher.exec.ContinuousBuildActionExecuter.execute(ContinuousBuildActionExecuter.java:47)
        at org.gradle.launcher.exec.DaemonUsageSuggestingBuildActionExecuter.execute(DaemonUsageSuggestingBuildActionExecuter.java:51)
        at org.gradle.launcher.exec.DaemonUsageSuggestingBuildActionExecuter.execute(DaemonUsageSuggestingBuildActionExecuter.java:28)
        at org.gradle.launcher.cli.RunBuildAction.run(RunBuildAction.java:43)
        at org.gradle.internal.Actions$RunnableActionAdapter.execute(Actions.java:170)
        at org.gradle.launcher.cli.CommandLineActionFactory$ParseAndBuildAction.execute(CommandLineActionFactory.java:237)
        at org.gradle.launcher.cli.CommandLineActionFactory$ParseAndBuildAction.execute(CommandLineActionFactory.java:210)
        at org.gradle.launcher.cli.JavaRuntimeValidationAction.execute(JavaRuntimeValidationAction.java:35)
        at org.gradle.launcher.cli.JavaRuntimeValidationAction.execute(JavaRuntimeValidationAction.java:24)
        at org.gradle.launcher.cli.CommandLineActionFactory$WithLogging.execute(CommandLineActionFactory.java:206)
        at org.gradle.launcher.cli.CommandLineActionFactory$WithLogging.execute(CommandLineActionFactory.java:169)
        at org.gradle.launcher.cli.ExceptionReportingAction.execute(ExceptionReportingAction.java:33)
        at org.gradle.launcher.cli.ExceptionReportingAction.execute(ExceptionReportingAction.java:22)
        at org.gradle.launcher.Main.doAction(Main.java:33)
        at org.gradle.launcher.bootstrap.EntryPoint.run(EntryPoint.java:45)
        at sun.reflect.NativeMethodAccessorImpl.invoke0(Native Method)
        at sun.reflect.NativeMethodAccessorImpl.invoke(NativeMethodAccessorImpl.java:62)
        at sun.reflect.DelegatingMethodAccessorImpl.invoke(DelegatingMethodAccessorImpl.java:43)
        at java.lang.reflect.Method.invoke(Method.java:498)
        at org.gradle.launcher.bootstrap.ProcessBootstrap.runNoExit(ProcessBootstrap.java:54)
        at org.gradle.launcher.bootstrap.ProcessBootstrap.run(ProcessBootstrap.java:35)
        at org.gradle.launcher.GradleMain.main(GradleMain.java:23)

FAILURE: Build failed with an exception.

* Where:
Build file 'D:\Shakyani\Test\org.xtext.example.mydsl.parent\org.xtext.example.mydsl\build.gradle' line: 34

* What went wrong:
A problem occurred evaluating project ':org.xtext.example.mydsl'.
> Could not find method useJUnitPlatform() for arguments [] on project ':org.xtext.example.mydsl'.

* Try:
Run with --stacktrace option to get the stack trace. Run with --info or --debug option to get more log output.

BUILD FAILED

Total time: 4.743 secs


Regards!
Re: Error in building shadowJar in command prompt [message #1801285 is a reply to message #1801284] Wed, 16 January 2019 07:34 Go to previous messageGo to next message
Christian Dietrich is currently offline Christian DietrichFriend
Messages: 13067
Registered: July 2009
Senior Member
Which Xtext version ?
https://github.com/eclipse/xtext/issues/1373


Need professional support for Xtext, Xpand, EMF?
Go to: https://www.itemis.com/en/xtext/
Twitter : @chrdietrich
Blog : https://www.dietrich-it.de
Re: Error in building shadowJar in command prompt [message #1801286 is a reply to message #1801285] Wed, 16 January 2019 07:48 Go to previous messageGo to next message
P J is currently offline P JFriend
Messages: 64
Registered: October 2018
Member
Hi Christian,

It turned out that the gradle version in the machine was too old. I reinstalled Gradle 4.10.2 and it worked.

Regards!
Re: Error in building shadowJar in command prompt [message #1801287 is a reply to message #1801284] Wed, 16 January 2019 08:22 Go to previous messageGo to next message
Karsten Thoms is currently offline Karsten ThomsFriend
Messages: 687
Registered: July 2009
Location: Dortmund, Germany
Senior Member

You should use the Gradle wrapper to pin a specific Gradle version and do not rely on one installed on the machine.
Re: Error in building shadowJar in command prompt [message #1801302 is a reply to message #1801287] Wed, 16 January 2019 11:22 Go to previous message
P J is currently offline P JFriend
Messages: 64
Registered: October 2018
Member
Thank you Christian and Karsten! I will follow these advice.
Previous Topic:Xtext 2.17.0.M1 is out
Next Topic:Xtext Vs. Antlr
Goto Forum:
  


Current Time: Tue Aug 20 16:26:03 GMT 2019

Powered by FUDForum. Page generated in 0.01633 seconds
.:: Contact :: Home ::.

Powered by: FUDforum 3.0.2.
Copyright ©2001-2010 FUDforum Bulletin Board Software

Back to the top