Eclipse Community Forums
Forum Search:

Search      Help    Register    Login    Home
    Replies Views Last message
  testexec hangs under linux
autagent under windows and testexec under linux
By: Dirk Willert on Thu, 23 January 2014
3 1598 Tue, 28 January 2014 09:10
By: Alexandra Schladebeck
  Autagent under Suse Linux in Xvnc Session problem
By: Dirk Willert on Fri, 17 January 2014
3 43021 Mon, 27 January 2014 15:05
By: Dirk Willert
  Installing Plugin for RCP-AUT under Eclipse e4 (= Eclipse 4.2)
By: Kay Odenthal on Tue, 21 January 2014
3 4607 Mon, 27 January 2014 07:09
By: Alexandra Schladebeck
icon5.gif Extend Jubula for ImageHyperlink
By: ye ye on Thu, 23 January 2014
1 931 Fri, 24 January 2014 07:38
By: Alexandra Schladebeck
  Extension with Jubula 1.3.0
By: Alexander Berger on Wed, 06 February 2013
4 3069 Thu, 23 January 2014 08:04
By: ye ye
  Error by trying to run a test Job under linux
Could not connect to AUT error
By: Dirk Willert on Thu, 16 January 2014
1 54278 Mon, 20 January 2014 12:17
By: Alexandra Schladebeck
  Drag'n'drop on tree with a window opening
By: Elise Ruelle on Fri, 17 January 2014
1 40255 Mon, 20 January 2014 12:09
By: Alexandra Schladebeck
  Autagent as a Service under Windows ?
By: Dirk Willert on Fri, 17 January 2014
1 20392 Sat, 18 January 2014 10:42
By: Achim Loerke
  Error with result path in config.xml
Error result path is not writeable
By: Dirk Willert on Wed, 15 January 2014
2 1027 Wed, 15 January 2014 16:17
By: Dirk Willert
  Different technical names for the same component
By: Elise Ruelle on Fri, 10 January 2014
2 24024 Wed, 15 January 2014 13:33
By: Elise Ruelle
  Logo and Icons recognition
Comparison
By: louy koko on Mon, 13 January 2014
1 9977 Wed, 15 January 2014 07:19
By: Alexandra Schladebeck
  How to test SWT-Messageboxes
Object Mapping isn't working though it's a standard SWT-widget
By: Lars Friedland on Tue, 07 January 2014
6 4115 Wed, 15 January 2014 07:17
By: Alexandra Schladebeck
  Autagent running systems
By: Dirk Willert on Mon, 13 January 2014
1 8161 Wed, 15 January 2014 07:17
By: Alexandra Schladebeck
  Can Jubula under linux write own xml.result file after test ?
Can Jubula under linux write own xml.result file after test ?
By: Dirk Willert on Mon, 13 January 2014
1 4280 Tue, 14 January 2014 11:05
By: Ajantha Yogamoorthy
  Problems with "Export all" option
When I select Test>Export all option, my project is not exported
By: Laura Gutierrez on Mon, 02 December 2013
6 2226 Fri, 10 January 2014 14:39
By: Alexandra Schladebeck
  Jubula ALM Mantis Exception by reporting results
Exception by trying to report the test result to Mylyn ALM Mantis
By: Dirk Willert on Fri, 10 January 2014
1 3409 Fri, 10 January 2014 14:17
By: Achim Loerke
  Cannot connect to internal H2 database
By: Christian Pontesegger on Thu, 07 March 2013
17 7675 Fri, 10 January 2014 07:22
By: Alexandra Schladebeck
  execute next test step within a test suite
By: Sascha Winkler on Wed, 08 January 2014
1 7050 Fri, 10 January 2014 07:01
By: Alexandra Schladebeck
  Spontanous error message from Jubula
Spontanous error message from Jubula
By: Jurjen Hofstra on Mon, 06 January 2014
5 1105 Wed, 08 January 2014 12:06
By: Alexandra Schladebeck
  Class loading issue in Jubula in my RCP UAT
Fail to load class named 'org.eclipse.jubula.rc.common.commands.ConnectToClientCommand'
By: Rockhopper Mising name on Thu, 19 December 2013
3 6310 Wed, 08 January 2014 09:43
By: Alexandra Schladebeck
  How can i get Unassigned Technical Name..?
Unassigned Technical name.
By: Rajasekar S on Fri, 27 December 2013
2 76724 Mon, 06 January 2014 14:50
By: Rajasekar S
  Test Creation -Mobile Toolkit and iOS Toolkit
By: Alok Shukla on Tue, 10 December 2013
11 5953 Mon, 06 January 2014 11:20
By: Alexandra Schladebeck
  Mapping
Mapping window displayed as empty
By: Rajasekar S on Thu, 12 December 2013
1 43276 Mon, 06 January 2014 11:18
By: Alexandra Schladebeck
  Combining local data and central data sets?
test case data, data sets
By: Marc Seefeldt on Wed, 18 December 2013
1 13828 Mon, 06 January 2014 11:12
By: Alexandra Schladebeck
  importing projects after upgrade failing due to dependencies
unable to import my project after upgrade because of dependencies
By: anthony schorr on Tue, 17 December 2013
5 10069 Mon, 06 January 2014 11:10
By: Alexandra Schladebeck
  External AUT Agent Not Working
By: Alok Shukla on Thu, 19 December 2013
1 7017 Mon, 06 January 2014 11:08
By: Alexandra Schladebeck
  Unassigned Component window displayed as empty
Unassigned Component window displayed as empty in object mapping editor.
By: Rajasekar S on Thu, 19 December 2013
3 6330 Mon, 06 January 2014 11:01
By: Alexandra Schladebeck
icon5.gif Any plan for 2.2 Feature Version in Kepler Update Site?
By: Tom Tan on Fri, 03 January 2014
2 2160 Mon, 06 January 2014 02:07
By: Tom Tan
  How to run Jubula with Maven?
By: Jiajian Lei on Fri, 11 October 2013
2 1257 Tue, 31 December 2013 14:20
By: Jose Ribeiro
  Problem to extend existing tree component by new action
By: Michi Classen on Fri, 13 December 2013
1 40592 Thu, 26 December 2013 12:50
By: Alexander Kolesov
  How to check checkbox in a table
By: santosh Bhutkar on Wed, 30 January 2013
8 5510 Thu, 26 December 2013 12:41
By: Alexander Kolesov
  How to configure database
Oracle date base configuration.
By: Rajasekar S on Wed, 18 December 2013
3 1233 Thu, 19 December 2013 10:27
By: Achim Loerke
  HTML AUT will not start
By: Sascha Winkler on Fri, 13 December 2013
3 7483 Mon, 16 December 2013 11:55
By: Achim Loerke
  Component with text should not contain certain string
By: Sascha Winkler on Mon, 09 December 2013
4 3101 Thu, 12 December 2013 14:39
By: Sascha Winkler
  Poll: Poll: Do you test Java 1.4 AUT's?
By: Alexandra Schladebeck on Thu, 12 December 2013
0 49978 Thu, 12 December 2013 07:43
By: Alexandra Schladebeck
  Cannot import .xls file as central dataset
By: Dmitriy T on Mon, 09 December 2013
2 2759 Tue, 10 December 2013 09:07
By: Dmitriy T
  Test Creation -Mobile Toolkit
By: Alok Shukla on Tue, 10 December 2013
1 786 Tue, 10 December 2013 08:53
By: Alexandra Schladebeck
  Tester Class of fragment not being called
Tester Class of fragment not being called
By: Ankita Chawda on Thu, 05 December 2013
1 4232 Tue, 10 December 2013 07:23
By: Alexandra Schladebeck
  (how) can we test a non-deterministic application?
jubula non-deterministic
By: nico nijman on Fri, 22 November 2013
3 2156 Tue, 10 December 2013 07:18
By: Alexandra Schladebeck
  Short Pathname in TreeTables
short Pathnames in Tree Tables couldnt be selected
By: Dominik Gabriel on Thu, 28 November 2013
6 2154 Tue, 10 December 2013 07:16
By: Alexandra Schladebeck
  Test Suite referencing
By: David Healy on Mon, 09 December 2013
1 3817 Tue, 10 December 2013 07:15
By: Alexandra Schladebeck
  Problem with ":"
Problem with ":"
By: Marie-Christin Kloss on Tue, 10 September 2013
8 2571 Mon, 09 December 2013 11:02
By: Dmitriy T
  Object Mapping - Permission denied to access property
By: Christian Krause on Thu, 05 December 2013
0 14497 Thu, 05 December 2013 08:50
By: Christian Krause
  Problem by extending an existing TesterClass
By: Philipp Wueller on Mon, 09 September 2013
4 2105 Wed, 04 December 2013 15:20
By: Yuvraj Nigade
  Drag and drop
How to use drag and drop option in jubula
By: Vijay Vasanthkumar on Tue, 26 November 2013
1 1648 Mon, 02 December 2013 07:40
By: Alexandra Schladebeck
  Access to HTML table content
By: Marc Seefeldt on Tue, 26 November 2013
1 1194 Thu, 28 November 2013 09:38
By: Oliver Goetz
  how to copy existing test case?
By: Neon Ngo on Mon, 18 November 2013
3 2078 Wed, 27 November 2013 13:39
By: Neon Ngo
  RCP AUT not detectet when using plugin from Kepler Update Site
By: Sascha Winkler on Tue, 29 October 2013
2 2055 Tue, 26 November 2013 11:59
By: Sascha Winkler
  different unbound_module versions in standalone and eclipse plugin
By: Sascha Winkler on Wed, 23 October 2013
3 1346 Fri, 22 November 2013 20:00
By: Bernard Rossi
  Standalone 7.2 incompatibility with Eclipse plugin
Current Eclipse plugin does not with database from Jubula 7.2 standalone
By: Bernard Rossi on Tue, 29 October 2013
3 3563 Fri, 22 November 2013 19:35
By: Bernard Rossi
  executable jar with datafiles for Jubula
executable jar with datafiles for Jubula
By: Samantha Guillot on Wed, 20 June 2012
6 4605 Fri, 22 November 2013 13:31
By: John Smither
  How to link JaCoCo eclipse plugin with Jubula eclipse plugin
By: Martin Figel on Thu, 21 November 2013
2 1913 Fri, 22 November 2013 06:52
By: Martin Figel
  Trigger for 'org.eclipse.jubula.client.core.function' extension point
Trigger for 'org.eclipse.jubula.client.core.function' extension point
By: Yuvraj Nigade on Thu, 21 November 2013
1 707 Thu, 21 November 2013 16:06
By: Yuvraj Nigade
  External sql command executed without effect
By: Martin Figel on Mon, 11 November 2013
3 7066 Wed, 20 November 2013 06:47
By: Alexandra Schladebeck
  Easy changing of hierarchical IDs
By: Daniel Opitz on Mon, 18 November 2013
1 1306 Wed, 20 November 2013 06:45
By: Alexandra Schladebeck
  Poll: Poll: Which tab do you use in the object mapping editor
By: Alexandra Schladebeck on Tue, 19 November 2013
0 2572 Tue, 19 November 2013 06:32
By: Alexandra Schladebeck
  RAP Support
By: Joaquin Morcate on Fri, 03 May 2013
6 12819 Mon, 18 November 2013 07:35
By: Alexandra Schladebeck
  Extend jubula with a self-written RCP Plugin
Jubula enables the adding of own function for getting parameter values
By: Marco Franke on Sun, 30 September 2012
9 4953 Thu, 14 November 2013 13:40
By: Alok Shukla
  Extend Jubula
By: Marc Missing name on Fri, 11 November 2011
17 9435 Thu, 14 November 2013 12:13
By: Alok Shukla
  Set Test Parameters with Jenkins at startup of test
Set Test Parameters with Jenkins at startup of test
By: Dominik Gabriel on Tue, 12 November 2013
2 1396 Wed, 13 November 2013 08:58
By: Sylvain EVEILLARD
  Exporting single Testsuites out of a Project
Exporting single Testsuites out of a Project and import in new Version
By: Dominik Gabriel on Mon, 11 November 2013
1 1148 Tue, 12 November 2013 11:26
By: Ajantha Yogamoorthy
  Writing plugin extension for Jubula
Writing plugin extension for Jubula
By: Yuvraj Nigade on Wed, 06 November 2013
2 1813 Fri, 08 November 2013 13:19
By: Yuvraj Nigade
  Propagated component name becomes of 'unknown' type by some reason
By: Alexander Kolesov on Tue, 08 October 2013
4 2575 Fri, 08 November 2013 09:38
By: Alexander Kolesov
  Error 7009
Test Execution Error
By: nicole h on Tue, 28 May 2013
12 3055 Fri, 08 November 2013 04:50
By: Rajesh Dash
  Test RCP AUT with Luna target platform
wanna Test a RCP AUT with Luna target platform with Jubula
By: Dominik Gabriel on Thu, 31 October 2013
5 2644 Thu, 07 November 2013 12:20
By: Dominik Gabriel
  press "Start AUT" and get '5009: AUT start failed No valid Java binary found.'
error message when try to start test object
By: Erik Gilbert on Thu, 02 August 2012
2 3441 Tue, 05 November 2013 21:17
By: Bernard Rossi
  Dealing with a growing test library and new product versions
Is it time to refactor? How do I continue to test my previous product series.
By: Youssef Bagoulla on Fri, 01 November 2013
0 2152 Fri, 01 November 2013 14:25
By: Youssef Bagoulla
icon5.gif Building Jubula and documentation
By: Egor Sukhanov on Sat, 19 October 2013
4 2399 Fri, 01 November 2013 08:20
By: Ajantha Yogamoorthy
  key combinations does'nt work
By: Hendrik Stehr on Wed, 23 October 2013
2 1285 Fri, 25 October 2013 08:09
By: Hendrik Stehr
  track user who create/change an testcase
By: Hendrik Stehr on Wed, 23 October 2013
4 1343 Fri, 25 October 2013 07:30
By: Hendrik Stehr
  RCP Application is NOT recognized with 2.0.1
By: Bhupendra Mahajan on Tue, 15 October 2013
28 4016 Fri, 25 October 2013 07:27
By: Alexandra Schladebeck
  Jubula and GUIdancer Version 7.2 released
By: Alexandra Schladebeck on Thu, 17 October 2013
7 2107 Fri, 25 October 2013 05:15
By: Alexandra Schladebeck
  Mulit-User-Tests with Jubula
By: Hendrik Stehr on Wed, 23 October 2013
1 946 Thu, 24 October 2013 12:13
By: Alexandra Schladebeck
  Component Name as Parameter
wanna use a case on different components
By: Dominik Gabriel on Mon, 10 June 2013
5 2995 Wed, 23 October 2013 10:26
By: Sascha Winkler
  Running Jubula on a windows Jenkins agent requires a display plugin?
By: Jiajian Lei on Thu, 17 October 2013
4 4683 Tue, 22 October 2013 06:59
By: Achim Loerke
icon5.gif Question: Jubula database on Amazon RDS
By: Alejo Abdala on Thu, 17 October 2013
2 1124 Fri, 18 October 2013 12:31
By: Alejo Abdala
  Unable to post replies in the forum
By: Bhupendra Mahajan on Thu, 17 October 2013
2 790 Fri, 18 October 2013 05:35
By: Bhupendra Mahajan
  How to let Jubula keep running on a failed testsuite
By: Jiajian Lei on Thu, 17 October 2013
1 579 Thu, 17 October 2013 17:24
By: Jiajian Lei
  Oracle DB setup with multiple users.
IT dept says you have to use just one oracle account?
By: Todd P on Tue, 15 October 2013
2 1153 Wed, 16 October 2013 15:46
By: Todd P
  Accessibility plugins - problems staying up to date
By: Alejo Abdala on Mon, 07 October 2013
4 1274 Tue, 15 October 2013 15:09
By: Alejo Abdala
  Behavior of BREAK is not as expected when suite and testcases are configured differently
By: Bhupendra Mahajan on Fri, 20 September 2013
5 2196 Thu, 10 October 2013 09:29
By: Alexandra Schladebeck
  "Default Event Handler" is triggered instead of my customized handler
Reentry type is considered, the testcase chosen is not
By: Peter S. on Tue, 28 August 2012
5 3341 Thu, 10 October 2013 08:54
By: Sascha Winkler
  Selecting parent in SWT tree
By: Torsten Janke on Wed, 09 October 2013
2 1079 Thu, 10 October 2013 08:39
By: Torsten Janke
  Missing 'org.eclipse.jubula.feature' for target platform
By: Sascha Winkler on Tue, 01 October 2013
1 1570 Wed, 09 October 2013 14:55
By: Alexandra Schladebeck
  Problems with extensions and rebuilding some jars.
The main goal - to reach tree inside table on Swing app.
By: Danila Pod on Tue, 13 August 2013
3 1150 Wed, 09 October 2013 14:54
By: Alexandra Schladebeck
  Jubula takes longer to save the changes
By: Bhupendra Mahajan on Tue, 10 September 2013
5 3210 Wed, 09 October 2013 14:49
By: Alexandra Schladebeck
  Use of check text and not equal to operator
Rookie question on what I am doing wrong
By: Todd P on Fri, 04 October 2013
2 2081 Mon, 07 October 2013 18:19
By: Danila Pod
  Using stored values as Test Data of other TCs
By: Daniel Opitz on Wed, 11 September 2013
2 1603 Fri, 04 October 2013 09:21
By: Daniel Opitz
  Get current time
By: Bhupendra Mahajan on Mon, 30 September 2013
4 1662 Tue, 01 October 2013 06:30
By: Achim Loerke
  Jubula failed to locate menu bar when executing test on Linux
By: Jiajian Lei on Thu, 26 September 2013
4 2090 Tue, 01 October 2013 06:16
By: Alexandra Schladebeck
  Use Jpanel or custom components
By: Dennis Trautmann on Mon, 30 September 2013
1 1094 Tue, 01 October 2013 06:11
By: Alexandra Schladebeck
  Operation not supported by the selected toolkit
By: Waruna Ratnayake on Wed, 04 September 2013
7 2143 Fri, 27 September 2013 13:57
By: Alexandra Schladebeck
  Jubula Eclipse Feature: Test AUT from source
By: Jörg Heckmann on Thu, 26 September 2013
1 968 Fri, 27 September 2013 12:40
By: Alexandra Schladebeck
  Eclipse Jubula
By: Shruthi M S on Thu, 26 September 2013
1 1326 Fri, 27 September 2013 12:39
By: Alexandra Schladebeck
  RCP - GEF Error
By: Mobile Tester on Wed, 25 September 2013
1 1122 Fri, 27 September 2013 12:37
By: Alexandra Schladebeck
  How to activate window by title
By: Bhupendra Mahajan on Fri, 20 September 2013
1 2357 Mon, 23 September 2013 14:24
By: Alexandra Schladebeck
  making project
error when i try a new project
By: jamal kawar on Sat, 21 September 2013
1 1022 Sun, 22 September 2013 11:50
By: Achim Loerke
  64 bit Problem
By: Heinz Christoph Dau-Schmidt on Wed, 18 September 2013
4 2350 Fri, 20 September 2013 20:17
By: Heinz Christoph Dau-Schmidt
  Skip a test case based on variable
Is there a "go to" or "if else" capability in Jubula
By: Todd P on Thu, 19 September 2013
3 2744 Fri, 20 September 2013 16:03
By: Todd P
  Measure memory usage and/or memory leaks
By: Richard Skoog on Fri, 20 September 2013
0 2622 Fri, 20 September 2013 12:06
By: Richard Skoog
  Observed "org.eclipse.swt.SWTException: Widget is disposed" multiple time while running au
Observed "org.eclipse.swt.SWTException: Widget is disposed" multiple time while running automation
By: Bhupendra Mahajan on Fri, 06 September 2013
3 5931 Thu, 19 September 2013 10:07
By: Alexandra Schladebeck
  Inconsistency in Jubula runs
By: Bhupendra Mahajan on Thu, 19 September 2013
1 617 Thu, 19 September 2013 06:43
By: Achim Loerke
  Support For javafx
Is there any plan to support javafx component
By: Rajesh Dash on Thu, 19 September 2013
1 817 Thu, 19 September 2013 06:32
By: Achim Loerke
  How to run multiple tests the right way?
Should I put multiple tests into one test suite or multiple testsuites into a test job
By: Alexander Hoffmann on Wed, 11 September 2013
2 1454 Tue, 17 September 2013 14:36
By: Alexander Hoffmann
  TesterClass to handle CTabFolders
By: Philipp Wueller on Fri, 06 September 2013
3 1315 Tue, 17 September 2013 10:38
By: Alexandra Schladebeck
  Problem with button
By: Pawel Bet on Fri, 13 September 2013
1 1344 Tue, 17 September 2013 10:37
By: Alexandra Schladebeck
  Problem by deploying the fragment for the AUT extension
By: Philipp Wueller on Wed, 04 September 2013
2 1640 Tue, 17 September 2013 10:26
By: Alexandra Schladebeck
  Can't start testexec (AUT Agent: connection to server failed.)
I am trying to use testexec with a config.xml. But all this parameters just confuse me.
By: Alexander Hoffmann on Fri, 06 September 2013
2 2153 Tue, 17 September 2013 10:24
By: Alexandra Schladebeck
  Object mappings not working when migrating to Jubula 2.0
By: Ashish Sharma on Mon, 15 April 2013
5 4772 Tue, 17 September 2013 10:18
By: Alexandra Schladebeck
  Migrating test cases from Jubula 1.3 to Jubula 2.1
Problem with reused projects
By: Matias Pentreath on Wed, 04 September 2013
1 1567 Tue, 17 September 2013 10:17
By: Alexandra Schladebeck
  Jubula Extension
Tree Table Header, Properties View, MinMax Buttons
By: Philipp Wueller on Fri, 13 September 2013
2 943 Fri, 13 September 2013 11:21
By: Achim Loerke
  Question on Object Mapping
By: Mobile Tester on Tue, 03 September 2013
3 1381 Thu, 05 September 2013 07:00
By: Oliver Goetz
  Regarding jubula recoding problem
Facing problem while recording the test case
By: Manoj Kumar Rout on Tue, 27 August 2013
4 2080 Mon, 02 September 2013 04:00
By: Manoj Kumar Rout
icon9.gif Autrun.exe not starting
Issue with main class
By: Phil F. on Thu, 29 August 2013
3 1111 Sun, 01 September 2013 19:03
By: Phil F.
  How to loop through a data which is generated on the fly
Looping through data generated on the fly
By: Bala P on Thu, 29 August 2013
1 1045 Fri, 30 August 2013 06:51
By: Alexandra Schladebeck
  Building an extension for a custom component
By: Matias Pentreath on Wed, 28 August 2013
1 1018 Fri, 30 August 2013 06:46
By: Alexandra Schladebeck
  Problems getting the sample extension installed
Problems getting the sample extension installed
By: Susanne Krause on Tue, 20 August 2013
5 3784 Fri, 30 August 2013 06:44
By: Alexandra Schladebeck
  Simicolon (Key Combination)
By: Heinz Christoph Dau-Schmidt on Fri, 09 August 2013
4 1980 Fri, 30 August 2013 06:38
By: Alexandra Schladebeck
  problem installing guidancer on an old indigo eclipse
By: Tom Brus on Thu, 22 August 2013
2 1379 Fri, 30 August 2013 06:36
By: Alexandra Schladebeck
  Extending Jubula to select tabbed properties in tabbed property pages
How do we publish extensions?
By: Michi Classen on Fri, 22 March 2013
7 3401 Wed, 28 August 2013 17:31
By: Matias Pentreath
  Problem with Component Names
By: Pawel Bet on Mon, 19 August 2013
2 1563 Sun, 25 August 2013 17:54
By: Pawel Bet
icon5.gif Running headless in virtual machine
By: Sebastian Hegewald on Thu, 08 September 2011
9 5772 Thu, 22 August 2013 15:16
By: Tom Brus
  Click at the current mouse position!
New-bie
By: James Ball on Thu, 15 August 2013
4 1959 Thu, 22 August 2013 11:37
By: James Ball
  Importing booleans from Excel to Central Test Data
By: Mike Airey on Wed, 21 August 2013
1 1761 Thu, 22 August 2013 10:29
By: Alexandra Schladebeck
  Object mappings accross AUTs/configurations
How to reuse the same Jubula tests on different AUT(eclipse)
By: Guy Perron on Thu, 04 July 2013
7 2414 Thu, 22 August 2013 10:26
By: Alexandra Schladebeck
  Automatically load test.xml into a database and execute it?
By: Jiajian Lei on Tue, 20 August 2013
1 547 Tue, 20 August 2013 17:49
By: Achim Loerke
  Object mapping: names of SWT Components
By: Heinz Christoph Dau-Schmidt on Wed, 14 August 2013
1 1518 Tue, 20 August 2013 06:35
By: Alexandra Schladebeck
  convert integer to corresponding ascii value
Need to convert integer value to corresponding Ascii character
By: Susanne Krause on Wed, 17 July 2013
2 1984 Wed, 14 August 2013 17:01
By: Susanne Krause
  Is it possible to escape parameters/variables included in a regex?
By: David Hickernell on Fri, 02 August 2013
3 1563 Wed, 14 August 2013 06:59
By: Alexandra Schladebeck
  Can't connect to AUT using Jenkins...occasionally
By: Youssef Bagoulla on Wed, 31 July 2013
5 2455 Wed, 14 August 2013 06:51
By: Alexandra Schladebeck
  Trying to setup a simple html test
By: Jack Mising name on Mon, 05 August 2013
1 1834 Wed, 14 August 2013 06:47
By: Alexandra Schladebeck
  Testing the close application without save
By: Elise Ruelle on Fri, 02 August 2013
3 1834 Wed, 14 August 2013 06:45
By: Alexandra Schladebeck
  Connecting two Figures on a Canvas
By: Virginia Weidhaas on Thu, 07 February 2013
12 4657 Wed, 14 August 2013 06:41
By: Alexandra Schladebeck
  Eclipse variables
By: Alex Kovalenko on Mon, 05 August 2013
1 1888 Wed, 14 August 2013 06:35
By: Alexandra Schladebeck
  Multi-path logic needed in test case
Test should not fail as long as one of the conditions is satisfied
By: David Hickernell on Tue, 04 June 2013
4 16331 Mon, 12 August 2013 17:26
By: David Hickernell
  Newly created project version is not visible on the list
By: Waruna Ratnayake on Wed, 07 August 2013
2 1015 Fri, 09 August 2013 07:04
By: Waruna Ratnayake
  [Solved] Table: selecting row by two column values
By: Mike Airey on Tue, 23 July 2013
4 3173 Thu, 08 August 2013 08:17
By: Alexandra Schladebeck
  Testing a system tray item
By: Tiago Veloso on Mon, 05 August 2013
2 1061 Tue, 06 August 2013 11:04
By: Tiago Veloso
  Starting an AUT again after exiting it during test progression
By: Janine Kayser on Fri, 26 July 2013
7 1459 Tue, 06 August 2013 10:29
By: Alexandra Schladebeck
  Select multiple entry in a tree
By: Elise Ruelle on Wed, 31 July 2013
4 1334 Tue, 06 August 2013 07:15
By: Elise Ruelle
  Object Mapping not working for an SWT application
By: Tiago Veloso on Fri, 02 August 2013
2 1067 Mon, 05 August 2013 13:44
By: Tiago Veloso
  Eclipse Testing Day 2013
25th September, Darmstadt
By: Alexandra Schladebeck on Fri, 02 August 2013
0 1484 Fri, 02 August 2013 09:36
By: Alexandra Schladebeck
  Can I export data from AUT with using Jubula modules?
By: Pawel Bet on Tue, 30 July 2013
2 1058 Thu, 01 August 2013 14:02
By: Pawel Bet
  [solved]JSlider AUT won't run
5009: AUT start failed
By: Paraita Wohler on Mon, 29 July 2013
3 1198 Thu, 01 August 2013 12:58
By: Rodrigo Revuelta Roca
  swing extend example jubula
By: Rodrigo Revuelta Roca on Wed, 10 July 2013
5 2767 Thu, 01 August 2013 10:39
By: Alexandra Schladebeck
  How to select the header of a tree table
I want to know how to select the column header of a tree table in a rcp application
By: Alexander Hoffmann on Wed, 24 July 2013
3 1334 Thu, 01 August 2013 10:36
By: Alexandra Schladebeck
  testexec: Testsuite/Testjob
Suite works, Job doesn't
By: Bob Jagger on Mon, 29 July 2013
1 1103 Thu, 01 August 2013 10:35
By: Alexandra Schladebeck
  Stuck after selecting value from combobox
By: Janine Kayser on Fri, 26 July 2013
1 1368 Thu, 01 August 2013 10:27
By: Alexandra Schladebeck
  Jubula and IBM JRE
How to run an AUT with IBM JRE
By: Klaus Singer on Fri, 12 July 2013
3 1221 Thu, 01 August 2013 09:33
By: Klaus Singer
  How can I access the column's header in TreeTable component?
By: Dmitriy T on Fri, 01 March 2013
4 3221 Tue, 30 July 2013 09:50
By: Dmitriy T
  What is the correct parameter value for the dash/minus key?
trying to send a control+dash to the application
By: David Hickernell on Wed, 24 July 2013
2 1041 Thu, 25 July 2013 18:35
By: David Hickernell
icon5.gif Can't remove parameters from test case
I have an unneeded parameter in my test case and can't remove it.
By: Alexander Hoffmann on Tue, 23 July 2013
2 1239 Wed, 24 July 2013 12:02
By: Alexander Hoffmann
  Check Tree Table
By: Elise Ruelle on Fri, 19 July 2013
1 1157 Tue, 23 July 2013 06:51
By: Alexandra Schladebeck
  Is it possibile to start jubula test cases via batch commands?
By: Philipp Wueller on Fri, 19 July 2013
1 1477 Tue, 23 July 2013 06:47
By: Alexandra Schladebeck
  Problem with Hudson
By: Elise Ruelle on Fri, 19 July 2013
1 1178 Tue, 23 July 2013 06:45
By: Alexandra Schladebeck
  Can I store Jubula test projects in a flat file?
By: Jiajian Lei on Thu, 18 July 2013
1 1025 Tue, 23 July 2013 06:41
By: Alexandra Schladebeck
  How to perform version control and test merge with Jubula?
By: Jiajian Lei on Mon, 22 July 2013
0 1376 Mon, 22 July 2013 22:00
By: Jiajian Lei
  My Jubula Toolkit plug-in for custom GUI-Components doesn't work
Jubula Extension-Development
By: Hans Dampf on Tue, 16 July 2013
2 1940 Mon, 22 July 2013 08:53
By: Rodrigo Revuelta Roca
  How to wait for expanding a tree?
By: Philipp Wueller on Thu, 18 July 2013
4 1537 Fri, 19 July 2013 07:15
By: Philipp Wueller
  How to properly integrate Jubula with Jenkins
By: Jiajian Lei on Tue, 16 July 2013
1 1709 Thu, 18 July 2013 10:04
By: Alexandra Schladebeck
  Jubula doesn´t recognize running AUT after upgrade to 2.0
By: Fabian Ruckwied on Tue, 18 June 2013
4 4530 Wed, 17 July 2013 19:35
By: Jeremie Bresson
  extend jubula
Problem with extend swt apps
By: Rodrigo Revuelta Roca on Mon, 08 July 2013
5 1537 Wed, 17 July 2013 14:21
By: Alexandra Schladebeck
  Reusable project and object mapping
By: Elise Ruelle on Thu, 11 July 2013
2 1797 Tue, 16 July 2013 08:34
By: Elise Ruelle
  Code Coverage (JaCoCo) Problem
By: Heinz Christoph Dau-Schmidt on Fri, 12 July 2013
2 2121 Mon, 15 July 2013 16:13
By: Heinz Christoph Dau-Schmidt
  ub_cti_replaceText giving an "Input Failed" Action Error?
only happening with one particular text field out of many
By: David Hickernell on Fri, 12 July 2013
1 627 Fri, 12 July 2013 17:04
By: David Hickernell
  Jubula can't find component outside of scroll area
after it is shown while outside scroll area
By: David Hickernell on Thu, 11 July 2013
1 1173 Fri, 12 July 2013 16:42
By: David Hickernell
  Autrun Problem (Ant & Jenkins)
By: Heinz Christoph Dau-Schmidt on Fri, 05 July 2013
2 3141 Fri, 12 July 2013 15:52
By: Heinz Christoph Dau-Schmidt
  Jubula 2.1.0 extension for testing SWT DateTime in RCP?
By: Mike Airey on Fri, 12 July 2013
0 1669 Fri, 12 July 2013 04:51
By: Mike Airey
  How does Jubula assert the result?
By: Jiajian Lei on Tue, 09 July 2013
4 2173 Fri, 12 July 2013 00:35
By: Jiajian Lei
  Close tab with the new release
By: Elise Ruelle on Tue, 02 July 2013
3 2338 Wed, 10 July 2013 12:31
By: Elise Ruelle
  How to make sure "Move to External Project" does not break Test Cases?
By: Eric Schellhammer on Wed, 03 July 2013
2 2016 Tue, 09 July 2013 08:57
By: Eric Schellhammer
  Date Widget and others not supported as GRC?
By: Hans-J. Brede on Mon, 01 July 2013
5 1692 Tue, 09 July 2013 05:04
By: Mike Airey
  Jubula vs SWTBot
By: Jiajian Lei on Wed, 03 July 2013
2 1557 Mon, 08 July 2013 16:48
By: Jiajian Lei
  Executes test by Testexec tool raise error Operation not supported by the selected toolkit.
By: Nguyễn Thành Na Missing name on Thu, 04 July 2013
4 2043 Mon, 08 July 2013 10:10
By: Nguyễn Thành Na Missing name
  Kepler, Jubula and GUIdancer Standalones, and new Testing Portal
By: Alexandra Schladebeck on Thu, 27 June 2013
5 2395 Mon, 08 July 2013 09:20
By: Alexandra Schladebeck
  Who created/edited a suite or case
Who created/edited a suite or case
By: Dominik Gabriel on Mon, 08 July 2013
1 620 Mon, 08 July 2013 08:45
By: Achim Loerke
  Can the search scope of "Show where used" be extended?
The search scope of "Show where used" is dependent of former actions in Jubula and a bit restricted
By: Eric Schellhammer on Wed, 03 July 2013
1 1419 Mon, 08 July 2013 07:17
By: Alexandra Schladebeck
  Observation button and mapping buttons disabled
By: Jiajian Lei on Sat, 29 June 2013
10 3057 Mon, 08 July 2013 07:14
By: Alexandra Schladebeck
  Could testexec Command offer an error message of screen shot besides .htm & .xml file?
By: posia han on Thu, 23 May 2013
3 27996 Mon, 08 July 2013 06:52
By: Achim Loerke
  Transfer object mappings
By: Richard Skoog on Fri, 14 October 2011
8 2848 Thu, 04 July 2013 05:36
By: Tom Tan
  Input text from external file
How to use "ub_app_inputText" to input text from a text document
By: Asgeir Sognefest on Tue, 02 July 2013
2 1358 Wed, 03 July 2013 10:59
By: Asgeir Sognefest
  AUT persist in memory after testsuite ?
Once the test is over, the AUT java instance is still in memory
By: Paraita Wohler on Mon, 01 July 2013
2 1039 Tue, 02 July 2013 08:54
By: Paraita Wohler
  How to do a "sum" of two variables?
By: Richard Skoog on Mon, 01 July 2013
3 993 Mon, 01 July 2013 15:40
By: Richard Skoog
  Observation mode vs Object mapping
By: Jiajian Lei on Sat, 29 June 2013
2 936 Mon, 01 July 2013 14:11
By: Alexandra Schladebeck
  how to enter multiline text? [newbee]
By: Tom Brus on Wed, 26 June 2013
1 1769 Mon, 01 July 2013 14:08
By: Alexandra Schladebeck
  Access Database and retrieve value
JUBULA DB Access
By: Ketan Shah on Tue, 25 June 2013
1 748 Tue, 25 June 2013 10:59
By: Achim Loerke
icon8.gif Extending Jubula for RCP (version 2.0)
Migration of fragment from 1.1 to 2.0 not successful
By: Michi Classen on Mon, 27 May 2013
10 10459 Tue, 25 June 2013 10:56
By: Alexandra Schladebeck
  Can't start AUT agent
Starting the AUT agent with the mouse doesn't work
By: Paraita Wohler on Thu, 20 June 2013
2 2338 Mon, 24 June 2013 16:00
By: Paraita Wohler
  Cleaning Testresults takes very long time
Cleaning Testresults takes very long time
By: Dominik Gabriel on Mon, 17 June 2013
1 11524 Mon, 24 June 2013 09:32
By: Achim Loerke
  Context menu problems
Some of the AUT's context menus are not found by Jubula
By: Olav Beyermann on Fri, 21 June 2013
2 1656 Mon, 24 June 2013 09:23
By: Olav Beyermann
  AUT performance tests
How can I export measuring results to external file?
By: Olav Beyermann on Fri, 21 June 2013
2 2121 Mon, 24 June 2013 08:41
By: Olav Beyermann
  Starting AUT hangs up in jenkins
started the AUT, nothing happens
By: Bob Jagger on Thu, 20 June 2013
3 1363 Mon, 24 June 2013 08:00
By: Alexandra Schladebeck
  add own parameter types
By: khalil alrifai on Thu, 13 June 2013
1 9966 Mon, 24 June 2013 07:52
By: Alexandra Schladebeck
  Keyboard Layout
Change Keyboard Layout
By: Dominik Gabriel on Wed, 12 June 2013
1 1757 Wed, 12 June 2013 11:37
By: Achim Loerke
icon9.gif Accidental folder removing bug
Copy-paste kills 'Test Case Browser' categories with cases!
By: Alex M on Thu, 06 June 2013
2 13192 Wed, 12 June 2013 06:17
By: Alexandra Schladebeck
  How to select hidden tabs from an overcrowded TabbedComponent
Or reference the button that brings up the menu of hidden tabs
By: David Hickernell on Thu, 06 June 2013
4 8673 Wed, 12 June 2013 06:17
By: Alexandra Schladebeck
  Error:java.lang.ArrayIndexOutOfBoundsException: -1
By: posia han on Sat, 08 June 2013
1 37697 Wed, 12 June 2013 06:16
By: Alexandra Schladebeck
  Autrun and RCP application
By: Elise Ruelle on Mon, 03 June 2013
4 8403 Wed, 12 June 2013 06:14
By: Alexandra Schladebeck
  Problem with toolkit example for rcp
By: Elise Ruelle on Wed, 17 April 2013
4 3500 Tue, 11 June 2013 13:09
By: Alexander Kolesov
  How to select which records of a data set to use
Jubula Data Sets
By: Beni Lar on Thu, 21 June 2012
4 3369 Mon, 10 June 2013 02:48
By: marge v
Goto Forum:
  
Legend New Messages New Messages   No New messages No New messages   Locked (w/ unread messages) Locked (w/ unread messages)   Locked Locked   Moved to another forum Moved to another forum

Current Time: Mon Feb 08 04:33:00 GMT 2016

Powered by FUDForum. Page generated in 0.02678 seconds
.:: Contact :: Home ::.

Powered by: FUDforum 3.0.2.
Copyright ©2001-2010 FUDforum Bulletin Board Software