Skip to main content

Tentative IP Log for webtools.releng

This tentative IP Log is generated dynamically from automatically collected project information. This information has not been vetted for accuracy by the Eclipse Foundation and may not represent the true state of the IP of this project(s). Please refer to the official approved IP Log(s) associated with the official release(s) of this project(s) for more information.

Licenses

  • Eclipse Public License v1.0

Third-Party Code

Pre-Req Dependencies

CQThird-Party CodeLicenseUse
10385commons-collections 3.2.2Apache License, 2.0unmodified binary

Exempt Pre-Req and Works With Dependencies

No Exempt Pre-Req or Works With dependencies

Committers

Past and Present Active
Name Organization  
Carl Anderson IBM
Julio C. Chavez IBM
Naci Dai eteration A.S.
Thanh Ha
John Lanuti IBM
Tran Le Oracle
Rosendo Martinez IBM
Kaloyan Raev Zend Technologies USA, Inc
Vaninder Rajput IBM
Raghunathan Srinivasan Oracle
David Williams IBM
Samuel Wu IBM
Helen Zhang

Contributors and Their Contributions

Ref Size Description
Adalberto Lopez Venegas (gmail.com)
476580 35539 bytes Update prereqs for Mars.1
Attachment 256368: Update prereqs for Mars
477113 505 bytes Pick up webtools.webservices from R3_7_maintenance branch for WTP 3.7.x
Attachment 256505: Pick up webtools.webservices from R3_7_maintenance
Alec Ross (ca.ibm.com)
303564 14432 bytes Run performance tests against the WTP
Attachment 175977: Final patch.
303564 7138 bytes Run performance tests against the WTP
Attachment 176064: Patch to deal with changes to WTP structure.
cbridgha (us.ibm.com)
2ccd26 2 lines [400036] Restrict supported servers for client and service runtimes
32e144 2 lines [Bug 416088] DependencyGraphImpl deadlocks
Chris Jaun (us.ibm.com)
18227d 4 lines [411955] Warning about missing NLS shown
2bf167 4 lines [6690620] parser error on regular expression containing sequence [/]
351fc4 2 lines [6690620] Opening hyperlink on workspace html file only works for
50edb2 2 lines [404832] - JavaScript error on valid regex
520d8f 2 lines Updated feature version
5458e8 4 lines [349020] [hotbug] [validation] Eclipse complains about jquery minified
56b405 2 lines [315660] [377241]
7c64c6 6 lines [325809] [misc] unit tests produce a "comptest" directory in user.home
7f8e25 4 lines [357353] [369785] [315660] [377241] [414993]
945384 2 lines [420533] ClassCastException when getting validation participants
963594 2 lines [404832] - JavaScript error on valid regex
9a3b95 2 lines [315660] [377241]
9f6c74 10 lines [nobug] fix version errors in 3.6
a590f3 2 lines [420086] Copy text doesn't work from read-only javascript file
abc64f 6 lines [433926] Update the JSDT license features to 1.0.1 for Luna
ace3fb 2 lines [420738] Determine which eclipse.inf files are necessary for Tycho (CBI
b0ff23 2 lines [6690620] Opening hyperlink on workspace html file only works for
b5ebf7 4 lines [315660] [415108] [377241]
be8c0f 16 lines [384319] CPU utilization to 100% when this is appended to new object
c8542a 4 lines [315660] [415108] [377241]
d64e42 4 lines [357353] [369785] [315660] [377241] [414993]
d8dbeb 4 lines [nobug] version fixes to tests.compiler and the feature
e7358d 4 lines [6690620] parser error on regular expression containing sequence [/]
dbranekov (sap.com)
6f784a 20 lines [Bug 393354] JAX-WS Web Services node contents shows 'Loading...'
Dimitar Giormov (sap.com)
273554 2 lines [401259] removed incorrect trigger point of Application Client Content
30f5c4 2 lines [395808] Fix for Java EE 6 web model to process artifacts found in web
9dbc77 2 lines [395808] Fix for Java EE 6 web model to process artifacts found in web
aa427f 2 lines [387899] Loading DD descriptor causes exception on import dynamic web
d76e4d 2 lines [387899] Loading DD descriptor causes exception on import dynamic web
292237 192953 bytes include pave project into build
Attachment 149511: patch
292237 1081 bytes include pave project into build
Attachment 149724: version change in cc_cnfig.xml
eyuen (ca.ibm.com)
00d951 2 lines [386732] ServerToolTip escape on focussed tooltip not working perfectly
01c0f3 4 lines [390577] Fix version error in wtp 3.5.0 20120927061232
054f17 2 lines [392043] delete key on multiple modules sends wrong deltakind flag
061357 2 lines [394281] PingThread of Tomcat/JBoss adapters follows redirects
06f10d 4 lines [391701] Version errors in WTP M-3.4.2-20121011041520
08ea93 2 lines [352252] PublishHelper 'hangs' during publish
0a1bf0 2 lines [386720] ServerToolTip too aggressive at opening tooltips
0d742f 2 lines [344543] Extension for the Delete Server Dialog
0e68ad 2 lines [389699] Run on server on starting server will not publish if the
0ead0d 2 lines [402924] When module deleted, can't tell if the module was external
113856 8 lines [393371] New: Fix version error in WTP M-3.4.2-20121101054732
11393a 2 lines [409219] Update WebSphere Liberty profile discovery update site on
19a720 2 lines [383094] during publish, Run On Server action should be adaptable
1d3884 34 lines [433928] Update the Server Tools license features to 1.0.1 for Luna
1efbba 2 lines [394273] Delete dialog invoked by Del key is not located correctly
21a296 4 lines [381623] Unable to search for Tomcat 7 runtime via the runtime search
22c400 2 lines [425937] Web Project's classpath container for Tomcat 8 is empty
22e4da 4 lines [383138] CHKPII error on server tools doc
22e858 2 lines [388030] Restart server doesn't finish
239982 11 lines [404081] show in debug action does not always work
24277e 2 lines [409475] GlobalDeleteAction not equipped to handle multiple deletes
2560e2 2 lines [381097] Runtime search function results in duplicate entries on Server
269ee8 4 lines [427400] Update Liberty server adapter discovery update site URL for
2833b9 4 lines [383138] CHKPII error on server tools doc
2869db 6 lines [415154] Versioning problems in 3.5.1 RC1 candidate
2a8888 2 lines [391756] In new server wizard, host may not match default host for
2b3d99 4 lines License update
2f413d 6 lines [340918] deploy-name of EAR projects is ignored during deployment
3510a3 2 lines [407001] Add WebSphere Liberty profile discovery update site to
37bdf4 2 lines [432580] When clicking "Open Launch Configuration", ask if user wants
37dc13 2 lines [384963] At Run On Server wizard "Next" and "Finish" buttons are
3de199 6 lines [388547] Version errors in R3.5.0-I 20120830052817
44eb4e 2 lines [394844] Server with external modules in Republish state after eclipse
464498 2 lines [381113] org.eclipse.wst.server.preview.internal.WTPErrorHandler
477567 2 lines [421184] ProjectModuleFactoryDelegate should clear cache for
482c9f 2 lines [368492] Finish button not disabled when no entries selected
4a350d 2 lines [426192] WTP 3.5.2 build has a JST Server version error
4a7bca 2 lines [376506] New Server wizard doesn't block user from creating server with
4af2f9 7 lines [437351] [hotbug] [Critical] getServerNotificationManager should be
4b4d44 2 lines [389182] Suggestions for additional trace performance logging in
4e7a65 4 lines [404672] delete key on multiple modules sends wrong deltakind flag
5186de 2 lines [424213] [Luna] Modify url in discovery plugin for jbosstools update
550faf 2 lines [394844] Server with external modules in Republish state after eclipse
57c1cc 2 lines [422255] Publish is not canceled when server start is (canceled)
5c0a68 2 lines [427400] Update Liberty server adapter discovery update site URL for
5d5f2c 2 lines [389178] ServerWorkingCopy.save uses an incorrect autoPublish
64b649 2 lines [437351] [hotbug] [Critical] getServerNotificationManager should be
668732 4 lines [381623] Unable to search for Tomcat 7 runtime via the runtime search
693106 2 lines [419182] Investigate JUnit failure in
6abc9b 2 lines [389178] ServerWorkingCopy.save uses an incorrect autoPublish
6aedec 2 lines [351040] Wrong URL for web-app_2_5.xsd in generated ROOT webapp for
6b8d89 4 lines [387933] Plugin version error on 3.4.1 build M-3.4.1-20120823133907
6d5368 2 lines [390105] Publish before start servers synchronization problem
6ef47c 8 lines [423362] Add missing tycho-p2-plugin for generated source features
707783 2 lines [419182] Investigate JUnit failure in
729345 2 lines [352252] PublishHelper 'hangs' during publish
7394a9 2 lines [431970] OverviewEditorPart runtime hyperlink incorrectly negated
73ed91 2 lines [404827] Fix grammatical error on no server available link on Servers
79171e 2 lines [413506] restart module action has no icons
7b02c3 2 lines Remove ui plugin from core feature
7d3801 2 lines [399674] ServerUtil.modifyModules() uses parents randomly
7e0480 2 lines [386732] ServerToolTip escape on focussed tooltip not working perfectly
7f6f73 4 lines [320637] HTTP Server Overview HTTP port: input does not allow ports
81bb67 2 lines [428539] ServerEditorOverviewPageModifier has several flaws
84aea3 2 lines [411812] getChildModules javadoc says should not return null
8c828e 2 lines [390993] New Server Wizard non-default name fails [regression]
8d6716 8 lines [393371] New: Fix version error in WTP M-3.4.2-20121101054732
8e5ebf 2 lines [389182] Suggestions for additional trace performance logging in
8ef155 2 lines [368492] Finish button not disabled when no entries selected
8f450c 2 lines [409826] servertools drag and drop converts to iproject, then uses
906f4f 4 lines [376506] New Server wizard doesn't block user from creating server with
922579 4 lines [320637] HTTP Server Overview HTTP port: input does not allow ports
92655f 4 lines License update
95dcfd 2 lines [388032] Server add and remove wizard doesn't allow add modules with
98e265 6 lines [407071] Version problem in I-3.5.0-20130502063837
9c6249 2 lines [344543] Extension for the Delete Server Dialog - test plugin
a28740 2 lines [432788] IStatus message error in Server.canStart() for already-started
ae0503 2 lines [400918] show in debug action does not always work
ae2873 2 lines [435005] Plugin version number fix
b154dd 2 lines [386720] ServerToolTip too aggressive at opening tooltips
b44242 1 lines [404819] Remove IBM WebSphere 6.0 server adapter - remove websphere.core
b5a2cd 6 lines [390582] [Accessibility] Screen reader cannot read empty Servers view
b60c0e 2 lines [293398] HTTP Preview Server does not start - "Could not find JRE
b6e8ee 2 lines [404078] deploy-name of EAR projects is ignored during deployment -
b9397a 18 lines [431855] [CBI] Enable junit tests for servertools.tests repo
bc053e 2 lines [293398] HTTP Preview Server does not start - "Could not find JRE
c081f1 2 lines [388032] Server add and remove wizard doesn't allow add modules with
c2d10b 2 lines [435215] Run On Server result in empty selection
c53378 2 lines [349434] Next button disabled when choosing existing server host name
c62826 2 lines [425929] [CBI] Mismatched pom version
c6f2e7 8 lines [399674] ServerUtil.modifyModules() uses parents randomly
c70261 4 lines [404819] Remove IBM WebSphere 6.0 server adapter
cb29fb 2 lines [394844] Server with external modules in Republish state after eclipse
ced882 2 lines [422255] Publish is not canceled when server start is (canceled)
d015c7 8 lines [390993] New Server Wizard non-default name fails [regression]
d423a6 2 lines [434530] Update WebLogic adapter site reference for Luna
d7b672 2 lines [435078] org.eclipse.jst.server.tomcat.core.tests version mismatch
d83d26 2 lines [384963] At Run On Server wizard "Next" and "Finish" buttons are
d95495 2 lines [391756] In new server wizard, host may not match default host for
da671d 4 lines [425789] Provide mechanism to control manual creation of server and
de299e 2 lines [383138] CHKPII error on server tools doc
e350a9 2 lines [394281] PingThread of Tomcat/JBoss adapters follows redirects
e5232b 2 lines [381097] Runtime search function results in duplicate entries on Server
e54873 4 lines [387933] Plugin version error on 3.4.1 build M-3.4.1-20120823133907
e60325 2 lines [404078] deploy-name of EAR projects is ignored during deployment -
e9e8b3 4 lines [389550] Version error in wtp4x-R3.5.0-I 20120913044711
e9e9c8 2 lines [391076] Plugin version error on 3.5 build on I-3.5.0-20121003195326
f163b8 2 lines [376506] New Server wizard doesn't block user from creating server with
f31b5f 2 lines [349434] Next button disabled when choosing existing server host name
f4b9ac 2 lines [413506] restart module action has no icons
f8564e 2 lines [431855] [CBI] Enable junit tests for servertools.tests repo - fix
fd04a0 4 lines [387933] Plugin version error on 3.4.1 build M-3.4.1-20120823133907
fd6b37 2 lines [431973] ServerEditorOverviewPageModifier has no access to
fdcc09 6 lines [405177] Do not pack jars bundled inside a packed jar
Gorkem Ercan (gmail.com)
6eea5e 3 lines Bug 427598 - Remove generic server definitions for JBoss
Helen Zhang (ca.ibm.com)
243805 1007 bytes Update platform prereqs
Attachment 109699: Update platform prereq
Ian Trimble (oracle.com)
1eccd3 92 lines JSF Tools release v201308280918
224f8c 94 lines JSF Tools release v201304301558
2be45f 46 lines v201301161500 (JSF Tools)
2df452 80 lines JSF Tools release v201303131412.
3297ea 80 lines JSF Tools v201408211646
38817b 88 lines JSF Tools v201309171405
42bdf9 46 lines Bug 423360 - Add missing tycho-p2-plugin for generated source features
4e10ab 80 lines Update plug-in and feature versions.
521152 46 lines Bug 439906 - UI - Web Page Editor should provide a mechanism so that a
63e368 80 lines JSF Tools v201309171700 (build with CBI patches applied)
663552 60 lines JSF Tools release v201304241631
6abc2f 46 lines Bug 435994 - [CBI] CruiseControl broken by change at HEAD to attempt to
70b933 28 lines Bug 426471 - JSF Tests must stop using WorkspaceLock
7a0e63 46 lines JSF Tools v201409091053
85cebd 48 lines v201301151433 (JSF Tools)
8723f0 48 lines v201301151433 (JSF Tools)
8ca3c3 80 lines v201210101250 (JSF Tools)
949674 80 lines Update maps for weekly release.
9a2517 80 lines v201210101250 (JSF Tools)
9b07f7 80 lines [JSF Tools] Fix version issues.
9f2f75 58 lines JSF Tools release v201305011549
a25160 28 lines JSF Tools Tests v201405091204
b36b9c 80 lines JSF Tools v201310151153
d2a08f 58 lines JSF Tools release v201304250918
d2e5ae 28 lines Bug 431853 - [CBI] Enable JUnit tests for webtools.jsf.tests repo
da203a 80 lines Update map files for RC1 release.
db09e3 80 lines Update plug-in and feature versions.
e119ed 80 lines JSF Tools v201309181648: fix versions in POMs
e2398b 74 lines JSF Tools v201409111106
e24cae 46 lines JSF Tools v201405081727
e3b476 28 lines JSF Tools release v201303140904.
e56ac1 52 lines Bug 433925 - Update the JSF license features to 1.0.1 for Luna
e8e3df 46 lines v201301161500 (JSF Tools)
e90733 46 lines [JSF Tools] Fix version issues.
ea3e91 46 lines JSF Tools release (v201304021716)
f7dcf6 80 lines Bug 393881 - Versioning problems in WTP 3.5.0 RC3 candidate
f8ba10 86 lines Update versions.
fd5548 28 lines Bug 431853 - [CBI] Enable JUnit tests for webtools.jsf.tests repo
Jesper Steen Møller (selskabet.org)
639c5a 4 lines [342793] Xsl include/import reference validation doesn't signal error on
76b790 4 lines [405223] Processing and file name/type doesn't match output type from
76f4b6 2 lines [388504] XPath scanner does not detect non-ASCII names
9f8cb9 8 lines Release XSL at v20130423-0632
df3b7d 2 lines Update versions for xsl_tests.feature
e4af2d 10 lines [405214]: Do not pack jars bundled inside a packed jar
Julio C. Chavez (gmail.com)
d76114 522 lines [nobug] Auxiliar configuration for patching.
Julio C. Chavez (mx1.ibm.com)
411701 964 bytes An error in the php script for the preReqs
Attachment 232805: Proposed fix
418701 1468 bytes Configure Java 7 to fix the JUnit errors in the build
Attachment 236129: proposed fix
418701 18125 bytes Configure Java 7 to fix the JUnit errors in the build
Attachment 236189: Additional changes proposed for several scripts files
kchong (ca.ibm.com)
078696 4 lines [403683] Move
09cb2a 2 lines [424949] Status panel of Web Services Explorer does not always display
0ad689 4 lines [no bug] Bump up version number for 3.5.2
0fe6ac 2 lines [403683] org.eclipse.jst.ws.internal.axis.consumption.ui.util.WSDLUtils
1367ac 2 lines [410540] Remove duplicate project facet version for JAX-RS 2.0
13cf3d 4 lines [403345] Version error in org.eclipse.wst.ws_core.feature and
1c0dd9 2 lines [423380] Add missing tycho-p2-plugin for generated source features
1e5723 2 lines [327158] WS Client Generation - Application and Utility Clients added to
1f3f8b 8 lines [391170] WebServicesParser should convert the WSDL URI to a valid URI
24f977 2 lines [no bug] Version update for 3.6.0
27946f 4 lines [no bug] Updating feature version for org.eclipse.wst.ws_sdk.feature and
323fdc 2 lines [400036] Restrict supported servers for client and service runtimes
326840 2 lines [403683] org.eclipse.jst.ws.internal.axis.consumption.ui.util.WSDLUtils
3b3081 4 lines [378175] Service project and service project type need to be refreshed
3c746a 4 lines [417526] Remove jst.web facet dependency from jst.jaxrs facet
40e819 2 lines [419541] Remove duplicate project facet version for JAX-RS 2.0
478531 2 lines [403683] org.eclipse.jst.ws.internal.axis.consumption.ui.util.WSDLUtils
4a8f2e 8 lines [391170] WebServicesParser should convert the WSDL URI to a valid URI
4dfd43 4 lines [412143] [hotbug_request]Remove jst.web facet dependency from jst.jaxrs
54326b 6 lines [312981] Make changes to default to Tomcat 8
54ca39 2 lines [404460] Annotation validator in jaxws.core should not be flagging
568c23 2 lines [417526] [3.6] JAX-RS 2.0 Facet should not require Java7, but Java6
5de69c 4 lines [403683] Move
602eb8 4 lines [378160] Service project and service project type need to be refreshed
692848 2 lines Bug 416053 - [For 3.5.x] Restrict supported servers for client and
6b801c 5 lines [404460] Annotation validator in jaxws.core should not be flagging
750194 126 lines [414716] [CBI] webtools.webservices patches for building with
75403a 2 lines [402474] Add ws-securitypolicy.xsd and ws-securitypolicy-1.2.xsd to the
7c95d3 2 lines [327158] WS Client Generation - Application and Utility Clients added to
7c9fb2 2 lines [391170] WebServicesParser should convert the WSDL URI to a valid URI -
7dd01a 2 lines [417526] [3.6] JAX-RS 2.0 Facet should not require Java7, but Java6
806b09 2 lines [407892] Unable to satisfy dependency from org.eclipse.wst.ws_ui.feature
816ca3 2 lines [440912] Can not change names in XML Schema Editor when schema does not
817b1f 4 lines [414543] [Editor] address can't be modify from GUI if it's to empty.
8232be 2 lines [398897] Unsupported servers cannot be removed from list of generic
8f9b03 8 lines [391170] WebServicesParser should convert the WSDL URI to a valid URI
903957 4 lines [390588] Fix versioning errors in 3.5 build
92c4ef 2 lines [431112] Explicitly set com.ibm.icu requirement in Tycho
9522e8 2 lines [422998] Can't generate Client into a plain Java Project with newer Java
9ac7f6 2 lines [416704] JAX-RS 2.0 Facet should not require Java7, but Java6
9b5cdc 2 lines [417117] NPE in web service wizard when specifying illegal service
9c613a 2 lines [422993] Can't generate Client into a plain Java Project with newer Java
9e8f18 4 lines [no bug] Bump up version number for 3.5.1
a1ea7b 98 lines [414716] [CBI] webtools.webservices patches for building with
a2fb71 4 lines [403683] Move
b31cee 2 lines Bug 415166 - [For 3.6] Restrict supported servers for client and service
b3c74f 2 lines [no bug] Bump up feature version number to 3.6 for WTP 3.6.
b3d58d 18 lines [414716] [CBI] webtools.webservices patches for building with
b414b3 4 lines [388612] End of file found before expected END NON-TRANSLATABLE comment
b87e86 126 lines [419272] Pom version updates webservices
b9e7be 36 lines [433929] Update the Web Services license features to 1.0.1 for Luna
bbf589 6 lines [424276] Content-assist in XSD for a simpleType with user defined
c18d7b 2 lines [398897] Unsupported servers cannot be removed from list of generic
c5c9ff 2 lines [388606] Duplicate string IDs found
d198e3 2 lines [391170] WebServicesParser should convert the WSDL URI to a valid URI -
d34e1e 4 lines [390588] Fix versioning errors in 3.5 build
dbc598 8 lines [391170] WebServicesParser should convert the WSDL URI to a valid URI
dee321 4 lines [440912] Can not change names in XML Schema Editor when schema does not
e709ce 2 lines [417117] NPE in web service wizard when specifying illegal service
e82932 4 lines [406447] Add support for JAX-RS 2.0
e8301c 2 lines [403683] org.eclipse.jst.ws.internal.axis.consumption.ui.util.WSDLUtils
eb8499 2 lines [412143] [hotbug_request]Remove jst.web facet dependency from jst.jaxrs
f08dcb 2 lines [414716] [CBI] webtools.webservices patches for building with
f81636 2 lines [426066] No source bundle exists for
f94875 4 lines [385354] WebServicesParser should convert the WSDL URI to a valid URI
kchong (seveniron.torolab.ibm.com)
474aa8 4 lines [no bug] Updating feature version for org.eclipse.wst.ws_sdk.feature and
Larry Isaacs (sas.com)
323245 5617 bytes Include the JST Server features in the Web Tools Platform (WTP) 3.2.x update site category
Attachment 177182: Possible patch to add JST server features to WTP 3.2.x update site categories
Larry Isaacs (sas.com)
0f5d99 8 lines [374337] Fix Serve modules without publishing for
2d7ac7 6 lines [388450] Fix version numbers
4c3ea3 6 lines [422298] Update downloaded Tomcat 6 and 7 versions to current releases.
78d623 2 lines [422298] Update downloaded Tomcat 6 and 7 versions to current releases.
8086d5 6 lines [374337] Fix Serve modules without publishing for
9333aa 2 lines [423759] Initial implementation for the "Serve modules without
a1852e 2 lines [423759] Finish implementation for the "Serve modules without
aa7d68 4 lines [422340] Add Tomcat 8 support to WTP Server Tools
ad60fb 4 lines [422340] Fix Tomcat 8 support to avoid incorrect warning about needing
ec0dc1 2 lines [419182] Revert unsuccessful fix to address JUnit failure in
Marcos Munoz (mx1.ibm.com)
0848f0 2 lines [405895] Cannot update Java EE Facets to Java EE 7
0e6de7 4 lines [404834] Disable Java EE module creation if not supported by target server runtime
Matthew Martire (ca.ibm.com)
303564 597 bytes Run performance tests against the WTP
Attachment 187656: patch for Build.xml file
303564 914 bytes Run performance tests against the WTP
Attachment 187658: patch for copyArtifacts.xml
303564 10742 bytes Run performance tests against the WTP
Attachment 187663: Patch for our scripts for functional tests
303564 78832 bytes Run performance tests against the WTP
Attachment 192496: New patch for perf tests
303564 11379 bytes Run performance tests against the WTP
Attachment 192595: updated standalonePerfTest
303564 4106 bytes Run performance tests against the WTP
Attachment 192664: Use the correct version of packages
352025 869 bytes Updating standalonePerfTest.xml to set wtptests.repo property
Attachment 199617: Patch for standalonePerfTest.xml
Mickael Istria (redhat.com)
05895a 23 lines [424089] Added build-individual-bundles profile
2ed9fb 13 lines [424087] Added distributionManagement to allow "mvn deploy"
Neil Hauge (oracle.com)
182ac4 8 lines Update versions for Kepler SR1.
861d5b 8 lines Release version updates for Kepler SR1.
c288c0 10 lines Update EL dependency to 2.5.1 RC2.
Nick Sandonato (us.ibm.com)
02e1bf 4 lines [424552] Improve the performance of the markup validator
041f9b 2 lines [404093] Incorrect name for connector xml catalog entries
0443df 2 lines Revert "[nobug] increment org.eclipse.wst.web_tests.feature for 3.4.2"
047b9d 2 lines [401838] Filter property tester bothers non-StructuredTextEditors
05c554 2 lines [387855] Unknown Option in the Edit Menu - log cleanup
06c05d 8 lines Updating map files for tag v201210041846
07b56d 2 lines [401833] Outline creation fails when StructuredTextEditor is embedded in MultiPageEditorPart
0815fe 2 lines [431929] org.eclipse.wst.css.tests.encoding Problems encountered while setting project description
08466f 2 lines [389434] XML: Outline view does not show namespace when add
0a37d4 2 lines [nobug] increment version for 3.5
0a56d2 2 lines [420029] Quick access lists Filters command with no active editor
0bb3bd 2 lines [401384] An error occurred after installing Chinese language
0dcfc5 6 lines [390903] [formatting] CSS formatter inserts space before closing parenthesis
0e3991 2 lines [412395] Incorrect formatting for filter: alpha(opacity = 33)
0eb427 2 lines [412350] editing css font-family result in exceptions
0fbbcc 6 lines [nobug] Version increment for 3.5
0fde03 2 lines [414812] Accessibility: "The document is empty. Right mouse click here to insert content" message is not read
100195 8 lines [375605] 'New File (HTML/JSP)' wizard uses wrong default location
111901 4 lines [255109] [content assist] Code Completion within scriptlet takes a while to appear (~10 sec)
126526 4 lines [424078] [formatting] CSS formatter should insert space after selector separator (after comma)
130602 2 lines [nobug] jsp core tests failing after cbi changes
1328a8 2 lines [386452] ConcurrentModificationException in CMNamedNodeMapForBuddySystem
158c5a 2 lines [nobug] Compilation failure due to un-branched tests repository
174272 4 lines [367579] [formatting] Formatting successive comments inserts spaces
188325 2 lines [392767] Reordered and Removed delta events should not be cosidered to remove in the ProjectDecription
1a442d 16 lines [nobug] increment version for 3.5.2
1e5b36 2 lines [433923] Update the Source Editing license features to 1.0.1 for Luna
1f68e5 6 lines [390903] [formatting] CSS formatter inserts space before closing parenthesis
21da6a 2 lines Just put the web container initializer right in the .classpath instead of using the required plugins
2300d1 2 lines [371292] Selecting large ranges of xml/html in a large file freezes XML and HTML editors for a long time
232d67 2 lines [403943] CategorizedProblems problem in JSP file are disappearing when the annotations processor is turned on
2377fd 16 lines [433923] Update the Source Editing license features to 1.0.1 for Luna
27a286 2 lines [408164] Wrong warning for HTML5 input type: Undefined attribute value (url/color/week)
29e1df 2 lines [335409] [content assist] Completion does not work when there is tag after it
2a8963 4 lines [399936] Numerous action handler conflicts when changing editors
2bafb4 4 lines [415980] HTML5 attribute validator marks ng-app AngularJS attributes as undefined
2bcb43 2 lines [343802] [content assist] Disabled content assist categories in 'Preference page- Web - HTML Files - Editor - Content Assistant' still can work when opening xhtml as jst.jsf content type
2d0068 2 lines [nobug] jsp.core unit test failures
2d29fa 4 lines [185420] [validation] validation in jsp tags are not case sensitive
2ded94 2 lines [420114] Error-Message while creating css-file
2f70e9 2 lines [102221] [editor] hyperlink navigation opens wrong file for variables declared by taglibs
3238a5 4 lines [344723] [parser] StackOverFlowError in erroneous jsp file - destabilizing issue
326643 4 lines [430228] The ignoring of HTML Tag Attribute Names from validation should be allowed for any version of HTML document
3339f8 2 lines [417665] Allow to pick other color from preview
348ab2 2 lines [425618] Build workspace hangs waiting to lock org.eclipse.jst.jsp.core.taglib.TaglibIndex
34ec7c 2 lines [408164] Wrong warning for HTML5 input type: Undefined attribute value (url/color/week)
35596d 2 lines [430312] If two highlighters always report same Position they are interchangeably used
35a588 8 lines [nobug] Versioning problems and xml.core unit test failures
3616f5 6 lines [371430] Wrong encoding type returned for XHTML file without 'html' as document root
3778a6 2 lines [417570] XML auto-complete/content-assist does not work in read-only files.
37b3f0 2 lines [408159] Incorporate b89 draft of Java EE 7 schemas
37d1b3 2 lines [171709] [JUnit] junit failure caused by re-allocation of an XML schema on the web
3ac263 2 lines [408164] Wrong warning for HTML5 input type: Undefined attribute value (url/color/week)
3b1563 6 lines [397764] Must mention schemas in abouit.html files
3e73b7 2 lines [386108] JSP formatter shouldn't break EL expression into two lines
3edd9c 4 lines [433923] Update the Source Editing license features to 1.0.1 for Luna
3f036a 2 lines [398691] ValidatorGroupListener can leak model references
3fcf9d 2 lines [407551] JSP translation incorrect for expressions in script blocks
415be5 2 lines [407513] Deadlock when running 'Taglib validation' job
41dbec 2 lines [371430] Wrong encoding type returned for XHTML file without 'html' as document root
41fd4a 8 lines [391079] <textarea> tag should not be formatted when I hit Ctrl+Shift+F - jsp formatter
4297f2 2 lines [365620] Content Model View gets NPE's if an element doesn't exist in the schema
42eed7 4 lines [371430] Wrong encoding type returned for XHTML file without 'html' as document root
44b7c9 4 lines License Update
4720fe 2 lines [372008] [content assist] Icon of CompletionProposalCategory does not allow platform:/... syntax
4903eb 6 lines [410161] NPE when editing a JSP file in maven project with war overlays
4abd98 6 lines [393085] Tag files' Java content not indexed
4c524f 2 lines [335409] [content assist] Completion does not work when there is tag after it
4cbf66 2 lines [nobug] Copyright
4d741e 2 lines [390903] [formatting] CSS formatter inserts space before closing parenthesis
4e255b 8 lines [375605] 'New File (HTML/JSP)' wizard uses wrong default location
4e8ac0 8 lines [394221] unnecessary testing of handlers state because activeWhen/enabledWhen/visibleWhen are duplicates
4f9b0c 2 lines [388391] constant freezes with 100% cpu
5209d7 2 lines [403943] CategorizedProblems problem in JSP file are disappearing when the annotations processor is turned on
521473 2 lines [109794] [content model] Proposal list for custom JSP tag doesn't contain proposals for HTML tags
5264b7 2 lines [Bug 414162] Model changes during validation trigger errors
527679 10 lines [209296] [formatting] format via cleanup does not format file completely
5307f1 4 lines [nobug] Failing unit test
54f016 20 lines [nobug] version increment for 3.4.2
56ebd5 2 lines [419181] IllegalArgumentException after opening a JSP file.
5733d6 2 lines [422195] Include all Java EE 7 XML Schema files
57b2b3 2 lines [409827] Wrong warning for HTML 5 'required' attribute for 'select' tag
57b630 2 lines [315724] [document] BasicStructuredDocument replaces non editable portion.
57e872 2 lines [419181] IllegalArgumentException after opening a JSP file.
57e994 2 lines [387855] Unknown Option in the Edit Menu
58bdc0 2 lines [391852] [validation]taglibs are not seen if included indirectly - Fix-up TLDCMDocumentReference#equals()
59392a 4 lines [436412] backport Bug 428374: [formatting] unknown regions remove inline css text to WTP 3.2.5
5947f0 8 lines [124070] [editor] JSPX editor doesn't honor indent with spaces
5db466 4 lines [404855] Incorrect name for connector xml catalog entries
5feafe 6 lines [140485] [properties] Mysterious blank/uneditable text field in attribute property sheet for dtd
600e50 2 lines [401264] xml include preferences incorrect on mac os x
616dec 12 lines [nobug] version increment for 3.6
632899 2 lines [392071] CSS editor unindents next line after copy-paste
63870e 10 lines [200441] Create XML File, New WSDL File, and Create XML Schema wizards overwrite linked files w/o confirmation
646a62 2 lines [428374] [formatting] unknown regions remove inline css text
65796c 4 lines [420455] HTML attribute not recognized
6690f0 2 lines [401384] An error occurred after installing Chinese language
67040d 4 lines [397904] Memory leaks in Juno when opening and closing XML Editor
675492 2 lines [379148] StringIndexOutOfBoundsException: String index out of range: -1
683893 2 lines [108215] [editor] Implement 'Add Import' function for jsp scriplet
688920 4 lines [390903] [formatting] CSS formatter inserts space before closing parenthesis
69f9e5 2 lines [388610] HTMLCOREPLUGINRESOURCES.PROPERTIES: Found 1 single quote in text handled by Java MessageFormat class
6a8917 2 lines [237567] [document] html editor mishandles encoding - it may destroy file
6ce64d 2 lines [390254] textarea required attribute not supported in HTML editor
6cf069 2 lines [424078] [formatting] CSS formatter should insert space after selector separator (after comma)
6e845c 2 lines [428374] [formatting] unknown regions remove inline css text
6e8a40 2 lines [388391] constant freezes with 100% cpu
6f1180 2 lines [408058] ResourceNotFoundException logged frequently when dragging items from the Palette
7084b3 2 lines [422757] Kepler: Web Page Editor NPE
726563 8 lines [394221] unnecessary testing of handlers state because activeWhen/enabledWhen/visibleWhen are duplicates
739b01 6 lines [284663] IntStack throws StackOverflowError
76d356 2 lines [408164] Wrong warning for HTML5 input type: Undefined attribute value (url/color/week)
777b43 8 lines [208636] [misc][context launching] incorrect debug launch context after setting focus in outline view
77e61c 2 lines [407565] JSP translation incorrect for expressions in script blocks
7ad20e 4 lines [nobug] increment version for 3.3.2 patches
7d2ae2 2 lines [399524] Basic Java EE 7 support
7f75cb 2 lines [417570] XML auto-complete/content-assist does not work in read-only files.
7f9b6a 4 lines [412350] editing css font-family result in exceptions
819ddf 2 lines [430553] ElementInformation is missing resource information
82800f 4 lines [nobug] version increment for 3.5
843aaa 2 lines [424078] [formatting] CSS formatter should insert space after selector separator (after comma)
8595e0 2 lines [426939] HTML5 attribute validator marks ng-app AngularJS attributes as undefined
85c65a 2 lines [294516] JSP Tag file wizard should validate the existence of /WEB-INF/tags folder
860ed3 2 lines [380091] Validator should warn about missing quotes
86dead 4 lines [363564] [formatting] Jsp formatter brokes the style tag from the beggining
87648d 2 lines [nobug] jsp.core unit test failures
88ac90 2 lines [423019] Reopening Outline view fails when only one perspective is open.
893529 2 lines [346204] [editor] Confusion in org.eclipse.wst.sse.ui.internal.taginfo.BestMatchHover.getHoverControlCreator()
893a13 2 lines [403943] CategorizedProblems problem in JSP file are disappearing when the annotations processor is turned on
8a5390 10 lines [312381] [ui] Smart Insert Close Element functionality (automatic insertion of ending tags) does not work as expected when StructuredTextViewer is embedded in a dialog for editing XML code
8a5ad8 2 lines [420102] Parsing problems with nested generics in jsp:useBean
8c901b 2 lines [434381] HTML5 validation should allow the 'role' and 'aria-*' attributes.
8cafb0 2 lines [398345] Numerous action handler conflicts when changing editors
8d7a29 2 lines [422757] Kepler: Web Page Editor NPE
8dcca2 2 lines [222875] [content assist] AbstractContentAssistProcessor adds useless echo content assist proposal for attribute values
8eb919 2 lines [376926] Wrong Validation Error Message -'pageContext cannot be resolved' for tag file
8f32e0 2 lines [430312] If two highlighters always report same Position they are interchangeably used
8fbca3 4 lines License Update
91c8f8 2 lines [424590] debug perspective messed up, exceptions in the log
939c1a 10 lines [409674] NPE is thrown while trying to format an internal CSS
9403bb 2 lines [425627] Versions in pom.xml and MANIFEST.MF don't match
942e3a 2 lines [nobug] Increment version for 3.6
9859a6 2 lines [424696] Spelling regions are always inherited
98b550 6 lines [420189] Quick access lists Filters command with no active editor - tag corrections
98dafe 2 lines [409827] Wrong warning for HTML 5 'required' attribute for 'select' tag
992bb3 2 lines [237567] [document] html editor mishandles encoding - it may destroy file
9a1ca5 2 lines [400297] [formatter] JSP formatter breaks tab policy in scriptlet
9baf7f 2 lines [431856] [CBI] Enable JUnit tests for sourceediting.tests repo
9c7493 4 lines [400379] Add ws-securitypolicy.xsd and ws-securitypolicy-1.2.xsd to the standard schemas plugin
9e2aab 2 lines [424590] debug perspective messed up, exceptions in the log
a4162b 4 lines [427969] Undefined attribute name for HTML 5
a48d10 2 lines [399524] Basic Java EE 7 support
a55674 2 lines [346128] [content model] New XML Wizard creates invalid value for gMonth data type
a5c742 2 lines [397779] Tag name are not generated properly in Turkish locale (dotless-i issue in lowercase)
a6ddba 4 lines [432978] Support nested at_begin vars
a7ba60 14 lines [nobug] Version increment for 3.5
a9ec76 4 lines [255109] [content assist] Code Completion within scriptlet takes a while to appear (~10 sec)
aa8482 2 lines [432386] taglibhelper processing causes valid taglibs in jsp to be marked with errors
aac898 2 lines [208636] [misc][context launching] incorrect debug launch context after setting focus in outline view - unit tests
ab0c43 2 lines [146849] org.eclipse.jface.text.TextViewer.shiftLeft required too much time
ad3805 2 lines [420114] Error-Message while creating css-file
ae398b 2 lines [400699] Web UI missing org.eclipse.core.resources dependency
aebc58 6 lines [433923] Update the Source Editing license features to 1.0.1 for Luna - test features
af17e4 2 lines [390501] org.eclipse.wst.dtd.ui.internal.style.LineStyleProviderForDTDSubSet never releases its unmanaged model
b02210 2 lines [nobug] Undo string change from cherry-picked commit c8c092dd8c2b6f6b54c6d409fed02bcfcd2c057a
b15f87 4 lines [433923] Update the Source Editing license features to 1.0.1 for Luna - fix pom
b25b44 2 lines [398691] ValidatorGroupListener can leak model references
b25e88 2 lines [414812] Accessibility: "The document is empty. Right mouse click here to insert content" message is not read
b2890a 2 lines [392767] Reordered and Removed delta events should not be cosidered to remove in the ProjectDecription
b33f73 2 lines [405307] tags files display 'pageContext cannot be resolved' errors when they are opened
bbaac0 6 lines [397475] DirtyRegionProcessor.BackgroundThread unnecessarily creates a lot of DirtyRegion[] objects
bc6a57 2 lines [432458] [validation] Greater-than ('>') character incorrectly considered an invalid character in HTML5 text
bcfd4f 2 lines [247124] [outline] An error occurs when a node is moved to its child by drag & drop
bd390f 2 lines [424078] [formatting] CSS formatter should insert space after selector separator (after comma)
beaa58 6 lines [140485] [properties] Mysterious blank/uneditable text field in attribute property sheet for dtd
c21b59 2 lines [425618] Build workspace hangs waiting to lock org.eclipse.jst.jsp.core.taglib.TaglibIndex
c4006c 4 lines [398134] Memory leaks in Juno when opening and closing XML Editor
c4263a 4 lines [420189] Quick access lists Filters command with no active editor
c4dfd2 2 lines [398345] Numerous action handler conflicts when changing editors
c65cab 2 lines [379148] StringIndexOutOfBoundsException: String index out of range: -1
c9273e 2 lines [404734] Make HTML5 the default for new html files creation
caf7ab 2 lines [407553] JSP translation incorrect for expressions in script blocks
cb6805 2 lines [420455] HTML attribute not recognized
cb95fe 4 lines [nobug] Fix compile errors for post-1.4 API
cbc4ed 2 lines [146849] org.eclipse.jface.text.TextViewer.shiftLeft required too much time
cf2a29 2 lines [422195] Include all Java EE 7 XML Schema files
d1afd4 2 lines [412395] Incorrect formatting for filter: alpha(opacity = 33)
d1e285 4 lines [423019] Reopening Outline view fails when only one perspective is open.
d244e8 2 lines [420029] Quick access lists Filters command with no active editor
d44ee9 2 lines [398326] org.w3c.dom.DOMException occurs after editing css file via properties editor
d4aa0c 2 lines [420102] Parsing problems with nested generics in jsp:useBean
d55ccc 2 lines [nobug] version increment for 3.4.2
d68150 2 lines [388614] Duplicate string IDs found
d68cf2 2 lines [401749] Check only the content model for outline attributes
d6b80b 4 lines [399936] Numerous action handler conflicts when changing editors
d7ff81 2 lines [429517] NullPointerException in JSDTContentAssistant.computeCompletionProposals()
dab307 4 lines [404581] Proposals are lost if a legacy processor throws an exception
dae9ef 2 lines [384776] [reconciling] DirtyRegionProcessor incorrectly calculates partitioning changes, that results in re-validation of all the document instead of a one or few partitions.
dcf2fa 2 lines [397779] Tag name are not generated properly in Turkish locale (dotless-i issue in lowercase)
df0d2d 2 lines [308928] Only partition style block as CSS if dictated
df42c7 2 lines [391852] [validation]taglibs are not seen if included indirectly
e0185b 2 lines [388613] Duplicate string IDs found
e05770 2 lines [403943] CategorizedProblems problem in JSP file are disappearing when the annotations processor is turned on
e07bd2 4 lines [432978] JSPTranslator can generate incorrect source for JSPs that use particular taglibs multiple times in one JSP file
e08687 2 lines [406571] Add JPA 2.1 schemas to jst.standard.schemas
e0c3c2 4 lines [412350] editing css font-family result in exceptions
e149c1 6 lines [397764] Must mention schemas in about.html files
e3e15f 2 lines [390254] textarea required attribute not supported in HTML editor
e58ac0 2 lines [372008] [content assist] Icon of CompletionProposalCategory does not allow platform:/... syntax
e5b1ac 2 lines [388608] '{0}' will be resolved to the literal text: {0}
e5fa6a 2 lines [389963] URIResolver shared between new instances of a model
e6620c 2 lines [428374] [formatting] unknown regions remove inline css text
e7d23e 10 lines [312381] [ui] Smart Insert Close Element functionality (automatic insertion of ending tags) does not work as expected when StructuredTextViewer is embedded in a dialog for editing XML code
e8a8cc 2 lines [nobug] Failing unit test
eca096 2 lines [404733] Wrong warning 'No end tag' for Source HTML5 tag
ef145a 2 lines [412350] editing css font-family result in exceptions
ef546c 4 lines [428013] [regression] Web->HTML Files->Validation preference page doesn't saves the new severity values
efdf91 2 lines [129743] [formatting] XML Editor formatting bug (DTD internal subset support needed)
f26335 4 lines [382747] Exceptions on JSP validation
f792b0 2 lines [424696] Spelling regions are always inherited
f851f0 2 lines [379843] Regenerate the DTD Ecore model
f934c3 10 lines [409674] NPE is thrown while trying to format an internal CSS
fca2aa 2 lines [430224] Null Pointer Exception in DesignPageNavigationLocation.java
feb7fc 2 lines [399524] Basic Java EE 7 support
244986 1451 bytes [performance tests] No Results for WTP Tests
Attachment 110707: patch that adds wtp components to the allowable list
Nitin Dahyabhai (us.ibm.com)
003a65 96 lines [nobug] increment versions for 3.4.1
020a08 2 lines [nobug] add JSDT patches feature to R3_3_2_patches
07ea4e 8 lines [nobug] increment versions for 3.5.1
0a5ac3 2 lines [nobug] increment version of o.e.w.jsdt.web.ui
0cf332 4 lines [395014] org.eclipse.wst.xml.xpath2.processor has narrow range for ICU
1233ce 4 lines [394230] System.out statement in org.eclipse.wst.common.componentcore.internal.flat.FlattenParticipantModel
166c1b 2 lines [375365] race condition between downloading JARs and JSP validation
193520 2 lines [400538] org.eclipse.ui.PartInitException: Editor could not be initialized due to class not found
1d3332 44 lines [nobug] increment versions for 3.4.1
1fa38a 44 lines [nobug] update versions for 3.4.1 RC1
2549c1 2 lines [431522] increment version of o.e.w.jsdt.web.ui in pom.xml
295fb7 6 lines [391728] JSP Editor content assist handles tagx files differently than jspx
2d3c32 2 lines [399934] jsp_2_1.xsd and jsp_2_2.xsd are incorrectly registered
3602d8 2 lines [418323] NPE opening jsp files
37c556 2 lines [nobug] increment (decrement?) test feature versions
39c090 2 lines [nobug] correct failing JSP Core tests due to new superclass check
3dfbd6 2 lines [399935] j2ee_1_4.xsd is incorrectly registered
3e4b77 2 lines [426939] (corrections for Execution Environment)
46d6f6 2 lines [nobug] correct failing tests in R3_5_maintenance
537282 2 lines [nobug] forgot to release o.e.w.sse.core for [364880]
579534 2 lines [395623] ValidatorExtensionReader.process() reports problems with extension point ID rather than extension ID
585415 4 lines [nobug] increment org.eclipse.wst.jsdt.web.* for Kepler
586b6e 70 lines [nobug] increment for 3.5.1
5af7ff 2 lines [417972] Excessive memory usage in TLDTagRegistry.initialize() cause by FacetModuleCoreSupportDelegate.getReferenced()
5eab25 10 lines [384319] CPU utilization to 100% when this is appended to new object definition
634829 2 lines [397905] org.eclipse.wst.xml.xpath2.processor.feature needs its version fixed for Juno SR2
669268 2 lines [nobug] increment org.eclipse.wst.web_tests.feature for 3.4.2
6779c3 2 lines [384397] ValidationPlugin#stop() should stop its jobs instead of join()ing them
680616 2 lines [418748] Excessive memory usage in TLDTagRegistry.initialize() caused by FacetModuleCoreSupportDelegate#getReferenced()
6a59e8 2 lines [nobug] HTMLValidator backward compatibility
743683 205 lines [nobug] update versions for 3.4.1
75e340 2 lines [395014] org.eclipse.wst.xml.xpath2.processor has narrow range for ICU
79f616 2 lines [399337] Support tag libraries from Web Fragment projects
7b5afa 24 lines [nobug] increment master for 3.5.0
7f1daa 2 lines [418323] NPE opening jsp files
85158b 4 lines [392767] Reordered and Removed delta events should not be considered to remove in the ProjectDecription
85b721 16 lines [nobug] JUnit related fixes: cherry-pick fixes that were missed while the tests were incorporated, fix tests not to err if resource deletion (cleanup) failed
864b2d 2 lines [397280] Could not set property: org.eclipse.wst.sse.core task-tag-projects-already-scanned. Value is too long
8a3cc6 78 lines [nobug] increment for 3.6
8e4c02 4 lines [nobug] increment versions for 3.5.1
95cde3 56 lines [nobug] update maps for 3.4.2
9712cb 2 lines [425940] Web Page Editor fails to open as source pane cannot be created
98a5f3 6 lines [387835] Backport StructuredRegionProcessor to 3.2.5P
997e1f 2 lines Increment jsp.core.tests for 3.5.2
9abefa 4 lines [395009] file org.eclipse.wst.sse.core.prefs contains workspace project names which have no place there
9c9737 2 lines [399121] Deleting a validation-disabled resource can lead to NPE
a34292 6 lines fix month
a70356 6 lines [nobug] increment for 3.5 (Orbit updates)
a782e9 2 lines [399934] jsp_2_1.xsd and jsp_2_2.xsd are incorrectly registered
a9a2c3 4 lines [398460] Editor is still marked dirty when relaunching editor after closing without saving changes
aa3b89 6 lines [387835] Backport StructuredRegionProcessor to 3.2.5P
ac23c2 8 lines [nobug] increment JSDT master for distinct WTP 3.6 versions
ad056f 10 lines [384319] CPU utilization to 100% when this is appended to new object definition
adf3d5 4 lines Tag for [3.2.5P] Setting a JavaScipt breakpoint in an HTML file makes in unsaveable
b44457 2 lines [397567] [Javascript] [content assist] Functions inside Javascript files are not available in JSP
b67e4f 6 lines [384154] Web overlay not detected during JSP validation
b9022d 4 lines [358790] reconsider having update site URLs in feature.xml files (and repository)
bb0e21 4 lines [387982] TVT/DVT3.8:TCT137: TVT_CHS: Duplicate Mnemonic Keys in JavaScript debug preference panel
bb234c 2 lines [nobug] increment html.core.tests version for 3.5
bc9767 4 lines [364880] OutOfMemoryError during 'Scanning for Tasks'
c4273b 2 lines [393085] - Tag files' Java content not indexed
c4d7c6 4 lines [nobug] increment versions for 3.5.1
c7bf4f 4 lines [395623] ValidatorExtensionReader.process() reports problems with extension point ID rather than extension ID
d2449b 2 lines [nobug] correct failing tests in R3_5_maintenance
d2e318 4 lines [nobug] increase versions for 3.6
d5116c 6 lines merge from master
d86d11 12 lines [399337] Support tag libraries from Web Fragment projects
d98c33 2 lines [nobug] increment org.eclipse.wst.sse.core for 3.5
d9901b 4 lines [nobug] increase version for 3.5.1
db9190 8 lines [nobug] release of common features to 3.4.2 build
e05265 12 lines [425916] WTP 3.5.2 build has many JSDT version errors
e25c3c 2 lines [399017] Errors while attempting to work with JSP model when JSF/JSTL facets (2)
e39fe4 2 lines [nobug] increment jsp.core.tests for 3.6
e976de 2 lines [nobug] HTMLValidator backward compatibility
eb0fab 2 lines [nobug] increment for 3.5.1
f217d6 4 lines [404791] NPE in FileBufferModelManager.detectContentType
f4d6f1 4 lines [399017] Errors while attempting to work with JSP model when JSF/JSTL facets are installed
f619ec 4 lines [398698] JSP include from other project - false error
f6498a 2 lines [394600] JSP Editor content assist handles tagx files differently than jspx file
f9492e 2 lines [nobug] fix dependency range in wst.xml.core
fbf41f 4 lines [404791] NPE in FileBufferModelManager.detectContentType
ff60db 2 lines [nobug] increment for 3.5.1
Petya Sabeva (sap.com)
542697 2 lines Fix org.eclipse.jpt.jpadiagram.editor.ui plugin tag version.
6699c7 12 lines Move up to the next JPA diagram editor's version.
6c32de 2 lines Bug 388098 - Diagram editor malfunctions if XML contains white space in
7c4280 2 lines Fix failing swtbot tests and small bugs.
a728dc 2 lines v201211090945
b920cc 14 lines [391661] - Diagram editor open crashes
bdf2ca 4 lines Bug 364004 - Support for deletion/creation of 'is-a' relations between
cf12be 6 lines Bug 364603 - JPA 2.0 - Support for element collection.
e3f203 16 lines Update version number for 3.3 release
e73da1 4 lines Bug 364004 - Support for deletion/creation of 'is-a' relations between
Roberto Sanchez (mx1.ibm.com)
097a8e 4 lines [423821] Container Selection dialog in new Servlet wizard does not recognize nested source folders
0b0dda 2 lines [402924] When module deleted, can't tell if the module was external or not
0b65eb 2 lines [379616] Inconsistent behaviour in legacy Application Deployment Descriptor when modules are modified
0bb0bc 4 lines [412826] Eclipse hangs when trying to activate or deactivate validations in the preference dialog - bump version for WTP 3.5.2
0e8d1b 2 lines [388605] Duplicate string ID found: AbstractArchiveSaveAdapter_Saving_resource_
171804 4 lines [399099] Memory leak in EAR5ModelProvider
1d81bd 4 lines [387244] Validator is not called when server created if workspace is not empty
297a84 2 lines [412826] Eclipse hangs when trying to activate or deactivate validations in the preference dialog
2a0e10 10 lines [387040][NLS] WSW38 TVT Possible non-externalized strings - Warning dialog title
3cca31 2 lines [379616] Inconsistent behaviour in legacy Application Deployment Descriptor when modules are modified
3fed2b 6 lines [386214] Cancel broken after showing Deployment Assembly pane
43c4a4 4 lines [387939] NPE when modules of an EAR have no archive name in the .component file
463434 4 lines [407415] [BIDI 2013] Wrong BTD in a New Project wizard in WTP
48370d 2 lines [nobug] Update version for WTP 3.5.2
489e1c 2 lines [419999] Eclipse hangs when trying to activate or deactivate validations in the preference dialog
5135ac 2 lines [393706] Referenced component cannot be removed when the file was removed
5e5c31 4 lines [423821] Container Selection dialog in new Servlet wizard does not recognize nested source folders
601dc6 4 lines [390976] [emfWorkbench] Unspecified attributes with default values (from schema) come in as set emf values
6096a4 4 lines [387939] NPE when modules of an EAR have no archive name in the .component file
7672c6 2 lines [394230] System.out statement in org.eclipse.wst.common.componentcore.internal.flat.FlattenParticipantModel
7bb61d 4 lines [412826] Eclipse hangs when trying to activate or deactivate validations in the preference dialog - bump version for WTP 3.6
7ea481 2 lines [391044] EAR libraries classpath container for Utility projects in lib does not contain jars in lib
93d214 6 lines [396951] Enable facet change version to avoid conflict with delegates
9923b8 4 lines [436495] ArrayIndexOutOfBoundsException occurs randomly during a
99675d 4 lines [387244] Validator is not called when server created if workspace is not empty
99d795 2 lines [404685] URL not calculated for servlets in web fragments
99f592 4 lines [409784] Problem Importing Java EE 7 Ear with nested modules
9f43a1 2 lines [408327] NPE in AbstractMergedModelProvider.getLastModificationTimeOfDDFile()
a96187 4 lines [387137] TVT/DVT3.8:TCT98: JPN: String "Revert" is truncated on EJB Deployment Assembly panel
ad789d 2 lines [401128] Server starts unnecessarily when removing projects from the workspace
b0138c 4 lines [388704] Meta-files should not be considered module members
b6a14c 2 lines [401742] Server starts unnecessarily when removing projects from the workspace
b8b2b5 2 lines [407316] [BIDI 2013] STT is not enforced in a New Web Dynamic Project dialog
b923be 6 lines [386214] Cancel broken after showing Deployment Assembly pane
c0f8bd 2 lines [363221] Failure to create a WAR file with project containing virtual folders
c16604 2 lines [431265] NPE in org.eclipse.jem.util.emf.workbench.ProjectUtilities.createFileURL
c6cabf 14 lines [406792] Server status is not set to Republish when deleting a web project, but the references to the project are not removed in the refactoring dialog
ca61b4 2 lines [431674] EJB Timer wizard does not refresh when the Project changes
cc78eb 10 lines [387040][NLS] WSW38 TVT Possible non-externalized strings - Warning dialog title
cdb69e 2 lines [426807] Asynchronous session bean support (wizard changes)
cfd27a 2 lines [408327] NPE in AbstractMergedModelProvider.getLastModificationTimeOfDDFile()
d23d5d 2 lines [410117] Problems creating child modules from New Ear wizard
d484ac 2 lines [431721] Web Annotations model needs to handle the 'asyncSupported' attribute
e0f321 2 lines [387137] TVT/DVT3.8:TCT98: JPN: String "Revert" is truncated on EJB Deployment Assembly panel
e7b5e8 2 lines [431725] Update AddWebArtifactOperationTest to test annotated classes
f2141e 4 lines [365748] Investigate and fix mysterious Tomcat publishing problem
f3c4af 4 lines [387244] Validator is not called when server created if workspace is not empty
f5a6be 4 lines [439927] Lower severity for unresolved variables in fragments
fb8825 4 lines [387244] Validator is not called when server created if workspace is not empty
fd52b2 4 lines [nobug] For 3.4.2 should have been bumped from 1.2.200 to 1.2.201, not to 1.2.300
Rosendo Martinez (mx1.ibm.com)
03e209 104 lines Converting R3_3_2_P common map file to Git format
143299 226 lines Converting releng.webservices map file to Git format.
1e99ce 8 lines Updating the base builder to use eclipsebuilder.id
22b507 42 lines Converting releng.jsdt map files to Git format.
2b356f 6 lines [388538] Jars with Main-class in MANIFEST located in lib dir are
346b79 162 lines Converting releng.common and releng.jeetools map files from CVS to Git
4d4049 108 lines Converting servertools map files to Git format.
5227d9 12 lines Adding tag name to servertools and sourceediting map files.
55fc89 6 lines Updating the base builder to Eclipse 3.8
591e33 2 lines Updating the base builder eclipsebuilder.dir
628036 8 lines Updating with new tag name.
66d61c 34 lines [387931] Getting the patches builds working on Git
6fc47b 6 lines [388555] EAR libraries classpath container is not calculating correctly
725a68 2 lines Updating tag for org.eclipse.wst.validation
740892 14 lines Updating map file to use javaee instead of sourceediting
76c7a8 2 lines Tagging org.eclipse.wst.validation.
791961 2 lines Updating jst-j2ee-basic map file with tag for org.eclipse.jst.j2ee
802355 4 lines Updating the base builder to use eclipsebuilder.id
85492e 74 lines Converting R3_3_2_P jeetools map file to Git format
8fbb6d 4 lines Moving GEF prereq references to archive.eclipse.org
906dda 93 lines Migrating R3_2_5_1_patches files to Git
a922c5 4 lines [391126] EAR libraries classpath container for Utility projects in lib does not contain jars in lib
b6f517 80 lines Converting R3_2_5_P mad files to Git format.
b8d62d 18 lines [385221] Validation rule for target runtime is not working on EJB
b9ad9f 212 lines Converting sourceediting map files to Git format.
c31382 4 lines Updating the base builder to Eclipse 3.8
c91efc 46 lines Converting jeetools map files to Git format.
caf2df 108 lines Converting servertool map files to Git format.
cb275d 2 lines Updating tag for org.eclipse.wst.validation
ce9223 508 lines Converting R3_3_2_P map files to Git format.
fb0fec 208 lines Converting webtools.sourceediting map files to Git format
386508 1331 bytes change default vm used for wtp builds from 1.5 to 1.6
Attachment 219497: Changed JAVA_5_HOME to JAVA_6_HOME
387931 10694 bytes Getting the patches builds working on Git
Attachment 220284: Proposed 3_2_patches releng patch
387931 2382 bytes Getting the patches builds working on Git
Attachment 220409: Contains changes in releng and dependencies.properties helios for 3_2_5_patches
Samuel Wu (ca.ibm.com)
453901 458 bytes Pick up webtools.webservices from R3_6_maintenance branch
Attachment 249103: Change branch to R3_6_maintenance
461945 12119 bytes Set up the patch build for WTP 3.6.3
Attachment 251493: Patch for WTP 3.6.3 patch build
462259 1723 bytes Pick up the orbit build for WTP 3.7.0 M6
Attachment 251615: Pick up new orbit
sclarke (hotmail.com)
0e6935 6 lines [397912] [hotbug]Cant use NON JAX-WS Annotations via extension point,
153108 8 lines [429710, 430838] cxf-beans.xml & unique name test
16b593 24 lines [414717][CBI] webtools.webservices.jaxws
2277ac 2 lines [422136] Unable to install CXF web services without installing Axis2
3c9658 4 lines [403226] jaxws plugins prereq change needed
4beb35 2 lines [390770] Web Service Client wizard throws NPE
6cef5c 2 lines [390770] Web Service Client wizard throws NPE
7b2ae0 4 lines [435094] [CBI] jaxws produces too many source bundles
82433f 8 lines [421418, 421418] annotation properties view / validation bugs
9251b5 24 lines [384850] Possible Non-externalized String "JAX-WS Proposals"
99fb72 6 lines [419271] Pom version updates webservices.jaxws
a9f773 2 lines [427701] [CBI] Enable junit tests for jaxws repo
b018f9 6 lines [420747] Incorrect annotation error on @Webservice in an interface class
bc257f 2 lines [nobug] version fix
cba3e5 100 lines [414717][CBI] webtools.webservices.jaxws
d03a0d 4 lines [403429] Annotations targeted at constructors not shown
d20823 2 lines [408628] Need feature version increment in jaxws test feature
da00b0 2 lines [423366] Add missing tycho-p2-plugin for generated source features
ddf809 6 lines [424968] org.eclipse.jst.ws.jaxws.core bundle is causing initial
e6b727 6 lines [401232] org.eclipse.jst.ws.cxf.creation.core breaking the WTP 3.5 build
e79e9a 24 lines [384850] Possible Non-externalized String "JAX-WS Proposals"
ec5a0f 24 lines [415156] Versioning problems in 3.6 M1 candidate
f470ea 2 lines [421408] org.eclipse.jst.ws.jaxws.core bundle is causing initial
f9c98c 4 lines [nobug] doc update
fe4895 6 lines [430838, 417115, 422136] Failing test, UI Issue, CXF Facet problem.
Steven Hung (ca.ibm.com)
05c53e 4 lines [366092] Jetty server WebAppContext missing from Eclipse 4.2 - added
0e316c 2 lines [416196] Fix version error in WTP 3.6 20130829133612
175ab2 6 lines Bug 395414 - fix version scan errors
23701f 6 lines [409584] Focus/UI issue when server editor is too wide
2b0c0b 10 lines [414712] [CBI] webtools.servertools patches for building with
380fea 12 lines [366092] Jetty server WebAppContext missing from Eclipse 4.2 - fix tag
4d745b 6 lines Bug 395412 Fix version error
4e46ec 2 lines [417647] Fix version errors in WTP 3.6.0 I-3.6.0-20130919105330
50664c 4 lines [415998] TVT/DVT4.3:TCT78: JPN: Mnemonic key not available for Columns
55911d 10 lines [404942] Fix JUnit failures for
615a11 10 lines [423388] Version scan error for WTP 3.5.2-20131205061805
639673 7 lines [366092] Jetty server WebAppContext missing from Eclipse 4.2
643a26 8 lines [405513] Fix version errors in WTP3.5.0-20130411050551
7e9367 6 lines Rollback version error changes for bugzilla 395412
80d256 15 lines [366092] Jetty server WebAppContext missing from Eclipse 4.2
82e173 2 lines [366092] Jetty server WebAppContext missing from Eclipse 4.2 - fix
8bf593 4 lines [403133] JBoss Keplar discovery needs update
99c3ce 4 lines [415998] TVT/DVT4.3:TCT78: JPN: Mnemonic key not available for Columns
9c2822 10 lines [404587] Server tools JUnits are not independent, which cause JUnits to
a299aa 4 lines [404942] Fix JUnit failures for
aba8e1 2 lines [402848] Eclipse Juno SR2 HTTP Preview server does not start
b3ebf8 18 lines [414712] [CBI] webtools.servertools patches for building with
b4fcdf 10 lines [417545] Fix WTP 3.6.0 version errors caused by CBI fix
bb67cc 18 lines [417545] Fix WTP 3.6.0 version errors caused by CBI fix
bd024c 2 lines [401460] Preview Server Errors On Startup - update the MANIFEST version
c0d0bc 2 lines [390584] [Accessibility] TCP/IP monitor view uses white background with
c3d326 72 lines [417545] Fix WTP 3.6.0 version errors caused by CBI fix
c96517 2 lines [402848] Eclipse Juno SR2 HTTP Preview server does not start
ca234d 20 lines [402696] Fix version errors in WTP 3.5.0-20130307051714
d142a8 2 lines [430032] Version mismatch for org.eclipse.wst.server.ui
e64e5e 6 lines Bug 395412 - fix version scan errors
e78360 2 lines [406998] Fix accessibility issues in the TCP/IP monitor preferences page
eb4c45 2 lines [390583] [Accessibility] Run on server table columns cannot be resized
f05db7 2 lines Bug 400855 - [Accessibility] Mouse over on the module status in the
f27bfa 2 lines [403266] Fix version errors in WTP I-3.5.0-20130313135724
f2c57a 4 lines [402848] Eclipse Juno SR2 HTTP Preview server does not start
f59596 6 lines [428960] Fix version error in WTP 3.6
f8cfbb 72 lines [414712] [CBI] webtools.servertools patches for building with
fcc0a9 6 lines [409584] Focus/UI issue when server editor is too wide
ffb352 2 lines Bug 390582 - [Accessibility] Screen reader cannot read empty Servers
Thanh Ha (eclipse.org)
017afc 11 lines Bug 420891 - Do not build patch bundles
059282 4 lines Bug 435965 - [CBI] Set Eclipse-SourceReferences for webtools.releng
074439 1 lines Bug 425921 - [CBI] Build qualifier should be of v<YYYYMMDDHHmm> format
10ab0f 20 lines Update submodules
12273c 6 lines Update submodules
17992b 63 lines Update repo URLs and WTP version to 3.6.0-SNAPSHOT
20a79e 36 lines Bug 425226 - Build output repository & repositoryunittests do not produce zips
21cc2e 329 lines Initial CBI contribution
235329 40 lines Update submodules
23fe22 90 lines Add eclipse-sign profile to sign jars with CBI plugins 1.0.5
2738c6 6 lines Bug 433700 - Need to update the license checks for the 2014 license changes
27b611 109 lines Update pom versions
2831b0 4 lines Update submodules
404b28 106 lines Revert "Bug 425146 - Write script to rename SNAPSHOT to build ID"
490fa5 8 lines Bug 424210 - Simplify Git repositories
541030 2 lines Update submodules
590783 2 lines Fix invalid submodule commit
5b32d9 2 lines Pull in fix for javaee repo
6aaf14 16 lines Update submodules
739baf 47 lines Bug 442503 - [CBI] Webtools R3_6_maintenance CBI build
745d2d 47 lines Bug 442503 - [CBI] Webtools R3_6_maintenance CBI build
763b36 106 lines Bug 425146 - Write script to rename SNAPSHOT to build ID
7e76b0 24 lines Update submodules
80a501 106 lines Bug 425146 - Write script to rename SNAPSHOT to build ID
84b0f3 44 lines Bug 425146 - Write script to rename SNAPSHOT to build ID
8841a4 4 lines Update Tycho version to 0.20.0
99466d 28 lines Update submodules
a0ecff 1 lines Fix missing close tag
a37e20 29 lines Bug 425151 - Use comparator bundle to reuse previous output plugins/features if no changes
bf7715 738 lines 420890 - [CBI] Build should produce a p2 repo
c0e5f7 2 lines Update Integration build URL
c2f25b 2 lines Use R-3.6.0-20140602160322 for build-individual-bundles package repo
ca8b56 90 lines Bug 425146 - Write script to rename SNAPSHOT to build ID
df7f2e 2 lines Pull in Dali updates for JUnit tests
e69176 2 lines Use eclipselink URL from map files
ee5931 689 lines Add to pluginManagement tycho-p2-plugin configuration
f7275c 21 lines Bug 424548 - Allow UI tests by tycho on OSX
f7761e 11 lines Use Tycho 0.19.0
fac1bf 42 lines Update submodules
Thanh Ha (alumni.carleton.ca)
414719 84116 bytes [CBI] webtools.releng patches for building with Maven/Tycho
Attachment 234234: webtools.releng.patch
414719 23933 bytes [CBI] webtools.releng patches for building with Maven/Tycho
Attachment 234235: webtools.releng.aggregator.patch
Tran Le (oracle.com)
015673 34 lines v201301290232
025aee 34 lines 425913 - Fix versions for 3.3.2 release.
0278ed 54 lines v201307152051
0333f2 8 lines v201307311924
03f3f2 62 lines v201210291941
04f98a 2 lines [401740] org.eclipse.jpt.jpadiagrameditor.ui.tests is breaking the WTP
05356d 6 lines v201303130300
08a9fd 8 lines Updated EclipseLink prereq.
09206f 11 lines Updated EclipseLink prereq.
0b0d93 4 lines 387476 - JPA Diagram Editor needs to move up to Graphiti 10 for Kepler
0c4e9c 134 lines v201310142259
106da7 4 lines v201309041924
11b4b1 44 lines Update prereqs for WTP 3.6.0
135942 142 lines Reverted to Juno maps
19a074 68 lines v201210031721
1ae1b8 76 lines Fix for: 386171, 373430, 384185, 384610, 384871, 382150
1aeeaa 2 lines v201310110602
1dbe9b 26 lines v201209051838
1dcb7f 102 lines v201211071840
1ee60e 10 lines v201308131625
229845 40 lines v201210312255
22a2ce 2 lines v201308132259
244c4a 10 lines v201307250300
275219 4 lines Updated EclipseLink prereq.
27f2be 80 lines v201210100252
2a95f7 22 lines v201301230101
2c4b91 18 lines v201308131155
2d1176 110 lines v201209060440
2d6510 98 lines v201308091641
2d7680 2 lines v201209121747
2dd9bc 28 lines v201309231612
2e05e3 58 lines 433924 - Update the Dali license features to 1.0.1 for Luna
2fd6ec 4 lines Added Javadoc generation.
30764d 19 lines Fixed Graphiti URI
3445ba 24 lines v201209212032
34937b 2 lines v201209112018
35146c 2 lines v201209122252
372045 18 lines 387476 - JPA Diagram Editor needs to move up to Graphiti 10 for Kepler
38214b 32 lines v201210042332
382b03 2 lines Added plugin.xml to jpt.doc.isv
3aeedc 20 lines v201308262207
3bc98b 10 lines Revert "Revert "v201303210123""
3bce78 54 lines v201211202255
3cb86b 15 lines 387476 - JPA Diagram Editor needs to move up to Graphiti 10 for Kepler
3d3e86 36 lines v201209212032
3d5283 4 lines Update Graphiti prereq
3e957a 2 lines v201209112047
3f79b8 24 lines v201304160100
408982 4 lines 397911 - org.eclipse.jpt.common_sdk.feature needs its version id fixed
417141 4 lines Update version numbers
41b09b 72 lines v201209262323
43ef42 22 lines v201312161713
45ed13 72 lines v201302131909
461989 8 lines v201307301920
472136 118 lines v201211052121
485c7e 4 lines 435049 - Add Hermes JPQL parser source to SDK's build
494f6a 28 lines v201209252151
4a96b7 70 lines v201210170240
4c7bab 3 lines Updated JPT tests libraries
4eef8f 38 lines v201303070011
504441 2 lines [395460] - The integration between the JPA diagram editor and the JPA
50ebf6 130 lines v201309241700
5222ea 82 lines v201211072057
5296bb 60 lines v201211062137
52a753 4 lines Fixed Graphiti URI
5603e1 6 lines Reverted Javadoc generation plugin.
564473 24 lines v201212270117
57a088 40 lines v201210180520
58e9de 10 lines Revert "v201303210123"
5ce23f 60 lines v201211271710
6116cb 28 lines v201301170344
61979f 4 lines Update version numbers for Dali R3_2_3
630a60 6 lines v201309102252
6777e7 6 lines 424861 - Exclude source files for javax.wsdl and javax.persistence
6815af 2 lines v201309042005
683538 54 lines v201210302311
6ac79e 20 lines v201301300022
6af1ec 12 lines v201302270427
6b3979 39 lines Fixed Graphiti links on download page.
6b41bc 26 lines v201304170155
6c4e44 2 lines v201210032300
6ce434 4 lines 387476 - JPA Diagram Editor needs to move up to Graphiti 10 for Kepler
6da562 2 lines v201311210236
6fa99d 2 lines v201209241600
716779 2 lines v201308072132
719f53 2 lines Bug 409090
736f3c 36 lines v201303120344
768df9 22 lines v201303280018
77662d 2 lines Fixed Graphiti links on download page.
785f30 40 lines v201210172249
7872d1 4 lines 394616, 409337, 405320
7a6ed4 16 lines Updated Eclipselink prereq.
7ad1dc 20 lines [408504] Update to final Kepler prerequisites
7b473b 42 lines v201301092252
7c05fc 9 lines Cleaned up properties
7c5484 6 lines v201210121950
7cbfde 58 lines v201209041929
7d0230 60 lines 387476 - JPA Diagram Editor needs to move up to Graphiti 10 for Kepler
7df3d2 6 lines v201305152244
7fbefe 10 lines v201309190527
80aca5 2 lines v201209130440
80fa27 132 lines v201308222233
813609 22 lines v201303070505
829ed7 2 lines v201312050020
84abfd 54 lines v201210221744
850eb3 32 lines v201209242020
851cd6 56 lines v201210151909
8577fe 12 lines v201302271907
86775f 32 lines v201304250237
892c1d 38 lines v201308261920
8a0ae2 40 lines v201210180130
8a4104 32 lines v201301092313
8ced8d 40 lines v201211080018
8d0f43 2 lines v201209220400
90a31a 5 lines 429892 - [CBI] Enable JUnit tests for dali.common repo
921968 14 lines v201304230122
92c86e 4 lines v201308272012
96fa34 26 lines v201304090106
98011a 40 lines v201211150033
9a8a55 14 lines v201308271956
9d42d5 12 lines Updated EclipseLink prereq.
9d55a9 4 lines [425913]
a03520 2 lines [410003] org.eclipse.jpt.doc.user must have an about.html
a246a7 2 lines v201310290253
a31c88 3 lines Updated JPT tests libraries
a48e6f 4 lines Revert "Reverted change to emftransaction & emfvalidation"
a6a594 1 lines Fix Graphiti link on download page
a72b10 1 lines 387476 - JPA Diagram Editor needs to move up to Graphiti 10 for Kepler
a9dc83 14 lines v201301082227
ac11a7 28 lines v201210110244
acdc41 36 lines v201303280018
ad5842 4 lines Reverted change to emftransaction & emfvalidation
adf2bf 32 lines v201210292233
aeb48b 28 lines v201305082238
af8190 54 lines v201211052140
b125de 34 lines v201304232328
b16b18 6 lines v201212060636
b29165 12 lines v201302270750
b2e824 2 lines v201312050012
b33440 2 lines Bug 408900
b3641c 30 lines v201302192355
b3ce26 20 lines v201209250131
b43e73 2 lines v201305142138
b4721e 17 lines v201304102025
b481f0 20 lines Updated EclipseLink.
b4d9e4 6 lines v201301232244
b77f03 2 lines v201212061358 - Fix for Unit tests failures
b80575 4 lines Reorganized JPA features
b98967 90 lines 387476 - JPA Diagram Editor needs to move up to Graphiti 10 for Kepler
bbbdd4 4 lines Fix Graphiti links on download page.
bd1cfb 32 lines v201308091651
bd3428 6 lines v201311210251
bf511f 2 lines v201310170209
c1c52b 4 lines v201304180306
c314e9 16 lines Updated JPT tests libraries
c40be3 28 lines v201210032300
c4ba1c 6 lines v201302280122
c4de2e 20 lines Updated EclipseLink.
c54b96 12 lines v201304300138
c55291 50 lines v201212202323
c5699e 10 lines v201303210123
c6325e 2 lines v201209121945
c82f87 132 lines Fix for: 386347 & update version numbers
c9588f 4 lines Fixed Graphiti URI
ca4718 2 lines v201305020316
ca54e5 2 lines v201209190015
cb369d 4 lines Update Graphiti prereq
cc0dd0 6 lines Update Graphiti prereq
cc2f2f 18 lines v201301310033
ccc0bc 2 lines v201308062258
cf0982 2 lines v201209121408
d03eac 20 lines Updated EclipseLink
d05cc9 2 lines Fixed version number
d07d66 10 lines v201212262036
d12225 22 lines v201210030343
d25dcb 2 lines v201307250313
d3a847 8 lines v201305142100
d423e7 8 lines v201307162200
d76701 40 lines v201211130301
d90151 4 lines Updated EclipseLink prereq.
daddcf 94 lines v201301082148
dbc328 10 lines v201303060040
dbe613 10 lines v201209251600
dd673f 54 lines v201210021747
dd9a68 2 lines v201304081458
e0b663 42 lines v201209252151
e2b230 2 lines v201209120202
e2c7d3 2 lines v201301092313
e53e67 52 lines v201209111818
e61bdc 30 lines v201304302343
e63c62 2 lines v201301091616
e65662 10 lines v201304030244
e6b669 55 lines v201210242344
e876eb 70 lines v201209041929
e896e9 8 lines v201210292233
e951d3 6 lines 406238, 408905
eb0600 73 lines 387476 - JPA Diagram Editor needs to move up to Graphiti 10 for Kepler
ecc6c1 54 lines v201212040155
ecd5bb 56 lines v201303140022
ee7cbe 6 lines v201211081727
f03bb6 16 lines v201210161450
f08ee8 18 lines Revert "387476 - JPA Diagram Editor needs to move up to Graphiti 10 for Kepler"
f2a0e9 1 lines Added Diagram Editor swtbot tests
f49c2a 2 lines v201305161638
fa80c9 124 lines Fix for: 386171, 373430, 382150
fc5276 2 lines v201209221922
fc798a 28 lines v201210021747
fd3b07 2 lines v201209221909
fd7799 28 lines v201302252109
ff4094 8 lines v201305171828
ffe57c 6 lines v201301101606
U-ADMINIB-0N21K1B\chrisjaun (adminib-0n21k1b.(none))
09bbba 16 lines [384319] CPU utilization to 100% when this is appended to new object definition
Vaninder Rajput (ca.ibm.com)
458466 1714 bytes Update prereqs for WTP 3.6.3
Attachment 250279: Updated Orbit dependancy to R20150124073747
458466 3612 bytes Update prereqs for WTP 3.6.3
Attachment 250405: Update Orbit dependancy and Eclipse SDK
458521 1546 bytes Add JGit/EGit as a dependency of WTP
Attachment 250548: Added dependancy for jgit
465738 1762 bytes Update Orbit dependancy for WTP 3.7.0 M7
Attachment 252867: Updated Orbit dependancy to S20150428165605
vrubezhny (exadel.com)
03a1c2 2 lines [431547] Bottleneck in SelectionEngine.select() when completing type bindings
078463 4 lines [419970] [refactoring] Change Function Signature doesn't work for modified files
0875ea 4 lines [411589] Invalid this detection
0ae362 6 lines [340756] [validation] False syntax error in with (x) var y;
0e31b5 2 lines [424634] NPE in OverrideIndicatorManager.updateAnnotations() when anonymous function overrides some function
25ff26 4 lines [428476] NullPointerException in Project's Project Preferences page
2d83b5 6 lines [340756] [validation] False syntax error in with (x) var y;
2fef63 2 lines [424131] JSDT Parser doesn't respect "Enable Semantic Validation" preference value
36ce1c 2 lines Bug 410982 - o.e.wst.jsdt.debug.rhino.ui has dependencies to JDT
435e19 2 lines [266542] [refactoring] function renaming operation does not work properly
4393d9 10 lines [419113] Configuration for surefire test runner
545134 2 lines [424131] JSDT Parser doesn't respect "Enable Semantic Validation" preference value
5bacb2 4 lines [426728] [hotbug] @regression: DefaultInferenceProvider is always enabled
6200bd 2 lines [424634] NPE in OverrideIndicatorManager.updateAnnotations() when anonymous function overrides some function
6c44d4 2 lines [424131] JSDT Parser doesn't respect "Enable Semantic Validation" preference value
6ca864 2 lines [266542] [refactoring] function renaming operation does not work properly
6f2d7e 9 lines Bug 487038 - JSON Editor feature is uncategorized in the update site
754774 6 lines [406519] [validation] Valid JavaScript code flagged as error (regexp, infinity, non-breaking space)
8a969d 2 lines [434158] Debug runs even select cancel for ElementListSelectionDialog for debug configuration if multiple configuration exists for same file.
8ff1b1 2 lines [424131] JSDT Parser doesn't respect "Enable Semantic Validation" preference value
ac1e6f 4 lines [411589] Invalid this detection
ad96dd 2 lines [424131] JSDT Parser doesn't respect "Enable Semantic Validation" preference value
c96dc9 9 lines Bug 488144 - Need to add "JavaScript Development Tools Chromium/V8 Remote Debugger" features into WTP Repositories
cbee06 2 lines [424131] JSDT Parser doesn't respect "Enable Semantic Validation" preference value
e59dd4 34 lines [426209] Java 6 + Cleaning some warnings
edc2ae 2 lines v201312191849
f295fd 2 lines Bug 423274 - Debug breakpoints not skip after selecting "Skip all Breakpoints" from breakpoints view after starting debug session.

Repositories

The information contained in this log was generated by using commit information from the following repositories:


© 2016 The Eclipse Foundation Inc. All rights reserved.
Made available to its Members for their internal use.

Adjust the set of projects included in this IP Log.

To modify an ip log you must be logged in as a committer.

 

Help & Documentation: Learn how this IP log is generated and how to correct errors.

Back to the top