Eclipse Community Forums
Forum Search:

Search      Help    Register    Login    Home
Home » Archived » Visual Editor (VE) » ant pdebuild fails
ant pdebuild fails [message #140756] Thu, 20 September 2007 13:29 Go to next message
Eclipse User
Originally posted by: bwcummiskey.tendrilinc.com

Sirs,

Could you explain why I'm seeing a java.io.EOFException in my pde build
(please see below)?

Attached is the offending assemble...*xml file created from eclipse ant
scripts

Thanks,

Bernie

on windows XP
with eclipse 3.3.0 installed at ${eclipse_base}=c:\program files\eclipse,
running


baseLocation=c:/Program Files/eclipse in config_loc/build.properties

startup_jar=" ${eclipse_base}/plugins/org.eclipse.equinox.launcher_1.0.0.v 200
70606.jar"
product_build_loc="${eclipse_base}/plugins/org.eclipse.pde.build_3.3.0.v2007
0612/scripts/productBuild/productBuild.xml"

config_loc=" D:/_GA_svn/_g2_deploy_monitor_TI/tendril_client_build/config "

Running the following from ant:

<exec dir="${basedir}/${ant.project.name}"
executable="java">
<arg line="-jar ${startup_jar}" />
<arg line="-application org.eclipse.ant.core.antRunner" />

<arg line="-buildfile ${product_build_loc}" />
<arg line="-Dbuilder=${config_loc}"/>
</exec>

From log:

[exec] Buildfile: C:/Program
Files/eclipse/plugins/org.eclipse.pde.build_3.3.0.v20070612/ scripts/productB
uild/productBuild.xml
[exec]
[exec] main:
[exec]
[exec] preBuild:
[exec]
[exec] preSetup:
[exec]
[exec] checkLocalMaps:
[exec]
[exec] getMapFiles:
[exec] [concat] No existing resources and no nested text, doing
nothing
[exec]
[exec] postSetup:
[exec]
[exec] checkLocalBase:
[exec]
[exec] getBaseComponents:
[exec]
[exec] generateFeature:
[exec]
[exec] fetch:
[exec]
[exec] generateFeature:
[exec] [eclipse.generateFeature] Some inter-plug-in dependencies have
not been satisfied.
[exec] [eclipse.generateFeature] Bundle com.ibm.icu:
[exec] [eclipse.generateFeature] Another singleton version selected:
com.ibm.icu_3.6.1.v20070417
[exec] [eclipse.generateFeature] Bundle org.eclipse.ant.core:
[exec] [eclipse.generateFeature] Another singleton version selected:
org.eclipse.ant.core_3.1.200.v20070522
[exec] [eclipse.generateFeature] Bundle org.eclipse.core.contenttype:
[exec] [eclipse.generateFeature] Another singleton version selected:
org.eclipse.core.contenttype_3.2.100.v20070319
[exec] [eclipse.generateFeature] Bundle org.eclipse.core.expressions:
[exec] [eclipse.generateFeature] Another singleton version selected:
org.eclipse.core.expressions_3.3.0.v20070606-0010
[exec] [eclipse.generateFeature] Bundle
org.eclipse.core.filesystem.win32.x86:
[exec] [eclipse.generateFeature] Another singleton version selected:
org.eclipse.core.filesystem.win32.x86_1.1.0.v20070510
[exec] [eclipse.generateFeature] Bundle org.eclipse.core.filesystem:
[exec] [eclipse.generateFeature] Another singleton version selected:
org.eclipse.core.filesystem_1.1.0.v20070606
[exec] [eclipse.generateFeature] Bundle org.eclipse.core.jobs:
[exec] [eclipse.generateFeature] Another singleton version selected:
org.eclipse.core.jobs_3.3.0.v20070423
[exec] [eclipse.generateFeature] Bundle org.eclipse.core.net:
[exec] [eclipse.generateFeature] Another singleton version selected:
org.eclipse.core.net_1.0.0.I20070531
[exec] [eclipse.generateFeature] Bundle
org.eclipse.core.resources.win32:
[exec] [eclipse.generateFeature] Another singleton version selected:
org.eclipse.core.resources.win32_3.3.0.v20070226
[exec] [eclipse.generateFeature] Bundle org.eclipse.core.resources:
[exec] [eclipse.generateFeature] Another singleton version selected:
org.eclipse.core.resources_3.3.0.v20070604
[exec] [eclipse.generateFeature] Bundle
org.eclipse.core.runtime.compatibility:
[exec] [eclipse.generateFeature] Another singleton version selected:
org.eclipse.core.runtime.compatibility_3.1.200.v20070502
[exec] [eclipse.generateFeature] Bundle org.eclipse.core.runtime:
[exec] [eclipse.generateFeature] Another singleton version selected:
org.eclipse.core.runtime_3.3.100.v20070530
[exec] [eclipse.generateFeature] Bundle org.eclipse.core.variables:
[exec] [eclipse.generateFeature] Another singleton version selected:
org.eclipse.core.variables_3.2.0.v20070426
[exec] [eclipse.generateFeature] Bundle org.eclipse.equinox.app:
[exec] [eclipse.generateFeature] Another singleton version selected:
org.eclipse.equinox.app_1.0.0.v20070606
[exec] [eclipse.generateFeature] Bundle org.eclipse.equinox.common:
[exec] [eclipse.generateFeature] Another singleton version selected:
org.eclipse.equinox.common_3.3.0.v20070426
[exec] [eclipse.generateFeature] Bundle
org.eclipse.equinox.launcher.win32.win32.x86:
[exec] [eclipse.generateFeature] Another singleton version selected:
org.eclipse.equinox.launcher.win32.win32.x86_1.0.0.v20070523
[exec] [eclipse.generateFeature] Bundle
org.eclipse.equinox.preferences:
[exec] [eclipse.generateFeature] Another singleton version selected:
org.eclipse.equinox.preferences_3.2.100.v20070522
[exec] [eclipse.generateFeature] Bundle org.eclipse.equinox.registry:
[exec] [eclipse.generateFeature] Another singleton version selected:
org.eclipse.equinox.registry_3.3.0.v20070522
[exec] [eclipse.generateFeature] Bundle org.eclipse.gef:
[exec] [eclipse.generateFeature] Another singleton version selected:
org.eclipse.gef_3.2.100.v20070620
[exec] [eclipse.generateFeature] Bundle org.eclipse.help:
[exec] [eclipse.generateFeature] Another singleton version selected:
org.eclipse.help_3.3.0.v20070524
[exec] [eclipse.generateFeature] Bundle org.eclipse.osgi:
[exec] [eclipse.generateFeature] Another singleton version selected:
org.eclipse.osgi_3.3.0.v20070530
[exec] [eclipse.generateFeature] Bundle
org.eclipse.swt.win32.win32.x86:
[exec] [eclipse.generateFeature] Another singleton version selected:
org.eclipse.swt.win32.win32.x86_3.3.0.v3346
[exec] [eclipse.generateFeature] Bundle org.eclipse.swt:
[exec] [eclipse.generateFeature] Another singleton version selected:
org.eclipse.swt_3.3.0.v3346
[exec] [eclipse.generateFeature] Unsatisfied import package
org.mozilla.xpcom_0.0.0.
[exec] [eclipse.generateFeature] Bundle org.eclipse.ui.ide:
[exec] [eclipse.generateFeature] Another singleton version selected:
org.eclipse.ui.ide_3.3.0.I20070620
[exec] [eclipse.generateFeature] Bundle org.eclipse.ui.views:
[exec] [eclipse.generateFeature] Another singleton version selected:
org.eclipse.ui.views_3.2.100.I20070319-0010
[exec] [eclipse.generateFeature] Bundle
org.eclipse.ui.workbench.texteditor:
[exec] [eclipse.generateFeature] Another singleton version selected:
org.eclipse.ui.workbench.texteditor_3.3.0.v20070606-0010
[exec] [eclipse.generateFeature] Bundle org.eclipse.ui.workbench:
[exec] [eclipse.generateFeature] Another singleton version selected:
org.eclipse.ui.workbench_3.3.0.I20070608-1100
[exec] [eclipse.generateFeature] Bundle org.eclipse.ui:
[exec] [eclipse.generateFeature] Another singleton version selected:
org.eclipse.ui_3.3.0.I20070614-0800
[exec] [eclipse.generateFeature] Bundle
org.eclipse.update.configurator:
[exec] [eclipse.generateFeature] Another singleton version selected:
org.eclipse.update.configurator_3.2.100.v20070615
[exec] [eclipse.generateFeature] Bundle org.eclipse.update.core:
[exec] [eclipse.generateFeature] Another singleton version selected:
org.eclipse.update.core_3.2.100.v20070615
[exec] [eclipse.generateFeature] Bundle org.eclipse.update.ui:
[exec] [eclipse.generateFeature] Another singleton version selected:
org.eclipse.update.ui_3.2.100.v20070615
[exec]
[exec] generate:
[exec]
[exec] preGenerate:
[exec]
[exec] allElements:
[exec]
[exec] allElementsDelegator:
[exec]
[exec] init:
[exec]
[exec] generateScript:
[exec] [eclipse.buildScript] Some inter-plug-in dependencies have not
been satisfied.
[exec] [eclipse.buildScript] Bundle com.ibm.icu:
[exec] [eclipse.buildScript] Another singleton version selected:
com.ibm.icu_3.6.1.v20070417
[exec] [eclipse.buildScript] Bundle org.eclipse.ant.core:
[exec] [eclipse.buildScript] Another singleton version selected:
org.eclipse.ant.core_3.1.200.v20070522
[exec] [eclipse.buildScript] Bundle org.eclipse.core.contenttype:
[exec] [eclipse.buildScript] Another singleton version selected:
org.eclipse.core.contenttype_3.2.100.v20070319
[exec] [eclipse.buildScript] Bundle org.eclipse.core.expressions:
[exec] [eclipse.buildScript] Another singleton version selected:
org.eclipse.core.expressions_3.3.0.v20070606-0010
[exec] [eclipse.buildScript] Bundle
org.eclipse.core.filesystem.win32.x86:
[exec] [eclipse.buildScript] Another singleton version selected:
org.eclipse.core.filesystem.win32.x86_1.1.0.v20070510
[exec] [eclipse.buildScript] Bundle org.eclipse.core.filesystem:
[exec] [eclipse.buildScript] Another singleton version selected:
org.eclipse.core.filesystem_1.1.0.v20070606
[exec] [eclipse.buildScript] Bundle org.eclipse.core.jobs:
[exec] [eclipse.buildScript] Another singleton version selected:
org.eclipse.core.jobs_3.3.0.v20070423
[exec] [eclipse.buildScript] Bundle org.eclipse.core.net:
[exec] [eclipse.buildScript] Another singleton version selected:
org.eclipse.core.net_1.0.0.I20070531
[exec] [eclipse.buildScript] Bundle org.eclipse.core.resources.win32:
[exec] [eclipse.buildScript] Another singleton version selected:
org.eclipse.core.resources.win32_3.3.0.v20070226
[exec] [eclipse.buildScript] Bundle org.eclipse.core.resources:
[exec] [eclipse.buildScript] Another singleton version selected:
org.eclipse.core.resources_3.3.0.v20070604
[exec] [eclipse.buildScript] Bundle
org.eclipse.core.runtime.compatibility:
[exec] [eclipse.buildScript] Another singleton version selected:
org.eclipse.core.runtime.compatibility_3.1.200.v20070502
[exec] [eclipse.buildScript] Bundle org.eclipse.core.runtime:
[exec] [eclipse.buildScript] Another singleton version selected:
org.eclipse.core.runtime_3.3.100.v20070530
[exec] [eclipse.buildScript] Bundle org.eclipse.core.variables:
[exec] [eclipse.buildScript] Another singleton version selected:
org.eclipse.core.variables_3.2.0.v20070426
[exec] [eclipse.buildScript] Bundle org.eclipse.equinox.app:
[exec] [eclipse.buildScript] Another singleton version selected:
org.eclipse.equinox.app_1.0.0.v20070606
[exec] [eclipse.buildScript] Bundle org.eclipse.equinox.common:
[exec] [eclipse.buildScript] Another singleton version selected:
org.eclipse.equinox.common_3.3.0.v20070426
[exec] [eclipse.buildScript] Bundle
org.eclipse.equinox.launcher.win32.win32.x86:
[exec] [eclipse.buildScript] Another singleton version selected:
org.eclipse.equinox.launcher.win32.win32.x86_1.0.0.v20070523
[exec] [eclipse.buildScript] Bundle org.eclipse.equinox.preferences:
[exec] [eclipse.buildScript] Another singleton version selected:
org.eclipse.equinox.preferences_3.2.100.v20070522
[exec] [eclipse.buildScript] Bundle org.eclipse.equinox.registry:
[exec] [eclipse.buildScript] Another singleton version selected:
org.eclipse.equinox.registry_3.3.0.v20070522
[exec] [eclipse.buildScript] Bundle org.eclipse.gef:
[exec] [eclipse.buildScript] Another singleton version selected:
org.eclipse.gef_3.2.100.v20070620
[exec] [eclipse.buildScript] Bundle org.eclipse.help:
[exec] [eclipse.buildScript] Another singleton version selected:
org.eclipse.help_3.3.0.v20070524
[exec] [eclipse.buildScript] Bundle org.eclipse.osgi:
[exec] [eclipse.buildScript] Another singleton version selected:
org.eclipse.osgi_3.3.0.v20070530
[exec] [eclipse.buildScript] Bundle org.eclipse.swt.win32.win32.x86:
[exec] [eclipse.buildScript] Another singleton version selected:
org.eclipse.swt.win32.win32.x86_3.3.0.v3346
[exec] [eclipse.buildScript] Bundle org.eclipse.swt:
[exec] [eclipse.buildScript] Another singleton version selected:
org.eclipse.swt_3.3.0.v3346
[exec] [eclipse.buildScript] Unsatisfied import package
org.mozilla.xpcom_0.0.0.
[exec] [eclipse.buildScript] Bundle org.eclipse.ui.ide:
[exec] [eclipse.buildScript] Another singleton version selected:
org.eclipse.ui.ide_3.3.0.I20070620
[exec] [eclipse.buildScript] Bundle org.eclipse.ui.views:
[exec] [eclipse.buildScript] Another singleton version selected:
org.eclipse.ui.views_3.2.100.I20070319-0010
[exec] [eclipse.buildScript] Bundle
org.eclipse.ui.workbench.texteditor:
[exec] [eclipse.buildScript] Another singleton version selected:
org.eclipse.ui.workbench.texteditor_3.3.0.v20070606-0010
[exec] [eclipse.buildScript] Bundle org.eclipse.ui.workbench:
[exec] [eclipse.buildScript] Another singleton version selected:
org.eclipse.ui.workbench_3.3.0.I20070608-1100
[exec] [eclipse.buildScript] Bundle org.eclipse.ui:
[exec] [eclipse.buildScript] Another singleton version selected:
org.eclipse.ui_3.3.0.I20070614-0800
[exec] [eclipse.buildScript] Bundle org.eclipse.update.configurator:
[exec] [eclipse.buildScript] Another singleton version selected:
org.eclipse.update.configurator_3.2.100.v20070615
[exec] [eclipse.buildScript] Bundle org.eclipse.update.core:
[exec] [eclipse.buildScript] Another singleton version selected:
org.eclipse.update.core_3.2.100.v20070615
[exec] [eclipse.buildScript] Bundle org.eclipse.update.ui:
[exec] [eclipse.buildScript] Another singleton version selected:
org.eclipse.update.ui_3.2.100.v20070615
[exec]
[exec] postGenerate:
[exec]
[exec] clean:
[exec]
[exec] allElements:
[exec]
[exec] allElementsDelegator:
[exec]
[exec] init:
[exec]
[exec] cleanElement:
[exec] [echo]
D:/_GA_svn/_g2_deploy_monitor_TI/tendril_client_build/build/ features/org.ecl
ipse.pde.build.container.feature
[exec]
[exec] init:
[exec]
[exec] clean:
[exec]
[exec] init:
[exec]
[exec] all.features:
[exec]
[exec] all.plugins:
[exec]
[exec] update.feature:
[exec]
[exec] all.children:
[exec]
[exec] process:
[exec]
[exec] preProcess:
[exec]
[exec] allElements:
[exec]
[exec] allElementsDelegator:
[exec]
[exec] init:
[exec]
[exec] processElement:
[exec]
[exec] init:
[exec]
[exec] build.jars:
[exec]
[exec] init:
[exec]
[exec] all.features:
[exec]
[exec] all.plugins:
[exec]
[exec] update.feature:
[exec]
[exec] all.children:
[exec]
[exec] postProcess:
[exec]
[exec] assemble:
[exec]
[exec] preAssemble:
[exec]
[exec] allElements:
[exec]
[exec] allElementsDelegator:
[exec]
[exec] init:
[exec]
[exec] assembleElement:
[exec]
[exec] main:
[exec]
[exec]
assemble.org.eclipse.pde.build.container.feature.win32.win32 .x86:
[exec]
[exec] main:
[exec] [mkdir] Created dir:
D:\_GA_svn\_g2_deploy_monitor_TI\tendril_client_build\build\ I.TestBuild
[exec]
[exec] init:
[exec]
[exec] gather.bin.parts:
[exec]
[exec] children:
[exec]
[exec] rootFileswin32_win32_x86:
[exec] [copy] Copying 3 files to
D:\_GA_svn\_g2_deploy_monitor_TI\tendril_client_build\build\ tmp\TendrilClien
t\win32.win32.x86\TendrilClient
[exec]
[exec] BUILD FAILED
[exec] C:\Program
Files\eclipse\plugins\org.eclipse.pde.build_3.3.0.v20070612\ scripts\productB
uild\productBuild.xml:29: The following error occurred while executing this
line:
[exec] C:\Program
Files\eclipse\plugins\org.eclipse.pde.build_3.3.0.v20070612\ scripts\build.xm
l:91: The following error occurred while executing this line:
[exec] C:\Program
Files\eclipse\plugins\org.eclipse.pde.build_3.3.0.v20070612\ templates\headle
ss-build\customTargets.xml:10: The following error occurred while executing
this line:
[exec] C:\Program
Files\eclipse\plugins\org.eclipse.pde.build_3.3.0.v20070612\ scripts\productB
uild\allElements.xml:9: The following error occurred while executing this
line:
[exec] C:\Program
Files\eclipse\plugins\org.eclipse.pde.build_3.3.0.v20070612\ scripts\genericT
argets.xml:155: The following error occurred while executing this line:
[exec]
D:\_GA_svn\_g2_deploy_monitor_TI\tendril_client_build\build\ assemble.org.ecl
ipse.pde.build.container.feature.all.xml:4: The following error occurred
while executing this line:
[exec] C:\Program
Files\eclipse\plugins\org.eclipse.pde.build_3.3.0.v20070612\ scripts\productB
uild\allElements.xml:28: The following error occurred while executing this
line:
[exec]
D:\_GA_svn\_g2_deploy_monitor_TI\tendril_client_build\build\ assemble.org.ecl
ipse.pde.build.container.feature.win32.win32.x86.xml:51:
java.io.EOFException
[exec]
[exec] Total time: 9 seconds
[exec] Result: 13
[mkdir] Created dir:
D:\_GA_svn\_g2_deploy_monitor_TI\tendril_client_build\tendri lplatform
[unzip] Expanding:
D:\_GA_svn\_g2_deploy_monitor_TI\tendril_client_build\build\ I.TestBuild\Test
Build-win32.win32.x86.zip into
D:\_GA_svn\_g2_deploy_monitor_TI\tendril_client_build\tendri lplatform

BUILD FAILED


Re: ant pdebuild fails [message #140863 is a reply to message #140756] Fri, 21 September 2007 02:02 Go to previous messageGo to next message
Karsten Panier is currently offline Karsten Panier
Messages: 57
Registered: July 2009
Member
Tendril schrieb:
> Sirs,
>
> Could you explain why I'm seeing a java.io.EOFException in my pde build
> (please see below)?
>
> Attached is the offending assemble...*xml file created from eclipse ant
> scripts
>
> Thanks,
>
> Bernie
>
> on windows XP
> with eclipse 3.3.0 installed at ${eclipse_base}=c:\program files\eclipse,
> running
>
>
> baseLocation=c:/Program Files/eclipse in config_loc/build.properties
>
> startup_jar=" ${eclipse_base}/plugins/org.eclipse.equinox.launcher_1.0.0.v 200
> 70606.jar"
> product_build_loc="${eclipse_base}/plugins/org.eclipse.pde.build_3.3.0.v2007
> 0612/scripts/productBuild/productBuild.xml"
>
> config_loc=" D:/_GA_svn/_g2_deploy_monitor_TI/tendril_client_build/config "
>
> Running the following from ant:
>
> <exec dir="${basedir}/${ant.project.name}"
> executable="java">
> <arg line="-jar ${startup_jar}" />
> <arg line="-application org.eclipse.ant.core.antRunner" />
>
> <arg line="-buildfile ${product_build_loc}" />
> <arg line="-Dbuilder=${config_loc}"/>
> </exec>
>
> From log:
>
> [exec] Buildfile: C:/Program
> Files/eclipse/plugins/org.eclipse.pde.build_3.3.0.v20070612/ scripts/productB
> uild/productBuild.xml
> [exec]
> [exec] main:
> [exec]
> [exec] preBuild:
> [exec]
> [exec] preSetup:
> [exec]
> [exec] checkLocalMaps:
> [exec]
> [exec] getMapFiles:
> [exec] [concat] No existing resources and no nested text, doing
> nothing
> [exec]
> [exec] postSetup:
> [exec]
> [exec] checkLocalBase:
> [exec]
> [exec] getBaseComponents:
> [exec]
> [exec] generateFeature:
> [exec]
> [exec] fetch:
> [exec]
> [exec] generateFeature:
> [exec] [eclipse.generateFeature] Some inter-plug-in dependencies have
> not been satisfied.
> [exec] [eclipse.generateFeature] Bundle com.ibm.icu:
> [exec] [eclipse.generateFeature] Another singleton version selected:
> com.ibm.icu_3.6.1.v20070417
> [exec] [eclipse.generateFeature] Bundle org.eclipse.ant.core:
> [exec] [eclipse.generateFeature] Another singleton version selected:
> org.eclipse.ant.core_3.1.200.v20070522
> [exec] [eclipse.generateFeature] Bundle org.eclipse.core.contenttype:
> [exec] [eclipse.generateFeature] Another singleton version selected:
> org.eclipse.core.contenttype_3.2.100.v20070319
> [exec] [eclipse.generateFeature] Bundle org.eclipse.core.expressions:
> [exec] [eclipse.generateFeature] Another singleton version selected:
> org.eclipse.core.expressions_3.3.0.v20070606-0010
> [exec] [eclipse.generateFeature] Bundle
> org.eclipse.core.filesystem.win32.x86:
> [exec] [eclipse.generateFeature] Another singleton version selected:
> org.eclipse.core.filesystem.win32.x86_1.1.0.v20070510
> [exec] [eclipse.generateFeature] Bundle org.eclipse.core.filesystem:
> [exec] [eclipse.generateFeature] Another singleton version selected:
> org.eclipse.core.filesystem_1.1.0.v20070606
> [exec] [eclipse.generateFeature] Bundle org.eclipse.core.jobs:
> [exec] [eclipse.generateFeature] Another singleton version selected:
> org.eclipse.core.jobs_3.3.0.v20070423
> [exec] [eclipse.generateFeature] Bundle org.eclipse.core.net:
> [exec] [eclipse.generateFeature] Another singleton version selected:
> org.eclipse.core.net_1.0.0.I20070531
> [exec] [eclipse.generateFeature] Bundle
> org.eclipse.core.resources.win32:
> [exec] [eclipse.generateFeature] Another singleton version selected:
> org.eclipse.core.resources.win32_3.3.0.v20070226
> [exec] [eclipse.generateFeature] Bundle org.eclipse.core.resources:
> [exec] [eclipse.generateFeature] Another singleton version selected:
> org.eclipse.core.resources_3.3.0.v20070604
> [exec] [eclipse.generateFeature] Bundle
> org.eclipse.core.runtime.compatibility:
> [exec] [eclipse.generateFeature] Another singleton version selected:
> org.eclipse.core.runtime.compatibility_3.1.200.v20070502
> [exec] [eclipse.generateFeature] Bundle org.eclipse.core.runtime:
> [exec] [eclipse.generateFeature] Another singleton version selected:
> org.eclipse.core.runtime_3.3.100.v20070530
> [exec] [eclipse.generateFeature] Bundle org.eclipse.core.variables:
> [exec] [eclipse.generateFeature] Another singleton version selected:
> org.eclipse.core.variables_3.2.0.v20070426
> [exec] [eclipse.generateFeature] Bundle org.eclipse.equinox.app:
> [exec] [eclipse.generateFeature] Another singleton version selected:
> org.eclipse.equinox.app_1.0.0.v20070606
> [exec] [eclipse.generateFeature] Bundle org.eclipse.equinox.common:
> [exec] [eclipse.generateFeature] Another singleton version selected:
> org.eclipse.equinox.common_3.3.0.v20070426
> [exec] [eclipse.generateFeature] Bundle
> org.eclipse.equinox.launcher.win32.win32.x86:
> [exec] [eclipse.generateFeature] Another singleton version selected:
> org.eclipse.equinox.launcher.win32.win32.x86_1.0.0.v20070523
> [exec] [eclipse.generateFeature] Bundle
> org.eclipse.equinox.preferences:
> [exec] [eclipse.generateFeature] Another singleton version selected:
> org.eclipse.equinox.preferences_3.2.100.v20070522
> [exec] [eclipse.generateFeature] Bundle org.eclipse.equinox.registry:
> [exec] [eclipse.generateFeature] Another singleton version selected:
> org.eclipse.equinox.registry_3.3.0.v20070522
> [exec] [eclipse.generateFeature] Bundle org.eclipse.gef:
> [exec] [eclipse.generateFeature] Another singleton version selected:
> org.eclipse.gef_3.2.100.v20070620
> [exec] [eclipse.generateFeature] Bundle org.eclipse.help:
> [exec] [eclipse.generateFeature] Another singleton version selected:
> org.eclipse.help_3.3.0.v20070524
> [exec] [eclipse.generateFeature] Bundle org.eclipse.osgi:
> [exec] [eclipse.generateFeature] Another singleton version selected:
> org.eclipse.osgi_3.3.0.v20070530
> [exec] [eclipse.generateFeature] Bundle
> org.eclipse.swt.win32.win32.x86:
> [exec] [eclipse.generateFeature] Another singleton version selected:
> org.eclipse.swt.win32.win32.x86_3.3.0.v3346
> [exec] [eclipse.generateFeature] Bundle org.eclipse.swt:
> [exec] [eclipse.generateFeature] Another singleton version selected:
> org.eclipse.swt_3.3.0.v3346
> [exec] [eclipse.generateFeature] Unsatisfied import package
> org.mozilla.xpcom_0.0.0.
> [exec] [eclipse.generateFeature] Bundle org.eclipse.ui.ide:
> [exec] [eclipse.generateFeature] Another singleton version selected:
> org.eclipse.ui.ide_3.3.0.I20070620
> [exec] [eclipse.generateFeature] Bundle org.eclipse.ui.views:
> [exec] [eclipse.generateFeature] Another singleton version selected:
> org.eclipse.ui.views_3.2.100.I20070319-0010
> [exec] [eclipse.generateFeature] Bundle
> org.eclipse.ui.workbench.texteditor:
> [exec] [eclipse.generateFeature] Another singleton version selected:
> org.eclipse.ui.workbench.texteditor_3.3.0.v20070606-0010
> [exec] [eclipse.generateFeature] Bundle org.eclipse.ui.workbench:
> [exec] [eclipse.generateFeature] Another singleton version selected:
> org.eclipse.ui.workbench_3.3.0.I20070608-1100
> [exec] [eclipse.generateFeature] Bundle org.eclipse.ui:
> [exec] [eclipse.generateFeature] Another singleton version selected:
> org.eclipse.ui_3.3.0.I20070614-0800
> [exec] [eclipse.generateFeature] Bundle
> org.eclipse.update.configurator:
> [exec] [eclipse.generateFeature] Another singleton version selected:
> org.eclipse.update.configurator_3.2.100.v20070615
> [exec] [eclipse.generateFeature] Bundle org.eclipse.update.core:
> [exec] [eclipse.generateFeature] Another singleton version selected:
> org.eclipse.update.core_3.2.100.v20070615
> [exec] [eclipse.generateFeature] Bundle org.eclipse.update.ui:
> [exec] [eclipse.generateFeature] Another singleton version selected:
> org.eclipse.update.ui_3.2.100.v20070615
> [exec]
> [exec] generate:
> [exec]
> [exec] preGenerate:
> [exec]
> [exec] allElements:
> [exec]
> [exec] allElementsDelegator:
> [exec]
> [exec] init:
> [exec]
> [exec] generateScript:
> [exec] [eclipse.buildScript] Some inter-plug-in dependencies have not
> been satisfied.
> [exec] [eclipse.buildScript] Bundle com.ibm.icu:
> [exec] [eclipse.buildScript] Another singleton version selected:
> com.ibm.icu_3.6.1.v20070417
> [exec] [eclipse.buildScript] Bundle org.eclipse.ant.core:
> [exec] [eclipse.buildScript] Another singleton version selected:
> org.eclipse.ant.core_3.1.200.v20070522
> [exec] [eclipse.buildScript] Bundle org.eclipse.core.contenttype:
> [exec] [eclipse.buildScript] Another singleton version selected:
> org.eclipse.core.contenttype_3.2.100.v20070319
> [exec] [eclipse.buildScript] Bundle org.eclipse.core.expressions:
> [exec] [eclipse.buildScript] Another singleton version selected:
> org.eclipse.core.expressions_3.3.0.v20070606-0010
> [exec] [eclipse.buildScript] Bundle
> org.eclipse.core.filesystem.win32.x86:
> [exec] [eclipse.buildScript] Another singleton version selected:
> org.eclipse.core.filesystem.win32.x86_1.1.0.v20070510
> [exec] [eclipse.buildScript] Bundle org.eclipse.core.filesystem:
> [exec] [eclipse.buildScript] Another singleton version selected:
> org.eclipse.core.filesystem_1.1.0.v20070606
> [exec] [eclipse.buildScript] Bundle org.eclipse.core.jobs:
> [exec] [eclipse.buildScript] Another singleton version selected:
> org.eclipse.core.jobs_3.3.0.v20070423
> [exec] [eclipse.buildScript] Bundle org.eclipse.core.net:
> [exec] [eclipse.buildScript] Another singleton version selected:
> org.eclipse.core.net_1.0.0.I20070531
> [exec] [eclipse.buildScript] Bundle org.eclipse.core.resources.win32:
> [exec] [eclipse.buildScript] Another singleton version selected:
> org.eclipse.core.resources.win32_3.3.0.v20070226
> [exec] [eclipse.buildScript] Bundle org.eclipse.core.resources:
> [exec] [eclipse.buildScript] Another singleton version selected:
> org.eclipse.core.resources_3.3.0.v20070604
> [exec] [eclipse.buildScript] Bundle
> org.eclipse.core.runtime.compatibility:
> [exec] [eclipse.buildScript] Another singleton version selected:
> org.eclipse.core.runtime.compatibility_3.1.200.v20070502
> [exec] [eclipse.buildScript] Bundle org.eclipse.core.runtime:
> [exec] [eclipse.buildScript] Another singleton version selected:
> org.eclipse.core.runtime_3.3.100.v20070530
> [exec] [eclipse.buildScript] Bundle org.eclipse.core.variables:
> [exec] [eclipse.buildScript] Another singleton version selected:
> org.eclipse.core.variables_3.2.0.v20070426
> [exec] [eclipse.buildScript] Bundle org.eclipse.equinox.app:
> [exec] [eclipse.buildScript] Another singleton version selected:
> org.eclipse.equinox.app_1.0.0.v20070606
> [exec] [eclipse.buildScript] Bundle org.eclipse.equinox.common:
> [exec] [eclipse.buildScript] Another singleton version selected:
> org.eclipse.equinox.common_3.3.0.v20070426
> [exec] [eclipse.buildScript] Bundle
> org.eclipse.equinox.launcher.win32.win32.x86:
> [exec] [eclipse.buildScript] Another singleton version selected:
> org.eclipse.equinox.launcher.win32.win32.x86_1.0.0.v20070523
> [exec] [eclipse.buildScript] Bundle org.eclipse.equinox.preferences:
> [exec] [eclipse.buildScript] Another singleton version selected:
> org.eclipse.equinox.preferences_3.2.100.v20070522
> [exec] [eclipse.buildScript] Bundle org.eclipse.equinox.registry:
> [exec] [eclipse.buildScript] Another singleton version selected:
> org.eclipse.equinox.registry_3.3.0.v20070522
> [exec] [eclipse.buildScript] Bundle org.eclipse.gef:
> [exec] [eclipse.buildScript] Another singleton version selected:
> org.eclipse.gef_3.2.100.v20070620
> [exec] [eclipse.buildScript] Bundle org.eclipse.help:
> [exec] [eclipse.buildScript] Another singleton version selected:
> org.eclipse.help_3.3.0.v20070524
> [exec] [eclipse.buildScript] Bundle org.eclipse.osgi:
> [exec] [eclipse.buildScript] Another singleton version selected:
> org.eclipse.osgi_3.3.0.v20070530
> [exec] [eclipse.buildScript] Bundle org.eclipse.swt.win32.win32.x86:
> [exec] [eclipse.buildScript] Another singleton version selected:
> org.eclipse.swt.win32.win32.x86_3.3.0.v3346
> [exec] [eclipse.buildScript] Bundle org.eclipse.swt:
> [exec] [eclipse.buildScript] Another singleton version selected:
> org.eclipse.swt_3.3.0.v3346
> [exec] [eclipse.buildScript] Unsatisfied import package
> org.mozilla.xpcom_0.0.0.
> [exec] [eclipse.buildScript] Bundle org.eclipse.ui.ide:
> [exec] [eclipse.buildScript] Another singleton version selected:
> org.eclipse.ui.ide_3.3.0.I20070620
> [exec] [eclipse.buildScript] Bundle org.eclipse.ui.views:
> [exec] [eclipse.buildScript] Another singleton version selected:
> org.eclipse.ui.views_3.2.100.I20070319-0010
> [exec] [eclipse.buildScript] Bundle
> org.eclipse.ui.workbench.texteditor:
> [exec] [eclipse.buildScript] Another singleton version selected:
> org.eclipse.ui.workbench.texteditor_3.3.0.v20070606-0010
> [exec] [eclipse.buildScript] Bundle org.eclipse.ui.workbench:
> [exec] [eclipse.buildScript] Another singleton version selected:
> org.eclipse.ui.workbench_3.3.0.I20070608-1100
> [exec] [eclipse.buildScript] Bundle org.eclipse.ui:
> [exec] [eclipse.buildScript] Another singleton version selected:
> org.eclipse.ui_3.3.0.I20070614-0800
> [exec] [eclipse.buildScript] Bundle org.eclipse.update.configurator:
> [exec] [eclipse.buildScript] Another singleton version selected:
> org.eclipse.update.configurator_3.2.100.v20070615
> [exec] [eclipse.buildScript] Bundle org.eclipse.update.core:
> [exec] [eclipse.buildScript] Another singleton version selected:
> org.eclipse.update.core_3.2.100.v20070615
> [exec] [eclipse.buildScript] Bundle org.eclipse.update.ui:
> [exec] [eclipse.buildScript] Another singleton version selected:
> org.eclipse.update.ui_3.2.100.v20070615
> [exec]
> [exec] postGenerate:
> [exec]
> [exec] clean:
> [exec]
> [exec] allElements:
> [exec]
> [exec] allElementsDelegator:
> [exec]
> [exec] init:
> [exec]
> [exec] cleanElement:
> [exec] [echo]
> D:/_GA_svn/_g2_deploy_monitor_TI/tendril_client_build/build/ features/org.ecl
> ipse.pde.build.container.feature
> [exec]
> [exec] init:
> [exec]
> [exec] clean:
> [exec]
> [exec] init:
> [exec]
> [exec] all.features:
> [exec]
> [exec] all.plugins:
> [exec]
> [exec] update.feature:
> [exec]
> [exec] all.children:
> [exec]
> [exec] process:
> [exec]
> [exec] preProcess:
> [exec]
> [exec] allElements:
> [exec]
> [exec] allElementsDelegator:
> [exec]
> [exec] init:
> [exec]
> [exec] processElement:
> [exec]
> [exec] init:
> [exec]
> [exec] build.jars:
> [exec]
> [exec] init:
> [exec]
> [exec] all.features:
> [exec]
> [exec] all.plugins:
> [exec]
> [exec] update.feature:
> [exec]
> [exec] all.children:
> [exec]
> [exec] postProcess:
> [exec]
> [exec] assemble:
> [exec]
> [exec] preAssemble:
> [exec]
> [exec] allElements:
> [exec]
> [exec] allElementsDelegator:
> [exec]
> [exec] init:
> [exec]
> [exec] assembleElement:
> [exec]
> [exec] main:
> [exec]
> [exec]
> assemble.org.eclipse.pde.build.container.feature.win32.win32 .x86:
> [exec]
> [exec] main:
> [exec] [mkdir] Created dir:
> D:\_GA_svn\_g2_deploy_monitor_TI\tendril_client_build\build\ I.TestBuild
> [exec]
> [exec] init:
> [exec]
> [exec] gather.bin.parts:
> [exec]
> [exec] children:
> [exec]
> [exec] rootFileswin32_win32_x86:
> [exec] [copy] Copying 3 files to
> D:\_GA_svn\_g2_deploy_monitor_TI\tendril_client_build\build\ tmp\TendrilClien
> t\win32.win32.x86\TendrilClient
> [exec]
> [exec] BUILD FAILED
> [exec] C:\Program
> Files\eclipse\plugins\org.eclipse.pde.build_3.3.0.v20070612\ scripts\productB
> uild\productBuild.xml:29: The following error occurred while executing this
> line:
> [exec] C:\Program
> Files\eclipse\plugins\org.eclipse.pde.build_3.3.0.v20070612\ scripts\build.xm
> l:91: The following error occurred while executing this line:
> [exec] C:\Program
> Files\eclipse\plugins\org.eclipse.pde.build_3.3.0.v20070612\ templates\headle
> ss-build\customTargets.xml:10: The following error occurred while executing
> this line:
> [exec] C:\Program
> Files\eclipse\plugins\org.eclipse.pde.build_3.3.0.v20070612\ scripts\productB
> uild\allElements.xml:9: The following error occurred while executing this
> line:
> [exec] C:\Program
> Files\eclipse\plugins\org.eclipse.pde.build_3.3.0.v20070612\ scripts\genericT
> argets.xml:155: The following error occurred while executing this line:
> [exec]
> D:\_GA_svn\_g2_deploy_monitor_TI\tendril_client_build\build\ assemble.org.ecl
> ipse.pde.build.container.feature.all.xml:4: The following error occurred
> while executing this line:
> [exec] C:\Program
> Files\eclipse\plugins\org.eclipse.pde.build_3.3.0.v20070612\ scripts\productB
> uild\allElements.xml:28: The following error occurred while executing this
> line:
> [exec]
> D:\_GA_svn\_g2_deploy_monitor_TI\tendril_client_build\build\ assemble.org.ecl
> ipse.pde.build.container.feature.win32.win32.x86.xml:51:
> java.io.EOFException
> [exec]
> [exec] Total time: 9 seconds
> [exec] Result: 13
> [mkdir] Created dir:
> D:\_GA_svn\_g2_deploy_monitor_TI\tendril_client_build\tendri lplatform
> [unzip] Expanding:
> D:\_GA_svn\_g2_deploy_monitor_TI\tendril_client_build\build\ I.TestBuild\Test
> Build-win32.win32.x86.zip into
> D:\_GA_svn\_g2_deploy_monitor_TI\tendril_client_build\tendri lplatform
>
> BUILD FAILED
>
>
>
Hi,
includes your feature the feature org.eclipse.equinox.executable? It is
part of the RCP-delta-pack. A product build needs it to make the
branding stuff.
Karsten
Re: ant pdebuild fails [message #140896 is a reply to message #140863] Fri, 21 September 2007 10:54 Go to previous messageGo to next message
Andrew Niefer is currently offline Andrew Niefer
Messages: 990
Registered: July 2009
Senior Member
Karsten Panier wrote:
> Tendril schrieb:
>> Sirs,
>>
>> Could you explain why I'm seeing a java.io.EOFException in my pde build
>> (please see below)?

>>
> Hi,
> includes your feature the feature org.eclipse.equinox.executable? It is
> part of the RCP-delta-pack. A product build needs it to make the
> branding stuff.
> Karsten

Karsten is correct, get the RCP-delta-pack and put it in your baseLocation.
That should be enough to fix it since the productBuild will automatically
include the org.eclipse.equinox.executable for you if it can find it.

-Andrew
Re: ant pdebuild fails [message #141002 is a reply to message #140896] Sun, 23 September 2007 19:57 Go to previous message
Philippe Ombredanne is currently offline Philippe Ombredanne
Messages: 386
Registered: July 2009
Senior Member
> > Tendril schrieb:
> >> Sirs,
> >> Could you explain why I'm seeing a java.io.EOFException in my pde build
> >> (please see below)?
Hi Tendril:
Are you building an RCP that includes VE?
If yes that is great. Could you elaborate on it?
Cordially
Philippe
Re: ant pdebuild fails [message #616583 is a reply to message #140756] Fri, 21 September 2007 02:02 Go to previous message
Karsten Panier is currently offline Karsten Panier
Messages: 57
Registered: July 2009
Member
Tendril schrieb:
> Sirs,
>
> Could you explain why I'm seeing a java.io.EOFException in my pde build
> (please see below)?
>
> Attached is the offending assemble...*xml file created from eclipse ant
> scripts
>
> Thanks,
>
> Bernie
>
> on windows XP
> with eclipse 3.3.0 installed at ${eclipse_base}=c:\program files\eclipse,
> running
>
>
> baseLocation=c:/Program Files/eclipse in config_loc/build.properties
>
> startup_jar=" ${eclipse_base}/plugins/org.eclipse.equinox.launcher_1.0.0.v 200
> 70606.jar"
> product_build_loc="${eclipse_base}/plugins/org.eclipse.pde.build_3.3.0.v2007
> 0612/scripts/productBuild/productBuild.xml"
>
> config_loc=" D:/_GA_svn/_g2_deploy_monitor_TI/tendril_client_build/config "
>
> Running the following from ant:
>
> <exec dir="${basedir}/${ant.project.name}"
> executable="java">
> <arg line="-jar ${startup_jar}" />
> <arg line="-application org.eclipse.ant.core.antRunner" />
>
> <arg line="-buildfile ${product_build_loc}" />
> <arg line="-Dbuilder=${config_loc}"/>
> </exec>
>
> From log:
>
> [exec] Buildfile: C:/Program
> Files/eclipse/plugins/org.eclipse.pde.build_3.3.0.v20070612/ scripts/productB
> uild/productBuild.xml
> [exec]
> [exec] main:
> [exec]
> [exec] preBuild:
> [exec]
> [exec] preSetup:
> [exec]
> [exec] checkLocalMaps:
> [exec]
> [exec] getMapFiles:
> [exec] [concat] No existing resources and no nested text, doing
> nothing
> [exec]
> [exec] postSetup:
> [exec]
> [exec] checkLocalBase:
> [exec]
> [exec] getBaseComponents:
> [exec]
> [exec] generateFeature:
> [exec]
> [exec] fetch:
> [exec]
> [exec] generateFeature:
> [exec] [eclipse.generateFeature] Some inter-plug-in dependencies have
> not been satisfied.
> [exec] [eclipse.generateFeature] Bundle com.ibm.icu:
> [exec] [eclipse.generateFeature] Another singleton version selected:
> com.ibm.icu_3.6.1.v20070417
> [exec] [eclipse.generateFeature] Bundle org.eclipse.ant.core:
> [exec] [eclipse.generateFeature] Another singleton version selected:
> org.eclipse.ant.core_3.1.200.v20070522
> [exec] [eclipse.generateFeature] Bundle org.eclipse.core.contenttype:
> [exec] [eclipse.generateFeature] Another singleton version selected:
> org.eclipse.core.contenttype_3.2.100.v20070319
> [exec] [eclipse.generateFeature] Bundle org.eclipse.core.expressions:
> [exec] [eclipse.generateFeature] Another singleton version selected:
> org.eclipse.core.expressions_3.3.0.v20070606-0010
> [exec] [eclipse.generateFeature] Bundle
> org.eclipse.core.filesystem.win32.x86:
> [exec] [eclipse.generateFeature] Another singleton version selected:
> org.eclipse.core.filesystem.win32.x86_1.1.0.v20070510
> [exec] [eclipse.generateFeature] Bundle org.eclipse.core.filesystem:
> [exec] [eclipse.generateFeature] Another singleton version selected:
> org.eclipse.core.filesystem_1.1.0.v20070606
> [exec] [eclipse.generateFeature] Bundle org.eclipse.core.jobs:
> [exec] [eclipse.generateFeature] Another singleton version selected:
> org.eclipse.core.jobs_3.3.0.v20070423
> [exec] [eclipse.generateFeature] Bundle org.eclipse.core.net:
> [exec] [eclipse.generateFeature] Another singleton version selected:
> org.eclipse.core.net_1.0.0.I20070531
> [exec] [eclipse.generateFeature] Bundle
> org.eclipse.core.resources.win32:
> [exec] [eclipse.generateFeature] Another singleton version selected:
> org.eclipse.core.resources.win32_3.3.0.v20070226
> [exec] [eclipse.generateFeature] Bundle org.eclipse.core.resources:
> [exec] [eclipse.generateFeature] Another singleton version selected:
> org.eclipse.core.resources_3.3.0.v20070604
> [exec] [eclipse.generateFeature] Bundle
> org.eclipse.core.runtime.compatibility:
> [exec] [eclipse.generateFeature] Another singleton version selected:
> org.eclipse.core.runtime.compatibility_3.1.200.v20070502
> [exec] [eclipse.generateFeature] Bundle org.eclipse.core.runtime:
> [exec] [eclipse.generateFeature] Another singleton version selected:
> org.eclipse.core.runtime_3.3.100.v20070530
> [exec] [eclipse.generateFeature] Bundle org.eclipse.core.variables:
> [exec] [eclipse.generateFeature] Another singleton version selected:
> org.eclipse.core.variables_3.2.0.v20070426
> [exec] [eclipse.generateFeature] Bundle org.eclipse.equinox.app:
> [exec] [eclipse.generateFeature] Another singleton version selected:
> org.eclipse.equinox.app_1.0.0.v20070606
> [exec] [eclipse.generateFeature] Bundle org.eclipse.equinox.common:
> [exec] [eclipse.generateFeature] Another singleton version selected:
> org.eclipse.equinox.common_3.3.0.v20070426
> [exec] [eclipse.generateFeature] Bundle
> org.eclipse.equinox.launcher.win32.win32.x86:
> [exec] [eclipse.generateFeature] Another singleton version selected:
> org.eclipse.equinox.launcher.win32.win32.x86_1.0.0.v20070523
> [exec] [eclipse.generateFeature] Bundle
> org.eclipse.equinox.preferences:
> [exec] [eclipse.generateFeature] Another singleton version selected:
> org.eclipse.equinox.preferences_3.2.100.v20070522
> [exec] [eclipse.generateFeature] Bundle org.eclipse.equinox.registry:
> [exec] [eclipse.generateFeature] Another singleton version selected:
> org.eclipse.equinox.registry_3.3.0.v20070522
> [exec] [eclipse.generateFeature] Bundle org.eclipse.gef:
> [exec] [eclipse.generateFeature] Another singleton version selected:
> org.eclipse.gef_3.2.100.v20070620
> [exec] [eclipse.generateFeature] Bundle org.eclipse.help:
> [exec] [eclipse.generateFeature] Another singleton version selected:
> org.eclipse.help_3.3.0.v20070524
> [exec] [eclipse.generateFeature] Bundle org.eclipse.osgi:
> [exec] [eclipse.generateFeature] Another singleton version selected:
> org.eclipse.osgi_3.3.0.v20070530
> [exec] [eclipse.generateFeature] Bundle
> org.eclipse.swt.win32.win32.x86:
> [exec] [eclipse.generateFeature] Another singleton version selected:
> org.eclipse.swt.win32.win32.x86_3.3.0.v3346
> [exec] [eclipse.generateFeature] Bundle org.eclipse.swt:
> [exec] [eclipse.generateFeature] Another singleton version selected:
> org.eclipse.swt_3.3.0.v3346
> [exec] [eclipse.generateFeature] Unsatisfied import package
> org.mozilla.xpcom_0.0.0.
> [exec] [eclipse.generateFeature] Bundle org.eclipse.ui.ide:
> [exec] [eclipse.generateFeature] Another singleton version selected:
> org.eclipse.ui.ide_3.3.0.I20070620
> [exec] [eclipse.generateFeature] Bundle org.eclipse.ui.views:
> [exec] [eclipse.generateFeature] Another singleton version selected:
> org.eclipse.ui.views_3.2.100.I20070319-0010
> [exec] [eclipse.generateFeature] Bundle
> org.eclipse.ui.workbench.texteditor:
> [exec] [eclipse.generateFeature] Another singleton version selected:
> org.eclipse.ui.workbench.texteditor_3.3.0.v20070606-0010
> [exec] [eclipse.generateFeature] Bundle org.eclipse.ui.workbench:
> [exec] [eclipse.generateFeature] Another singleton version selected:
> org.eclipse.ui.workbench_3.3.0.I20070608-1100
> [exec] [eclipse.generateFeature] Bundle org.eclipse.ui:
> [exec] [eclipse.generateFeature] Another singleton version selected:
> org.eclipse.ui_3.3.0.I20070614-0800
> [exec] [eclipse.generateFeature] Bundle
> org.eclipse.update.configurator:
> [exec] [eclipse.generateFeature] Another singleton version selected:
> org.eclipse.update.configurator_3.2.100.v20070615
> [exec] [eclipse.generateFeature] Bundle org.eclipse.update.core:
> [exec] [eclipse.generateFeature] Another singleton version selected:
> org.eclipse.update.core_3.2.100.v20070615
> [exec] [eclipse.generateFeature] Bundle org.eclipse.update.ui:
> [exec] [eclipse.generateFeature] Another singleton version selected:
> org.eclipse.update.ui_3.2.100.v20070615
> [exec]
> [exec] generate:
> [exec]
> [exec] preGenerate:
> [exec]
> [exec] allElements:
> [exec]
> [exec] allElementsDelegator:
> [exec]
> [exec] init:
> [exec]
> [exec] generateScript:
> [exec] [eclipse.buildScript] Some inter-plug-in dependencies have not
> been satisfied.
> [exec] [eclipse.buildScript] Bundle com.ibm.icu:
> [exec] [eclipse.buildScript] Another singleton version selected:
> com.ibm.icu_3.6.1.v20070417
> [exec] [eclipse.buildScript] Bundle org.eclipse.ant.core:
> [exec] [eclipse.buildScript] Another singleton version selected:
> org.eclipse.ant.core_3.1.200.v20070522
> [exec] [eclipse.buildScript] Bundle org.eclipse.core.contenttype:
> [exec] [eclipse.buildScript] Another singleton version selected:
> org.eclipse.core.contenttype_3.2.100.v20070319
> [exec] [eclipse.buildScript] Bundle org.eclipse.core.expressions:
> [exec] [eclipse.buildScript] Another singleton version selected:
> org.eclipse.core.expressions_3.3.0.v20070606-0010
> [exec] [eclipse.buildScript] Bundle
> org.eclipse.core.filesystem.win32.x86:
> [exec] [eclipse.buildScript] Another singleton version selected:
> org.eclipse.core.filesystem.win32.x86_1.1.0.v20070510
> [exec] [eclipse.buildScript] Bundle org.eclipse.core.filesystem:
> [exec] [eclipse.buildScript] Another singleton version selected:
> org.eclipse.core.filesystem_1.1.0.v20070606
> [exec] [eclipse.buildScript] Bundle org.eclipse.core.jobs:
> [exec] [eclipse.buildScript] Another singleton version selected:
> org.eclipse.core.jobs_3.3.0.v20070423
> [exec] [eclipse.buildScript] Bundle org.eclipse.core.net:
> [exec] [eclipse.buildScript] Another singleton version selected:
> org.eclipse.core.net_1.0.0.I20070531
> [exec] [eclipse.buildScript] Bundle org.eclipse.core.resources.win32:
> [exec] [eclipse.buildScript] Another singleton version selected:
> org.eclipse.core.resources.win32_3.3.0.v20070226
> [exec] [eclipse.buildScript] Bundle org.eclipse.core.resources:
> [exec] [eclipse.buildScript] Another singleton version selected:
> org.eclipse.core.resources_3.3.0.v20070604
> [exec] [eclipse.buildScript] Bundle
> org.eclipse.core.runtime.compatibility:
> [exec] [eclipse.buildScript] Another singleton version selected:
> org.eclipse.core.runtime.compatibility_3.1.200.v20070502
> [exec] [eclipse.buildScript] Bundle org.eclipse.core.runtime:
> [exec] [eclipse.buildScript] Another singleton version selected:
> org.eclipse.core.runtime_3.3.100.v20070530
> [exec] [eclipse.buildScript] Bundle org.eclipse.core.variables:
> [exec] [eclipse.buildScript] Another singleton version selected:
> org.eclipse.core.variables_3.2.0.v20070426
> [exec] [eclipse.buildScript] Bundle org.eclipse.equinox.app:
> [exec] [eclipse.buildScript] Another singleton version selected:
> org.eclipse.equinox.app_1.0.0.v20070606
> [exec] [eclipse.buildScript] Bundle org.eclipse.equinox.common:
> [exec] [eclipse.buildScript] Another singleton version selected:
> org.eclipse.equinox.common_3.3.0.v20070426
> [exec] [eclipse.buildScript] Bundle
> org.eclipse.equinox.launcher.win32.win32.x86:
> [exec] [eclipse.buildScript] Another singleton version selected:
> org.eclipse.equinox.launcher.win32.win32.x86_1.0.0.v20070523
> [exec] [eclipse.buildScript] Bundle org.eclipse.equinox.preferences:
> [exec] [eclipse.buildScript] Another singleton version selected:
> org.eclipse.equinox.preferences_3.2.100.v20070522
> [exec] [eclipse.buildScript] Bundle org.eclipse.equinox.registry:
> [exec] [eclipse.buildScript] Another singleton version selected:
> org.eclipse.equinox.registry_3.3.0.v20070522
> [exec] [eclipse.buildScript] Bundle org.eclipse.gef:
> [exec] [eclipse.buildScript] Another singleton version selected:
> org.eclipse.gef_3.2.100.v20070620
> [exec] [eclipse.buildScript] Bundle org.eclipse.help:
> [exec] [eclipse.buildScript] Another singleton version selected:
> org.eclipse.help_3.3.0.v20070524
> [exec] [eclipse.buildScript] Bundle org.eclipse.osgi:
> [exec] [eclipse.buildScript] Another singleton version selected:
> org.eclipse.osgi_3.3.0.v20070530
> [exec] [eclipse.buildScript] Bundle org.eclipse.swt.win32.win32.x86:
> [exec] [eclipse.buildScript] Another singleton version selected:
> org.eclipse.swt.win32.win32.x86_3.3.0.v3346
> [exec] [eclipse.buildScript] Bundle org.eclipse.swt:
> [exec] [eclipse.buildScript] Another singleton version selected:
> org.eclipse.swt_3.3.0.v3346
> [exec] [eclipse.buildScript] Unsatisfied import package
> org.mozilla.xpcom_0.0.0.
> [exec] [eclipse.buildScript] Bundle org.eclipse.ui.ide:
> [exec] [eclipse.buildScript] Another singleton version selected:
> org.eclipse.ui.ide_3.3.0.I20070620
> [exec] [eclipse.buildScript] Bundle org.eclipse.ui.views:
> [exec] [eclipse.buildScript] Another singleton version selected:
> org.eclipse.ui.views_3.2.100.I20070319-0010
> [exec] [eclipse.buildScript] Bundle
> org.eclipse.ui.workbench.texteditor:
> [exec] [eclipse.buildScript] Another singleton version selected:
> org.eclipse.ui.workbench.texteditor_3.3.0.v20070606-0010
> [exec] [eclipse.buildScript] Bundle org.eclipse.ui.workbench:
> [exec] [eclipse.buildScript] Another singleton version selected:
> org.eclipse.ui.workbench_3.3.0.I20070608-1100
> [exec] [eclipse.buildScript] Bundle org.eclipse.ui:
> [exec] [eclipse.buildScript] Another singleton version selected:
> org.eclipse.ui_3.3.0.I20070614-0800
> [exec] [eclipse.buildScript] Bundle org.eclipse.update.configurator:
> [exec] [eclipse.buildScript] Another singleton version selected:
> org.eclipse.update.configurator_3.2.100.v20070615
> [exec] [eclipse.buildScript] Bundle org.eclipse.update.core:
> [exec] [eclipse.buildScript] Another singleton version selected:
> org.eclipse.update.core_3.2.100.v20070615
> [exec] [eclipse.buildScript] Bundle org.eclipse.update.ui:
> [exec] [eclipse.buildScript] Another singleton version selected:
> org.eclipse.update.ui_3.2.100.v20070615
> [exec]
> [exec] postGenerate:
> [exec]
> [exec] clean:
> [exec]
> [exec] allElements:
> [exec]
> [exec] allElementsDelegator:
> [exec]
> [exec] init:
> [exec]
> [exec] cleanElement:
> [exec] [echo]
> D:/_GA_svn/_g2_deploy_monitor_TI/tendril_client_build/build/ features/org.ecl
> ipse.pde.build.container.feature
> [exec]
> [exec] init:
> [exec]
> [exec] clean:
> [exec]
> [exec] init:
> [exec]
> [exec] all.features:
> [exec]
> [exec] all.plugins:
> [exec]
> [exec] update.feature:
> [exec]
> [exec] all.children:
> [exec]
> [exec] process:
> [exec]
> [exec] preProcess:
> [exec]
> [exec] allElements:
> [exec]
> [exec] allElementsDelegator:
> [exec]
> [exec] init:
> [exec]
> [exec] processElement:
> [exec]
> [exec] init:
> [exec]
> [exec] build.jars:
> [exec]
> [exec] init:
> [exec]
> [exec] all.features:
> [exec]
> [exec] all.plugins:
> [exec]
> [exec] update.feature:
> [exec]
> [exec] all.children:
> [exec]
> [exec] postProcess:
> [exec]
> [exec] assemble:
> [exec]
> [exec] preAssemble:
> [exec]
> [exec] allElements:
> [exec]
> [exec] allElementsDelegator:
> [exec]
> [exec] init:
> [exec]
> [exec] assembleElement:
> [exec]
> [exec] main:
> [exec]
> [exec]
> assemble.org.eclipse.pde.build.container.feature.win32.win32 .x86:
> [exec]
> [exec] main:
> [exec] [mkdir] Created dir:
> D:\_GA_svn\_g2_deploy_monitor_TI\tendril_client_build\build\ I.TestBuild
> [exec]
> [exec] init:
> [exec]
> [exec] gather.bin.parts:
> [exec]
> [exec] children:
> [exec]
> [exec] rootFileswin32_win32_x86:
> [exec] [copy] Copying 3 files to
> D:\_GA_svn\_g2_deploy_monitor_TI\tendril_client_build\build\ tmp\TendrilClien
> t\win32.win32.x86\TendrilClient
> [exec]
> [exec] BUILD FAILED
> [exec] C:\Program
> Files\eclipse\plugins\org.eclipse.pde.build_3.3.0.v20070612\ scripts\productB
> uild\productBuild.xml:29: The following error occurred while executing this
> line:
> [exec] C:\Program
> Files\eclipse\plugins\org.eclipse.pde.build_3.3.0.v20070612\ scripts\build.xm
> l:91: The following error occurred while executing this line:
> [exec] C:\Program
> Files\eclipse\plugins\org.eclipse.pde.build_3.3.0.v20070612\ templates\headle
> ss-build\customTargets.xml:10: The following error occurred while executing
> this line:
> [exec] C:\Program
> Files\eclipse\plugins\org.eclipse.pde.build_3.3.0.v20070612\ scripts\productB
> uild\allElements.xml:9: The following error occurred while executing this
> line:
> [exec] C:\Program
> Files\eclipse\plugins\org.eclipse.pde.build_3.3.0.v20070612\ scripts\genericT
> argets.xml:155: The following error occurred while executing this line:
> [exec]
> D:\_GA_svn\_g2_deploy_monitor_TI\tendril_client_build\build\ assemble.org.ecl
> ipse.pde.build.container.feature.all.xml:4: The following error occurred
> while executing this line:
> [exec] C:\Program
> Files\eclipse\plugins\org.eclipse.pde.build_3.3.0.v20070612\ scripts\productB
> uild\allElements.xml:28: The following error occurred while executing this
> line:
> [exec]
> D:\_GA_svn\_g2_deploy_monitor_TI\tendril_client_build\build\ assemble.org.ecl
> ipse.pde.build.container.feature.win32.win32.x86.xml:51:
> java.io.EOFException
> [exec]
> [exec] Total time: 9 seconds
> [exec] Result: 13
> [mkdir] Created dir:
> D:\_GA_svn\_g2_deploy_monitor_TI\tendril_client_build\tendri lplatform
> [unzip] Expanding:
> D:\_GA_svn\_g2_deploy_monitor_TI\tendril_client_build\build\ I.TestBuild\Test
> Build-win32.win32.x86.zip into
> D:\_GA_svn\_g2_deploy_monitor_TI\tendril_client_build\tendri lplatform
>
> BUILD FAILED
>
>
>
Hi,
includes your feature the feature org.eclipse.equinox.executable? It is
part of the RCP-delta-pack. A product build needs it to make the
branding stuff.
Karsten
Re: ant pdebuild fails [message #616586 is a reply to message #140863] Fri, 21 September 2007 10:54 Go to previous message
Andrew Niefer is currently offline Andrew Niefer
Messages: 990
Registered: July 2009
Senior Member
Karsten Panier wrote:
> Tendril schrieb:
>> Sirs,
>>
>> Could you explain why I'm seeing a java.io.EOFException in my pde build
>> (please see below)?

>>
> Hi,
> includes your feature the feature org.eclipse.equinox.executable? It is
> part of the RCP-delta-pack. A product build needs it to make the
> branding stuff.
> Karsten

Karsten is correct, get the RCP-delta-pack and put it in your baseLocation.
That should be enough to fix it since the productBuild will automatically
include the org.eclipse.equinox.executable for you if it can find it.

-Andrew
Re: ant pdebuild fails [message #616596 is a reply to message #140896] Sun, 23 September 2007 19:57 Go to previous message
Philippe Ombredanne is currently offline Philippe Ombredanne
Messages: 386
Registered: July 2009
Senior Member
> > Tendril schrieb:
> >> Sirs,
> >> Could you explain why I'm seeing a java.io.EOFException in my pde build
> >> (please see below)?
Hi Tendril:
Are you building an RCP that includes VE?
If yes that is great. Could you elaborate on it?
Cordially
Philippe
Previous Topic:Anybody is extending VE to create their own IDE?
Next Topic:How I can get Propertis ' name from java Class, we need your help!
Goto Forum:
  


Current Time: Sat Aug 30 06:41:09 EDT 2014

Powered by FUDForum. Page generated in 0.02098 seconds