Eclipse Community Forums
Forum Search:

Search      Help    Register    Login    Home
Home » Modeling » GMT (Generative Modeling Technologies) » [TCD]:BUILD FAILED.
[TCD]:BUILD FAILED. [message #379919] Tue, 09 October 2007 16:18
Eclipse User
Originally posted by: youssedek.gmail.com

Hi,
I tested the Program project, but I found this problem
how to solve this problem????

thnx
Youssef

Grammar2Jar:

BUILD FAILED
/home/ydkiouak/Desktop/eclipse/AMMAScripts/build.dsl.xml:56: The following
error occurred while executing this line:
/home/ydkiouak/Desktop/eclipse/AMMAScripts/build.dsl.xml:83: The following
error occurred while executing this line:
/home/ydkiouak/Desktop/eclipse/AMMAScripts/build.syntax.xml: 81: The
following error occurred while executing this line:
/home/ydkiouak/Desktop/eclipse/AMMAScripts/build.syntax.xml: 198: Problem:
failed to create task or type antlib:org/apache/tools/ant/antlr:antlr3
Cause: The name is undefined.
Action: Check the spelling.
Action: Check that any custom tasks/types have been declared.
Action: Check that any <presetdef>/<macrodef> declarations have taken
place.

This appears to be an antlib declaration.
Action: Check that the implementing library exists in one of:

-/home/ydkiouak/Desktop/eclipse/plugins/org.apache.ant_1.7.0 .v200706080842/lib
-/home/ydkiouak/.ant/lib
-a directory added on the command line with the -lib argument

Total time: 1 minute 4 seconds
Previous Topic:[AM3][Announce] J2SE5 metamodel now available
Next Topic:[TCD]:BUILD FAILED.
Goto Forum:
  


Current Time: Mon Jul 28 08:21:17 EDT 2014

Powered by FUDForum. Page generated in 0.01533 seconds